{"text_format":"1","workbook":"xlsx","n_sheets":13,"sheets":["PORTADA","TERCEROS","CUENTAS CONTABLES","CENTRO DE COSTOS","REGISTRO","ACTIVOS","Libro Diario","BALANCE DE PRUEBA UNITARIO","BALANCE DE PRUEBA CONSOLIDADO","Control de Cambios","P Y G PLANTACIONES BAAF","PYG (2)","REPORTES"],"not_rendered":{"charts":0,"images":5,"macros":1,"external_links":0,"defined_names":27,"comments":0,"pivot_tables":0},"unopened":[],"bounds":{"document_bytes":16777216,"sheet_cells":100000,"rows_first":2000,"rows_last":500,"rows_between":2000,"halvings":0,"cell_chars":16384,"cell_head_chars":4096},"cells_cut":0,"cells_raw":0,"read":"whole","date_system":"1900"}

{"sheet":"PORTADA","index":0,"n_rows":7,"n_cols":3,"rows_kept":7,"cut":false,"hidden":false,"merged":[[6,0,20,2],[0,0,5,0],[0,1,1,1],[0,2,1,2],[2,1,3,1],[2,2,3,2],[4,1,5,1]]}
[null,"Anexo Instructivo para la identificación y clasificación de contratos con objeto asociado al desarrollo de Plantaciones a cargo del equipo BAAF y de los bienes administrados por el FRV según su vocación reparadora","Código:750,15,05-16"]
[]
[null,"PROCESO GESTION FINANCIERA Y CONTABLE","Versión:01"]
[]
[null,"PROCEDIMIENTO FINANCIERO","Fecha: 31/03/2021"]
[null,null,"Paginas:01"]
["Matríz para el control de los Centros de Costos de  las plantaciones y bienes con actividades  agropecuarias y forestales administrados por el Fondo para la Reparación a las Víctimas con Vocación Reparadora."]

{"sheet":"TERCEROS","index":1,"n_rows":1,"n_cols":6,"rows_kept":1,"cut":false,"hidden":false,"merged":[]}
["CONTRATO","NIT","RP","NOMBRE","VALOR CONTRATO","OBJETO"]

{"sheet":"CUENTAS CONTABLES","index":2,"n_rows":4521,"n_cols":7,"rows_kept":4521,"cut":false,"hidden":false,"merged":[]}
["Columna1","AUXILIAR","CUENTA",null,"CONCEPTO","DEBITO","CREDITO"]
[{"$f":"LEN(PUC[[#This Row],[AUXILIAR]])","v":1},1,"ACTIVO ",null,"Avaluo Comercial",513015,250505]
[{"$f":"LEN(PUC[[#This Row],[AUXILIAR]])","v":2},11,"DISPONIBLE ",null,"Combustibles y lubricantes",519535,250505]
[{"$f":"LEN(PUC[[#This Row],[AUXILIAR]])","v":4},1105,"CAJA ",null,"Comisiones",519505,250505]
[{"$f":"LEN(PUC[[#This Row],[AUXILIAR]])","v":6},110505,"CAJA GENERAL ",null,"Compra de papeleria",519530,250505]
[{"$f":"LEN(PUC[[#This Row],[AUXILIAR]])","v":6},110510,"CAJAS MENORES ",null,"Dotacion",510551,250505]
[{"$f":"LEN(PUC[[#This Row],[AUXILIAR]])","v":6},110515,"MONEDA EXTRANJERA ",null,"Equipo de computación",158815,250505]
[{"$f":"LEN(PUC[[#This Row],[AUXILIAR]])","v":4},1110,"BANCOS ",null,"Herramientas y equipos",152000,250505]
[{"$f":"LEN(PUC[[#This Row],[AUXILIAR]])","v":6},111005,"MONEDA NACIONAL ",null,"Kits de seguridad personal y familiar",510584,250505]
[{"$f":"LEN(PUC[[#This Row],[AUXILIAR]])","v":6},111010,"MONEDA EXTRANJERA ",null,"Mantenimiento de PPyE",514515,250505]
[{"$f":"LEN(PUC[[#This Row],[AUXILIAR]])","v":4},1115,"REMESAS EN TRANSITO ",null,"Nomina",510506,250505]
[{"$f":"LEN(PUC[[#This Row],[AUXILIAR]])","v":6},111505,"MONEDA NACIONAL ",null,"Pago Exámenes Médicos de Ingreso Personal",510584,250505]
[{"$f":"LEN(PUC[[#This Row],[AUXILIAR]])","v":6},111510,"MONEDA EXTRANJERA ",null,"Pago Final Implementación del SGSST",513595,250505]
[{"$f":"LEN(PUC[[#This Row],[AUXILIAR]])","v":4},1120,"CUENTAS DE AHORRO ",null,"Seguros",510554,250505]
[{"$f":"LEN(PUC[[#This Row],[AUXILIAR]])","v":6},112005,"BANCOS ",null,"Servicio de Vigilancia",519005,250505]
[{"$f":"LEN(PUC[[#This Row],[AUXILIAR]])","v":6},112010,"CORPORACIONES DE AHORRO Y VIVIENDA ",null,"Servicios agrícolas y ganaderos",610570,250505]
[{"$f":"LEN(PUC[[#This Row],[AUXILIAR]])","v":6},112015,"ORGANISMOS COOPERATIVOS FINANCIEROS ",null,"Transporte",519040,250505]
[{"$f":"LEN(PUC[[#This Row],[AUXILIAR]])","v":4},1125,"FONDOS ",null,"Viáticos",512080,250505]
[{"$f":"LEN(PUC[[#This Row],[AUXILIAR]])","v":6},112505,"ROTATORIOS MONEDA NACIONAL ",null,"Servicios de comercialización",523595,250505]
[{"$f":"LEN(PUC[[#This Row],[AUXILIAR]])","v":6},112510,"ROTATORIOS MONEDA EXTRANJERA ",null,"Interventoría",511035,250505]
[{"$f":"LEN(PUC[[#This Row],[AUXILIAR]])","v":6},112515,"ESPECIALES MONEDA NACIONAL ",null,"Activos Biológicos",158405,250505]
[{"$f":"LEN(PUC[[#This Row],[AUXILIAR]])","v":6},112520,"ESPECIALES MONEDA EXTRANJERA ",null,"Ingresos Agrícolas",130505,410545]
[{"$f":"LEN(PUC[[#This Row],[AUXILIAR]])","v":6},112525,"DE AMORTIZACION MONEDA NACIONAL ",null,"Agroinsumos",143015,250505]
[{"$f":"LEN(PUC[[#This Row],[AUXILIAR]])","v":6},112530,"DE AMORTIZACION MONEDA EXTRANJERA ",null,"Bodegas portátiles",151680,250505]
[{"$f":"LEN(PUC[[#This Row],[AUXILIAR]])","v":2},12,"INVERSIONES "]
[{"$f":"LEN(PUC[[#This Row],[AUXILIAR]])","v":4},1205,"ACCIONES "]
[{"$f":"LEN(PUC[[#This Row],[AUXILIAR]])","v":6},120505,"AGRICULTURA, GANADERIA, CAZA Y SILVICULTURA "]
[{"$f":"LEN(PUC[[#This Row],[AUXILIAR]])","v":6},120510,"PESCA "]
[{"$f":"LEN(PUC[[#This Row],[AUXILIAR]])","v":6},120515,"EXPLOTACION DE MINAS Y CANTERAS "]
[{"$f":"LEN(PUC[[#This Row],[AUXILIAR]])","v":6},120520,"INDUSTRIA MANUFACTURERA "]
[{"$f":"LEN(PUC[[#This Row],[AUXILIAR]])","v":6},120525,"SUMINISTRO DE ELECTRICIDAD, GAS Y AGUA "]
[{"$f":"LEN(PUC[[#This Row],[AUXILIAR]])","v":6},120530,"CONSTRUCCION "]
[{"$f":"LEN(PUC[[#This Row],[AUXILIAR]])","v":6},120535,"COMERCIO AL POR MAYOR Y AL POR MENOR "]
[{"$f":"LEN(PUC[[#This Row],[AUXILIAR]])","v":6},120540,"HOTELES Y RESTAURANTES "]
[{"$f":"LEN(PUC[[#This Row],[AUXILIAR]])","v":6},120545,"TRANSPORTE, ALMACENAMIENTO Y COMUNICACIONES "]
[{"$f":"LEN(PUC[[#This Row],[AUXILIAR]])","v":6},120550,"ACTIVIDAD FINANCIERA "]
[{"$f":"LEN(PUC[[#This Row],[AUXILIAR]])","v":6},120555,"ACTIVIDADES INMOBILIARIAS, EMPRESARIALES Y DE ALQUILER "]
[{"$f":"LEN(PUC[[#This Row],[AUXILIAR]])","v":6},120560,"ENSEÑANZA "]
[{"$f":"LEN(PUC[[#This Row],[AUXILIAR]])","v":6},120565,"SERVICIOS SOCIALES Y DE SALUD "]
[{"$f":"LEN(PUC[[#This Row],[AUXILIAR]])","v":6},120570,"OTRAS ACTIVIDADES DE SERVICIOS COMUNITARIOS, SOCIALES Y PERSONALES "]
[{"$f":"LEN(PUC[[#This Row],[AUXILIAR]])","v":6},120599,"AJUSTES POR INFLACION "]
[{"$f":"LEN(PUC[[#This Row],[AUXILIAR]])","v":4},1210,"CUOTAS O PARTES DE INTERES SOCIAL "]
[{"$f":"LEN(PUC[[#This Row],[AUXILIAR]])","v":6},121005,"AGRICULTURA, GANADERIA, CAZA Y SILVICULTURA "]
[{"$f":"LEN(PUC[[#This Row],[AUXILIAR]])","v":6},121010,"PESCA "]
[{"$f":"LEN(PUC[[#This Row],[AUXILIAR]])","v":6},121015,"EXPLOTACION DE MINAS Y CANTERAS "]
[{"$f":"LEN(PUC[[#This Row],[AUXILIAR]])","v":6},121020,"INDUSTRIA MANUFACTURERA "]
[{"$f":"LEN(PUC[[#This Row],[AUXILIAR]])","v":6},121025,"SUMINISTRO DE ELECTRICIDAD, GAS Y AGUA "]
[{"$f":"LEN(PUC[[#This Row],[AUXILIAR]])","v":6},121030,"CONSTRUCCION "]
[{"$f":"LEN(PUC[[#This Row],[AUXILIAR]])","v":6},121035,"COMERCIO AL POR MAYOR Y AL POR MENOR "]
[{"$f":"LEN(PUC[[#This Row],[AUXILIAR]])","v":6},121040,"HOTELES Y RESTAURANTES "]
[{"$f":"LEN(PUC[[#This Row],[AUXILIAR]])","v":6},121045,"TRANSPORTE, ALMACENAMIENTO Y COMUNICACIONES "]
[{"$f":"LEN(PUC[[#This Row],[AUXILIAR]])","v":6},121050,"ACTIVIDAD FINANCIERA "]
[{"$f":"LEN(PUC[[#This Row],[AUXILIAR]])","v":6},121055,"ACTIVIDADES INMOBILIARIAS, EMPRESARIALES Y DE ALQUILER "]
[{"$f":"LEN(PUC[[#This Row],[AUXILIAR]])","v":6},121060,"ENSEÑANZA "]
[{"$f":"LEN(PUC[[#This Row],[AUXILIAR]])","v":6},121065,"SERVICIOS SOCIALES Y DE SALUD "]
[{"$f":"LEN(PUC[[#This Row],[AUXILIAR]])","v":6},121070,"OTRAS ACTIVIDADES DE SERVICIOS COMUNITARIOS, SOCIALES Y PERSONALES "]
[{"$f":"LEN(PUC[[#This Row],[AUXILIAR]])","v":6},121099,"AJUSTES POR INFLACION "]
[{"$f":"LEN(PUC[[#This Row],[AUXILIAR]])","v":4},1215,"BONOS "]
[{"$f":"LEN(PUC[[#This Row],[AUXILIAR]])","v":6},121505,"BONOS PUBLICOS MONEDA NACIONAL "]
[{"$f":"LEN(PUC[[#This Row],[AUXILIAR]])","v":6},121510,"BONOS PUBLICOS MONEDA EXTRANJERA "]
[{"$f":"LEN(PUC[[#This Row],[AUXILIAR]])","v":6},121515,"BONOS ORDINARIOS "]
[{"$f":"LEN(PUC[[#This Row],[AUXILIAR]])","v":6},121520,"BONOS CONVERTIBLES EN ACCIONES "]
[{"$f":"LEN(PUC[[#This Row],[AUXILIAR]])","v":6},121595,"OTROS "]
[{"$f":"LEN(PUC[[#This Row],[AUXILIAR]])","v":4},1220,"CEDULAS "]
[{"$f":"LEN(PUC[[#This Row],[AUXILIAR]])","v":6},122005,"CEDULAS DE CAPITALIZACION "]
[{"$f":"LEN(PUC[[#This Row],[AUXILIAR]])","v":6},122010,"CEDULAS HIPOTECARIAS "]
[{"$f":"LEN(PUC[[#This Row],[AUXILIAR]])","v":6},122015,"CEDULAS DE INVERSION "]
[{"$f":"LEN(PUC[[#This Row],[AUXILIAR]])","v":6},122095,"OTRAS "]
[{"$f":"LEN(PUC[[#This Row],[AUXILIAR]])","v":4},1225,"CERTIFICADOS "]
[{"$f":"LEN(PUC[[#This Row],[AUXILIAR]])","v":6},122505,"CERTIFICADOS DE DEPOSITO A TERMINO (C.D.T.) "]
[{"$f":"LEN(PUC[[#This Row],[AUXILIAR]])","v":6},122510,"CERTIFICADOS DE DEPOSITO DE AHORRO "]
[{"$f":"LEN(PUC[[#This Row],[AUXILIAR]])","v":6},122515,"CERTIFICADOS DE AHORRO DE VALOR CONSTANTE (C.A.V.C.) "]
[{"$f":"LEN(PUC[[#This Row],[AUXILIAR]])","v":6},122520,"CERTIFICADOS DE CAMBIO "]
[{"$f":"LEN(PUC[[#This Row],[AUXILIAR]])","v":6},122525,"CERTIFICADOS CAFETEROS VALORIZABLES "]
[{"$f":"LEN(PUC[[#This Row],[AUXILIAR]])","v":6},122530,"CERTIFICADOS ELECTRICOS VALORIZABLES (C.E.V.) "]
[{"$f":"LEN(PUC[[#This Row],[AUXILIAR]])","v":6},122535,"CERTIFICADOS DE REEMBOLSO TRIBUTARIO (C.E.R.T.) "]
[{"$f":"LEN(PUC[[#This Row],[AUXILIAR]])","v":6},122540,"CERTIFICADOS DE DESARROLLO TURISTICO "]
[{"$f":"LEN(PUC[[#This Row],[AUXILIAR]])","v":6},122545,"CERTIFICADOS DE INVERSION FORESTAL (C.I.F.) "]
[{"$f":"LEN(PUC[[#This Row],[AUXILIAR]])","v":6},122595,"OTROS "]
[{"$f":"LEN(PUC[[#This Row],[AUXILIAR]])","v":4},1230,"PAPELES COMERCIALES "]
[{"$f":"LEN(PUC[[#This Row],[AUXILIAR]])","v":6},123005,"EMPRESAS COMERCIALES "]
[{"$f":"LEN(PUC[[#This Row],[AUXILIAR]])","v":6},123010,"EMPRESAS INDUSTRIALES "]
[{"$f":"LEN(PUC[[#This Row],[AUXILIAR]])","v":6},123015,"EMPRESAS DE SERVICIOS "]
[{"$f":"LEN(PUC[[#This Row],[AUXILIAR]])","v":4},1235,"TITULOS "]
[{"$f":"LEN(PUC[[#This Row],[AUXILIAR]])","v":6},123505,"TITULOS DE DESARROLLO AGROPECUARIO "]
[{"$f":"LEN(PUC[[#This Row],[AUXILIAR]])","v":6},123510,"TITULOS CANJEABLES POR CERTIFICADOS DE CAMBIO "]
[{"$f":"LEN(PUC[[#This Row],[AUXILIAR]])","v":6},123515,"TITULOS DE TESORERIA (T.E.S.) "]
[{"$f":"LEN(PUC[[#This Row],[AUXILIAR]])","v":6},123520,"TITULOS DE PARTICIPACION "]
[{"$f":"LEN(PUC[[#This Row],[AUXILIAR]])","v":6},123525,"TITULOS DE CREDITO DE FOMENTO "]
[{"$f":"LEN(PUC[[#This Row],[AUXILIAR]])","v":6},123530,"TITULOS FINANCIEROS AGROINDUSTRIALES (T.F.A.) "]
[{"$f":"LEN(PUC[[#This Row],[AUXILIAR]])","v":6},123535,"TITULOS DE AHORRO CAFETERO (T.A.C.) "]
[{"$f":"LEN(PUC[[#This Row],[AUXILIAR]])","v":6},123540,"TITULOS DE AHORRO NACIONAL (T.A.N.) "]
[{"$f":"LEN(PUC[[#This Row],[AUXILIAR]])","v":6},123545,"TITULOS ENERGETICOS DE RENTABILIDAD CRECIENTE (T.E.R.) "]
[{"$f":"LEN(PUC[[#This Row],[AUXILIAR]])","v":6},123550,"TITULOS DE AHORRO EDUCATIVO (T.A.E.) "]
[{"$f":"LEN(PUC[[#This Row],[AUXILIAR]])","v":6},123555,"TITULOS FINANCIEROS INDUSTRIALES Y COMERCIALES "]
[{"$f":"LEN(PUC[[#This Row],[AUXILIAR]])","v":6},123560,"TESOROS "]
[{"$f":"LEN(PUC[[#This Row],[AUXILIAR]])","v":6},123565,"TITULOS DE DEVOLUCION DE IMPUESTOS NACIONALES (TIDIS) "]
[{"$f":"LEN(PUC[[#This Row],[AUXILIAR]])","v":6},123570,"TITULOS INMOBILIARIOS "]
[{"$f":"LEN(PUC[[#This Row],[AUXILIAR]])","v":6},123595,"OTROS "]
[{"$f":"LEN(PUC[[#This Row],[AUXILIAR]])","v":4},1240,"ACEPTACIONES BANCARIAS O FINANCIERAS "]
[{"$f":"LEN(PUC[[#This Row],[AUXILIAR]])","v":6},124005,"BANCOS COMERCIALES "]
[{"$f":"LEN(PUC[[#This Row],[AUXILIAR]])","v":6},124010,"COMPAÑIAS DE FINANCIAMIENTO COMERCIAL "]
[{"$f":"LEN(PUC[[#This Row],[AUXILIAR]])","v":6},124015,"CORPORACIONES FINANCIERAS "]
[{"$f":"LEN(PUC[[#This Row],[AUXILIAR]])","v":6},124095,"OTRAS "]
[{"$f":"LEN(PUC[[#This Row],[AUXILIAR]])","v":4},1245,"DERECHOS FIDUCIARIOS "]
[{"$f":"LEN(PUC[[#This Row],[AUXILIAR]])","v":6},124505,"FIDEICOMISOS DE INVERSION MONEDA NACIONAL "]
[{"$f":"LEN(PUC[[#This Row],[AUXILIAR]])","v":6},124510,"FIDEICOMISOS DE INVERSION MONEDA EXTRANJERA "]
[{"$f":"LEN(PUC[[#This Row],[AUXILIAR]])","v":4},1250,"DERECHOS DE RECOMPRA DE INVERSIONES NEGOCIADAS (REPOS) "]
[{"$f":"LEN(PUC[[#This Row],[AUXILIAR]])","v":6},125005,"ACCIONES "]
[{"$f":"LEN(PUC[[#This Row],[AUXILIAR]])","v":6},125010,"CUOTAS O PARTES DE INTERES SOCIAL "]
[{"$f":"LEN(PUC[[#This Row],[AUXILIAR]])","v":6},125015,"BONOS "]
[{"$f":"LEN(PUC[[#This Row],[AUXILIAR]])","v":6},125020,"CEDULAS "]
[{"$f":"LEN(PUC[[#This Row],[AUXILIAR]])","v":6},125025,"CERTIFICADOS "]
[{"$f":"LEN(PUC[[#This Row],[AUXILIAR]])","v":6},125030,"PAPELES COMERCIALES "]
[{"$f":"LEN(PUC[[#This Row],[AUXILIAR]])","v":6},125035,"TITULOS "]
[{"$f":"LEN(PUC[[#This Row],[AUXILIAR]])","v":6},125040,"ACEPTACIONES BANCARIAS O FINANCIERAS 125095 OTROS "]
[{"$f":"LEN(PUC[[#This Row],[AUXILIAR]])","v":6},125099,"AJUSTES POR INFLACION "]
[{"$f":"LEN(PUC[[#This Row],[AUXILIAR]])","v":4},1255,"OBLIGATORIAS "]
[{"$f":"LEN(PUC[[#This Row],[AUXILIAR]])","v":6},125505,"BONOS DE FINANCIAMIENTO ESPECIAL "]
[{"$f":"LEN(PUC[[#This Row],[AUXILIAR]])","v":6},125510,"BONOS DE FINANCIAMIENTO PRESUPUESTAL "]
[{"$f":"LEN(PUC[[#This Row],[AUXILIAR]])","v":6},125515,"BONOS PARA DESARROLLO SOCIAL Y SEGURIDAD INTERNA (B.D.S.I.) "]
[{"$f":"LEN(PUC[[#This Row],[AUXILIAR]])","v":6},125595,"OTRAS "]
[{"$f":"LEN(PUC[[#This Row],[AUXILIAR]])","v":4},1260,"CUENTAS EN PARTICIPACION "]
[{"$f":"LEN(PUC[[#This Row],[AUXILIAR]])","v":6},126099,"AJUSTES POR INFLACION "]
[{"$f":"LEN(PUC[[#This Row],[AUXILIAR]])","v":4},1295,"OTRAS INVERSIONES "]
[{"$f":"LEN(PUC[[#This Row],[AUXILIAR]])","v":6},129505,"APORTES EN COOPERATIVAS "]
[{"$f":"LEN(PUC[[#This Row],[AUXILIAR]])","v":6},129510,"DERECHOS EN CLUBES SOCIALES "]
[{"$f":"LEN(PUC[[#This Row],[AUXILIAR]])","v":6},129515,"ACCIONES O DERECHOS EN CLUBES DEPORTIVOS "]
[{"$f":"LEN(PUC[[#This Row],[AUXILIAR]])","v":6},129520,"BONOS EN COLEGIOS "]
[{"$f":"LEN(PUC[[#This Row],[AUXILIAR]])","v":6},129595,"DIVERSAS "]
[{"$f":"LEN(PUC[[#This Row],[AUXILIAR]])","v":6},129599,"AJUSTES POR INFLACION "]
[{"$f":"LEN(PUC[[#This Row],[AUXILIAR]])","v":4},1299,"PROVISIONES "]
[{"$f":"LEN(PUC[[#This Row],[AUXILIAR]])","v":6},129905,"ACCIONES "]
[{"$f":"LEN(PUC[[#This Row],[AUXILIAR]])","v":6},129910,"CUOTAS O PARTES DE INTERES SOCIAL "]
[{"$f":"LEN(PUC[[#This Row],[AUXILIAR]])","v":6},129915,"BONOS "]
[{"$f":"LEN(PUC[[#This Row],[AUXILIAR]])","v":6},129920,"CEDULAS "]
[{"$f":"LEN(PUC[[#This Row],[AUXILIAR]])","v":6},129925,"CERTIFICADOS "]
[{"$f":"LEN(PUC[[#This Row],[AUXILIAR]])","v":6},129930,"PAPELES COMERCIALES "]
[{"$f":"LEN(PUC[[#This Row],[AUXILIAR]])","v":6},129935,"TITULOS "]
[{"$f":"LEN(PUC[[#This Row],[AUXILIAR]])","v":6},129940,"ACEPTACIONES BANCARIAS O FINANCIERAS "]
[{"$f":"LEN(PUC[[#This Row],[AUXILIAR]])","v":6},129945,"DERECHOS FIDUCIARIOS "]
[{"$f":"LEN(PUC[[#This Row],[AUXILIAR]])","v":6},129950,"DERECHOS DE RECOMPRA DE INVERSIONES NEGOCIADAS "]
[{"$f":"LEN(PUC[[#This Row],[AUXILIAR]])","v":6},129955,"OBLIGATORIAS "]
[{"$f":"LEN(PUC[[#This Row],[AUXILIAR]])","v":6},129960,"CUENTAS EN PARTICIPACION "]
[{"$f":"LEN(PUC[[#This Row],[AUXILIAR]])","v":6},129995,"OTRAS INVERSIONES "]
[{"$f":"LEN(PUC[[#This Row],[AUXILIAR]])","v":2},13,"DEUDORES "]
[{"$f":"LEN(PUC[[#This Row],[AUXILIAR]])","v":4},1305,"CLIENTES "]
[{"$f":"LEN(PUC[[#This Row],[AUXILIAR]])","v":6},130505,"NACIONALES "]
[{"$f":"LEN(PUC[[#This Row],[AUXILIAR]])","v":6},130510,"DEL EXTERIOR "]
[{"$f":"LEN(PUC[[#This Row],[AUXILIAR]])","v":6},130515,"DEUDORES DEL SISTEMA "]
[{"$f":"LEN(PUC[[#This Row],[AUXILIAR]])","v":4},1310,"CUENTAS CORRIENTES COMERCIALES "]
[{"$f":"LEN(PUC[[#This Row],[AUXILIAR]])","v":6},131005,"CASA MATRIZ "]
[{"$f":"LEN(PUC[[#This Row],[AUXILIAR]])","v":6},131010,"COMPAÑIAS VINCULADAS "]
[{"$f":"LEN(PUC[[#This Row],[AUXILIAR]])","v":6},131015,"ACCIONISTAS O SOCIOS "]
[{"$f":"LEN(PUC[[#This Row],[AUXILIAR]])","v":6},131020,"PARTICULARES "]
[{"$f":"LEN(PUC[[#This Row],[AUXILIAR]])","v":6},131095,"OTRAS "]
[{"$f":"LEN(PUC[[#This Row],[AUXILIAR]])","v":4},1315,"CUENTAS POR COBRAR A CASA MATRIZ "]
[{"$f":"LEN(PUC[[#This Row],[AUXILIAR]])","v":6},131505,"VENTAS "]
[{"$f":"LEN(PUC[[#This Row],[AUXILIAR]])","v":6},131510,"PAGOS A NOMBRE DE CASA MATRIZ "]
[{"$f":"LEN(PUC[[#This Row],[AUXILIAR]])","v":6},131515,"VALORES RECIBIDOS POR CASA MATRIZ "]
[{"$f":"LEN(PUC[[#This Row],[AUXILIAR]])","v":6},131520,"PRESTAMOS "]
[{"$f":"LEN(PUC[[#This Row],[AUXILIAR]])","v":4},1320,"CUENTAS POR COBRAR A VINCULADOS ECONOMICOS "]
[{"$f":"LEN(PUC[[#This Row],[AUXILIAR]])","v":6},132005,"FILIALES "]
[{"$f":"LEN(PUC[[#This Row],[AUXILIAR]])","v":6},132010,"SUBSIDIARIAS "]
[{"$f":"LEN(PUC[[#This Row],[AUXILIAR]])","v":6},132015,"SUCURSALES "]
[{"$f":"LEN(PUC[[#This Row],[AUXILIAR]])","v":4},1325,"CUENTA S POR COBRAR A SOCIOS Y ACCIONISTAS "]
[{"$f":"LEN(PUC[[#This Row],[AUXILIAR]])","v":6},132505,"A SOCIOS "]
[{"$f":"LEN(PUC[[#This Row],[AUXILIAR]])","v":6},132510,"A ACCIONISTAS "]
[{"$f":"LEN(PUC[[#This Row],[AUXILIAR]])","v":4},1328,"APORTES POR COBRAR "]
[{"$f":"LEN(PUC[[#This Row],[AUXILIAR]])","v":4},1330,"ANTICIPOS Y AVANCES "]
[{"$f":"LEN(PUC[[#This Row],[AUXILIAR]])","v":6},133005,"A PROVEEDORES "]
[{"$f":"LEN(PUC[[#This Row],[AUXILIAR]])","v":6},133010,"A CONTRATISTAS "]
[{"$f":"LEN(PUC[[#This Row],[AUXILIAR]])","v":6},133015,"A TRABAJADORES "]
[{"$f":"LEN(PUC[[#This Row],[AUXILIAR]])","v":6},133020,"A AGENTES "]
[{"$f":"LEN(PUC[[#This Row],[AUXILIAR]])","v":6},133025,"A CONCESIONARIOS "]
[{"$f":"LEN(PUC[[#This Row],[AUXILIAR]])","v":6},133030,"DE ADJUDICACIONES "]
[{"$f":"LEN(PUC[[#This Row],[AUXILIAR]])","v":6},133095,"OTROS "]
[{"$f":"LEN(PUC[[#This Row],[AUXILIAR]])","v":4},1332,"CUENTAS DE OPERACION CONJUNTA "]
[{"$f":"LEN(PUC[[#This Row],[AUXILIAR]])","v":4},1335,"DEPOSITOS "]
[{"$f":"LEN(PUC[[#This Row],[AUXILIAR]])","v":6},133505,"PARA IMPORTACIONES "]
[{"$f":"LEN(PUC[[#This Row],[AUXILIAR]])","v":6},133510,"PARA SERVICIOS "]
[{"$f":"LEN(PUC[[#This Row],[AUXILIAR]])","v":6},133515,"PARA CONTRATOS "]
[{"$f":"LEN(PUC[[#This Row],[AUXILIAR]])","v":6},133520,"PARA RESPONSABILIDADES "]
[{"$f":"LEN(PUC[[#This Row],[AUXILIAR]])","v":6},133525,"PARA JUICIOS EJECUTIVOS "]
[{"$f":"LEN(PUC[[#This Row],[AUXILIAR]])","v":6},133530,"PARA ADQUISICION DE ACCIONES, CUOTAS O DERECHOS SOCIALES "]
[{"$f":"LEN(PUC[[#This Row],[AUXILIAR]])","v":6},133535,"EN GARANTIA "]
[{"$f":"LEN(PUC[[#This Row],[AUXILIAR]])","v":6},133595,"OTROS "]
[{"$f":"LEN(PUC[[#This Row],[AUXILIAR]])","v":4},1340,"PROMESAS DE COMPRA VENTA "]
[{"$f":"LEN(PUC[[#This Row],[AUXILIAR]])","v":6},134005,"DE BIENES RAICES "]
[{"$f":"LEN(PUC[[#This Row],[AUXILIAR]])","v":6},134010,"DE MAQUINARIA Y EQUIPO "]
[{"$f":"LEN(PUC[[#This Row],[AUXILIAR]])","v":6},134015,"DE FLOTA Y EQUIPO DE TRANSPORTE "]
[{"$f":"LEN(PUC[[#This Row],[AUXILIAR]])","v":6},134020,"DE FLOTA Y EQUIPO AEREO "]
[{"$f":"LEN(PUC[[#This Row],[AUXILIAR]])","v":6},134025,"DE FLOTA Y EQUIPO FERREO "]
[{"$f":"LEN(PUC[[#This Row],[AUXILIAR]])","v":6},134030,"DE FLOTA Y EQUIPO FLUVIAL Y/O MARITIMO "]
[{"$f":"LEN(PUC[[#This Row],[AUXILIAR]])","v":6},134035,"DE SEMOVIENTES "]
[{"$f":"LEN(PUC[[#This Row],[AUXILIAR]])","v":6},134095,"DE OTROS BIENES "]
[{"$f":"LEN(PUC[[#This Row],[AUXILIAR]])","v":4},1345,"INGRESOS POR COBRAR "]
[{"$f":"LEN(PUC[[#This Row],[AUXILIAR]])","v":6},134505,"DIVIDENDOS Y/O PARTICIPACIONES "]
[{"$f":"LEN(PUC[[#This Row],[AUXILIAR]])","v":6},134510,"INTERESES "]
[{"$f":"LEN(PUC[[#This Row],[AUXILIAR]])","v":6},134515,"COMISIONES "]
[{"$f":"LEN(PUC[[#This Row],[AUXILIAR]])","v":6},134520,"HONORARIOS "]
[{"$f":"LEN(PUC[[#This Row],[AUXILIAR]])","v":6},134525,"SERVICIOS "]
[{"$f":"LEN(PUC[[#This Row],[AUXILIAR]])","v":6},134530,"ARRENDAMIENTOS "]
[{"$f":"LEN(PUC[[#This Row],[AUXILIAR]])","v":6},134535,"CERT POR COBRAR "]
[{"$f":"LEN(PUC[[#This Row],[AUXILIAR]])","v":6},134595,"OTROS "]
[{"$f":"LEN(PUC[[#This Row],[AUXILIAR]])","v":4},1350,"RETENCION SOBRE CONTRATOS "]
[{"$f":"LEN(PUC[[#This Row],[AUXILIAR]])","v":6},135005,"DE CONSTRUCCION "]
[{"$f":"LEN(PUC[[#This Row],[AUXILIAR]])","v":6},135010,"DE PRESTACION DE SERVICIOS "]
[{"$f":"LEN(PUC[[#This Row],[AUXILIAR]])","v":6},135095,"OTROS "]
[{"$f":"LEN(PUC[[#This Row],[AUXILIAR]])","v":4},1355,"ANTICIPO DE IMPUESTOS Y CONTRIBUCIONES O SALDOS A FAVOR "]
[{"$f":"LEN(PUC[[#This Row],[AUXILIAR]])","v":6},135505,"ANTICIPO DE IMPUESTOS DE RENTA Y COMPLEMENTARIOS "]
[{"$f":"LEN(PUC[[#This Row],[AUXILIAR]])","v":6},135510,"ANTICIPO DE IMPUESTOS DE INDUSTRIA Y COMERCIO "]
[{"$f":"LEN(PUC[[#This Row],[AUXILIAR]])","v":6},135515,"RETENCION EN LA FUENTE "]
[{"$f":"LEN(PUC[[#This Row],[AUXILIAR]])","v":6},135520,"SOBRANTES EN LIQUIDACION PRIVADA DE IMPUESTOS "]
[{"$f":"LEN(PUC[[#This Row],[AUXILIAR]])","v":6},135525,"CONTRIBUCIONES "]
[{"$f":"LEN(PUC[[#This Row],[AUXILIAR]])","v":6},135530,"IMPUESTOS DESCONTABLES "]
[{"$f":"LEN(PUC[[#This Row],[AUXILIAR]])","v":6},135595,"OTROS "]
[{"$f":"LEN(PUC[[#This Row],[AUXILIAR]])","v":4},1360,"RECLAMACIONES "]
[{"$f":"LEN(PUC[[#This Row],[AUXILIAR]])","v":6},136005,"A COMPAÑIAS ASEGURADORAS "]
[{"$f":"LEN(PUC[[#This Row],[AUXILIAR]])","v":6},136010,"A TRANSPORTADORES "]
[{"$f":"LEN(PUC[[#This Row],[AUXILIAR]])","v":6},136015,"POR TIQUETES AEREOS "]
[{"$f":"LEN(PUC[[#This Row],[AUXILIAR]])","v":6},136095,"OTRAS "]
[{"$f":"LEN(PUC[[#This Row],[AUXILIAR]])","v":4},1365,"CUENTAS POR COBRAR A TRABAJADORES "]
[{"$f":"LEN(PUC[[#This Row],[AUXILIAR]])","v":6},136505,"VIVIENDA "]
[{"$f":"LEN(PUC[[#This Row],[AUXILIAR]])","v":6},136510,"VEHICULOS "]
[{"$f":"LEN(PUC[[#This Row],[AUXILIAR]])","v":6},136515,"EDUCACION "]
[{"$f":"LEN(PUC[[#This Row],[AUXILIAR]])","v":6},136520,"MEDICOS, ODONTOLOGICOS Y SIMILARES "]
[{"$f":"LEN(PUC[[#This Row],[AUXILIAR]])","v":6},136525,"CALAMIDAD DOMESTICA "]
[{"$f":"LEN(PUC[[#This Row],[AUXILIAR]])","v":6},136530,"RESPONSABILIDADES "]
[{"$f":"LEN(PUC[[#This Row],[AUXILIAR]])","v":6},136595,"OTROS "]
[{"$f":"LEN(PUC[[#This Row],[AUXILIAR]])","v":4},1370,"PRESTAMOS A PARTICULARES "]
[{"$f":"LEN(PUC[[#This Row],[AUXILIAR]])","v":6},137005,"CON GARANTIA REAL "]
[{"$f":"LEN(PUC[[#This Row],[AUXILIAR]])","v":6},137010,"CON GARANTIA PERSONAL "]
[{"$f":"LEN(PUC[[#This Row],[AUXILIAR]])","v":4},1380,"DEUDORES VARIOS "]
[{"$f":"LEN(PUC[[#This Row],[AUXILIAR]])","v":6},138005,"DEPOSITARIOS "]
[{"$f":"LEN(PUC[[#This Row],[AUXILIAR]])","v":6},138010,"COMISIONISTAS DE BOLSAS "]
[{"$f":"LEN(PUC[[#This Row],[AUXILIAR]])","v":6},138015,"FONDO DE INVERSION "]
[{"$f":"LEN(PUC[[#This Row],[AUXILIAR]])","v":6},138020,"CUENTAS POR COBRAR DE TERCEROS "]
[{"$f":"LEN(PUC[[#This Row],[AUXILIAR]])","v":6},138025,"PAGOS POR CUENTA DE TERCEROS "]
[{"$f":"LEN(PUC[[#This Row],[AUXILIAR]])","v":6},138030,"FONDOS DE INVERSION SOCIAL "]
[{"$f":"LEN(PUC[[#This Row],[AUXILIAR]])","v":6},138095,"OTROS "]
[{"$f":"LEN(PUC[[#This Row],[AUXILIAR]])","v":4},1385,"DERECHOS DE RECOMPRA DE CARTERA NEGOCIADA "]
[{"$f":"LEN(PUC[[#This Row],[AUXILIAR]])","v":4},1390,"DEUDAS DE DIFICIL COBRO "]
[{"$f":"LEN(PUC[[#This Row],[AUXILIAR]])","v":4},1399,"PROVISIONES "]
[{"$f":"LEN(PUC[[#This Row],[AUXILIAR]])","v":6},139905,"CLIENTES "]
[{"$f":"LEN(PUC[[#This Row],[AUXILIAR]])","v":6},139910,"CUENTAS CORRIENTES COMERCIALES "]
[{"$f":"LEN(PUC[[#This Row],[AUXILIAR]])","v":6},139915,"CUENTAS POR COBRAR A CASA MATRIZ "]
[{"$f":"LEN(PUC[[#This Row],[AUXILIAR]])","v":6},139920,"CUENTAS POR COBRAR A VINCULADOS ECONOMICOS "]
[{"$f":"LEN(PUC[[#This Row],[AUXILIAR]])","v":6},139925,"CUENTAS POR COBRAR A SOCIOS Y ACCIONISTAS "]
[{"$f":"LEN(PUC[[#This Row],[AUXILIAR]])","v":6},139930,"ANTICIPOS Y AVANCES "]
[{"$f":"LEN(PUC[[#This Row],[AUXILIAR]])","v":6},139932,"CUENTAS DE OPERACION CONJUNTA "]
[{"$f":"LEN(PUC[[#This Row],[AUXILIAR]])","v":6},139935,"DEPOSITOS "]
[{"$f":"LEN(PUC[[#This Row],[AUXILIAR]])","v":6},139940,"PROMESAS DE COMPRAVENTA "]
[{"$f":"LEN(PUC[[#This Row],[AUXILIAR]])","v":6},139945,"INGRESOS POR COBRAR "]
[{"$f":"LEN(PUC[[#This Row],[AUXILIAR]])","v":6},139950,"RETENCION SOBRE CONTRATOS "]
[{"$f":"LEN(PUC[[#This Row],[AUXILIAR]])","v":6},139955,"RECLAMACIONES "]
[{"$f":"LEN(PUC[[#This Row],[AUXILIAR]])","v":6},139960,"CUENTAS POR COBRAR A TRABAJADORES "]
[{"$f":"LEN(PUC[[#This Row],[AUXILIAR]])","v":6},139965,"PRESTAMOS A PARTICULARES "]
[{"$f":"LEN(PUC[[#This Row],[AUXILIAR]])","v":6},139975,"DEUDORES VARIOS "]
[{"$f":"LEN(PUC[[#This Row],[AUXILIAR]])","v":6},139980,"DERECHOS DE RECOMPRA DE CARTERA NEGOCIADA "]
[{"$f":"LEN(PUC[[#This Row],[AUXILIAR]])","v":2},14,"INVENTARIOS "]
[{"$f":"LEN(PUC[[#This Row],[AUXILIAR]])","v":4},1405,"MATERIAS PRIMAS "]
[{"$f":"LEN(PUC[[#This Row],[AUXILIAR]])","v":6},140599,"AJUSTES POR INFLACION "]
[{"$f":"LEN(PUC[[#This Row],[AUXILIAR]])","v":4},1410,"PRODUCTOS EN PROCESO "]
[{"$f":"LEN(PUC[[#This Row],[AUXILIAR]])","v":6},141099,"AJUSTES POR INFLACION "]
[{"$f":"LEN(PUC[[#This Row],[AUXILIAR]])","v":4},1415,"OBRAS DE CONSTRUCCION EN CURSO "]
[{"$f":"LEN(PUC[[#This Row],[AUXILIAR]])","v":6},141599,"AJUSTES POR INFLACION "]
[{"$f":"LEN(PUC[[#This Row],[AUXILIAR]])","v":4},1417,"OBRAS DE URBANISMO "]
[{"$f":"LEN(PUC[[#This Row],[AUXILIAR]])","v":6},141799,"AJUSTES POR INFLACION "]
[{"$f":"LEN(PUC[[#This Row],[AUXILIAR]])","v":4},1420,"CONTRATOS EN EJECUCION "]
[{"$f":"LEN(PUC[[#This Row],[AUXILIAR]])","v":6},142099,"AJUSTES POR INFLACION "]
[{"$f":"LEN(PUC[[#This Row],[AUXILIAR]])","v":4},1425,"CULTIVOS EN DESARROLLO "]
[{"$f":"LEN(PUC[[#This Row],[AUXILIAR]])","v":6},142599,"AJUSTES POR INFLACION "]
[{"$f":"LEN(PUC[[#This Row],[AUXILIAR]])","v":4},1430,"PRODUCTOS TERMINADOS "]
[{"$f":"LEN(PUC[[#This Row],[AUXILIAR]])","v":6},143005,"PRODUCTOS MANUFACTURADOS "]
[{"$f":"LEN(PUC[[#This Row],[AUXILIAR]])","v":6},143010,"PRODUCTOS EXTRAIDOS Y/O PROCESADOS "]
[{"$f":"LEN(PUC[[#This Row],[AUXILIAR]])","v":6},143015,"PRODUCTOS AGRICOLAS Y FORESTALES "]
[{"$f":"LEN(PUC[[#This Row],[AUXILIAR]])","v":6},143020,"SUBPRODUCTOS "]
[{"$f":"LEN(PUC[[#This Row],[AUXILIAR]])","v":6},143025,"PRODUCTOS DE PESCA "]
[{"$f":"LEN(PUC[[#This Row],[AUXILIAR]])","v":6},143099,"AJUSTES POR INFLACION "]
[{"$f":"LEN(PUC[[#This Row],[AUXILIAR]])","v":4},1435,"MERCANCIAS NO FABRICADAS POR LA EMPRESA "]
[{"$f":"LEN(PUC[[#This Row],[AUXILIAR]])","v":6},143599,"AJUSTES POR INFLACION "]
[{"$f":"LEN(PUC[[#This Row],[AUXILIAR]])","v":4},1440,"BIENES RAICES PARA LA VENTA "]
[{"$f":"LEN(PUC[[#This Row],[AUXILIAR]])","v":6},144099,"AJUSTES POR INFLACION "]
[{"$f":"LEN(PUC[[#This Row],[AUXILIAR]])","v":4},1445,"SEMOVIENTES "]
[{"$f":"LEN(PUC[[#This Row],[AUXILIAR]])","v":6},144505,"ESPECIES MAYORES "]
[{"$f":"LEN(PUC[[#This Row],[AUXILIAR]])","v":6},144510,"ESPECIES MENORES "]
[{"$f":"LEN(PUC[[#This Row],[AUXILIAR]])","v":6},144599,"AJUSTES POR INFLACION "]
[{"$f":"LEN(PUC[[#This Row],[AUXILIAR]])","v":4},1450,"TERRENOS "]
[{"$f":"LEN(PUC[[#This Row],[AUXILIAR]])","v":6},145005,"POR URBANIZAR "]
[{"$f":"LEN(PUC[[#This Row],[AUXILIAR]])","v":6},145010,"URBANIZADOS POR CONSTRUIR "]
[{"$f":"LEN(PUC[[#This Row],[AUXILIAR]])","v":6},145099,"AJUSTES POR INFLACION "]
[{"$f":"LEN(PUC[[#This Row],[AUXILIAR]])","v":4},1455,"MATERIALES, REPUESTOS Y ACCESORIOS "]
[{"$f":"LEN(PUC[[#This Row],[AUXILIAR]])","v":6},145505,"COMBUSTIBLES Y LUBRICANTES "]
[{"$f":"LEN(PUC[[#This Row],[AUXILIAR]])","v":6},145510,"ABONOS Y FERTILIZANTES "]
[{"$f":"LEN(PUC[[#This Row],[AUXILIAR]])","v":6},145515,"SEMILLAS TERMINADAS "]
[{"$f":"LEN(PUC[[#This Row],[AUXILIAR]])","v":6},145520,"FUNGICIDAS Y HERBICIDAS "]
[{"$f":"LEN(PUC[[#This Row],[AUXILIAR]])","v":6},145525,"MATERIALES Y REPUESTOS "]
[{"$f":"LEN(PUC[[#This Row],[AUXILIAR]])","v":6},145530,"LOZA Y CRISTALERIA "]
[{"$f":"LEN(PUC[[#This Row],[AUXILIAR]])","v":6},145535,"HERRAMIENTAS "]
[{"$f":"LEN(PUC[[#This Row],[AUXILIAR]])","v":6},145540,"MEDICINAS "]
[{"$f":"LEN(PUC[[#This Row],[AUXILIAR]])","v":6},145545,"ELEMENTOS HOSPITALARIOS "]
[{"$f":"LEN(PUC[[#This Row],[AUXILIAR]])","v":6},145550,"INSTRUMENTAL QUIRURGICO "]
[{"$f":"LEN(PUC[[#This Row],[AUXILIAR]])","v":6},145555,"DOTACION Y SUMINISTRO A TRABAJADORES "]
[{"$f":"LEN(PUC[[#This Row],[AUXILIAR]])","v":6},145560,"ELEMENTOS DE ROPERIA Y LENCERIA "]
[{"$f":"LEN(PUC[[#This Row],[AUXILIAR]])","v":6},145595,"OTROS "]
[{"$f":"LEN(PUC[[#This Row],[AUXILIAR]])","v":6},145599,"AJUSTES POR INFLACION "]
[{"$f":"LEN(PUC[[#This Row],[AUXILIAR]])","v":4},1460,"ENVASES Y EMPAQUES "]
[{"$f":"LEN(PUC[[#This Row],[AUXILIAR]])","v":6},146099,"AJUSTES POR INFLACION "]
[{"$f":"LEN(PUC[[#This Row],[AUXILIAR]])","v":4},1465,"INVENTARIOS EN TRANSITO "]
[{"$f":"LEN(PUC[[#This Row],[AUXILIAR]])","v":6},146599,"AJUSTES POR INFLACION "]
[{"$f":"LEN(PUC[[#This Row],[AUXILIAR]])","v":4},1499,"PROVISIONES "]
[{"$f":"LEN(PUC[[#This Row],[AUXILIAR]])","v":6},149905,"PARA OBSOLESCENCIA "]
[{"$f":"LEN(PUC[[#This Row],[AUXILIAR]])","v":6},149910,"PARA DIFERENCIA DE INVENTARIO FISICO "]
[{"$f":"LEN(PUC[[#This Row],[AUXILIAR]])","v":6},149915,"PARA PERDIDAS DE INVENTARIOS "]
[{"$f":"LEN(PUC[[#This Row],[AUXILIAR]])","v":6},149920,"LIFO "]
[{"$f":"LEN(PUC[[#This Row],[AUXILIAR]])","v":2},15,"PROPIEDADES PLANTA Y EQUIPO "]
[{"$f":"LEN(PUC[[#This Row],[AUXILIAR]])","v":4},1504,"TERRENOS "]
[{"$f":"LEN(PUC[[#This Row],[AUXILIAR]])","v":6},150405,"URBANOS "]
[{"$f":"LEN(PUC[[#This Row],[AUXILIAR]])","v":6},150410,"RURALES "]
[{"$f":"LEN(PUC[[#This Row],[AUXILIAR]])","v":6},150499,"AJUSTES POR INFLACION "]
[{"$f":"LEN(PUC[[#This Row],[AUXILIAR]])","v":4},1506,"MATERIALES PROYECTOS PETROLEROS "]
[{"$f":"LEN(PUC[[#This Row],[AUXILIAR]])","v":6},150605,"TUBERIAS Y EQUIPO "]
[{"$f":"LEN(PUC[[#This Row],[AUXILIAR]])","v":6},150610,"COSTOS DE IMPORTACION MATERIALES "]
[{"$f":"LEN(PUC[[#This Row],[AUXILIAR]])","v":6},150615,"PROYECTOS DE CONSTRUCCION "]
[{"$f":"LEN(PUC[[#This Row],[AUXILIAR]])","v":6},150699,"AJUSTES POR INFLACION "]
[{"$f":"LEN(PUC[[#This Row],[AUXILIAR]])","v":4},1508,"CONSTRUCCIONES EN CURSO "]
[{"$f":"LEN(PUC[[#This Row],[AUXILIAR]])","v":6},150805,"CONSTRUCCIONES Y EDIFICACIONES "]
[{"$f":"LEN(PUC[[#This Row],[AUXILIAR]])","v":6},150810,"ACUEDUCTOS PLANTAS Y REDES "]
[{"$f":"LEN(PUC[[#This Row],[AUXILIAR]])","v":6},150815,"VIAS DE COMUNICACION "]
[{"$f":"LEN(PUC[[#This Row],[AUXILIAR]])","v":6},150820,"POZOS ARTESIANOS "]
[{"$f":"LEN(PUC[[#This Row],[AUXILIAR]])","v":6},150825,"PROYECTOS DE EXPLORACION "]
[{"$f":"LEN(PUC[[#This Row],[AUXILIAR]])","v":6},150830,"PROYECTOS DE DESARROLLO "]
[{"$f":"LEN(PUC[[#This Row],[AUXILIAR]])","v":6},150899,"AJUSTES POR INFLACION "]
[{"$f":"LEN(PUC[[#This Row],[AUXILIAR]])","v":4},1512,"MAQUINARIA Y EQUIPOS EN MONTAJE "]
[{"$f":"LEN(PUC[[#This Row],[AUXILIAR]])","v":6},151205,"MAQUINARIA Y EQUIPO "]
[{"$f":"LEN(PUC[[#This Row],[AUXILIAR]])","v":6},151210,"EQUIPO DE OFICINA "]
[{"$f":"LEN(PUC[[#This Row],[AUXILIAR]])","v":6},151215,"EQUIPO DE COMPUTACION Y COMUNICACION "]
[{"$f":"LEN(PUC[[#This Row],[AUXILIAR]])","v":6},151220,"EQUIPO MEDICO-CIENTIFICO "]
[{"$f":"LEN(PUC[[#This Row],[AUXILIAR]])","v":6},151225,"EQUIPO DE HOTELES Y RESTAURANTES "]
[{"$f":"LEN(PUC[[#This Row],[AUXILIAR]])","v":6},151230,"FLOTA Y EQUIPO DE TRANSPORTE "]
[{"$f":"LEN(PUC[[#This Row],[AUXILIAR]])","v":6},151235,"FLOTA Y EQUIPO FLUVIAL Y/O MARITIMO "]
[{"$f":"LEN(PUC[[#This Row],[AUXILIAR]])","v":6},151240,"FLOTA Y EQUIPO AEREO "]
[{"$f":"LEN(PUC[[#This Row],[AUXILIAR]])","v":6},151245,"FLOTA Y EQUIPO FERREO "]
[{"$f":"LEN(PUC[[#This Row],[AUXILIAR]])","v":6},151250,"PLANTAS Y REDES "]
[{"$f":"LEN(PUC[[#This Row],[AUXILIAR]])","v":6},151299,"AJUSTES POR INFLACION "]
[{"$f":"LEN(PUC[[#This Row],[AUXILIAR]])","v":4},1516,"CONSTRUCCIONES Y EDIFICACIONES "]
[{"$f":"LEN(PUC[[#This Row],[AUXILIAR]])","v":6},151605,"EDIFICIOS "]
[{"$f":"LEN(PUC[[#This Row],[AUXILIAR]])","v":6},151610,"OFICINAS "]
[{"$f":"LEN(PUC[[#This Row],[AUXILIAR]])","v":6},151615,"ALMACENES "]
[{"$f":"LEN(PUC[[#This Row],[AUXILIAR]])","v":6},151620,"FABRICAS Y PLANTAS INDUSTRIALES "]
[{"$f":"LEN(PUC[[#This Row],[AUXILIAR]])","v":6},151625,"SALAS DE EXHIBICION Y VENTAS "]
[{"$f":"LEN(PUC[[#This Row],[AUXILIAR]])","v":6},151630,"CAFETERIA Y CASINOS "]
[{"$f":"LEN(PUC[[#This Row],[AUXILIAR]])","v":6},151635,"SILOS "]
[{"$f":"LEN(PUC[[#This Row],[AUXILIAR]])","v":6},151640,"INVERNADEROS "]
[{"$f":"LEN(PUC[[#This Row],[AUXILIAR]])","v":6},151645,"CASETAS Y CAMPAMENTOS "]
[{"$f":"LEN(PUC[[#This Row],[AUXILIAR]])","v":6},151650,"INSTALACIONES AGROPECUARIAS "]
[{"$f":"LEN(PUC[[#This Row],[AUXILIAR]])","v":6},151655,"VIVIENDAS PARA EMPLEADOS Y OBREROS "]
[{"$f":"LEN(PUC[[#This Row],[AUXILIAR]])","v":6},151660,"TERMINAL DE BUSES Y TAXIS "]
[{"$f":"LEN(PUC[[#This Row],[AUXILIAR]])","v":6},151663,"TERMINAL MARITIMO "]
[{"$f":"LEN(PUC[[#This Row],[AUXILIAR]])","v":6},151665,"TERMINAL FERREO "]
[{"$f":"LEN(PUC[[#This Row],[AUXILIAR]])","v":6},151670,"PARQUEADEROS, GARAJES Y DEPOSITOS "]
[{"$f":"LEN(PUC[[#This Row],[AUXILIAR]])","v":6},151675,"HANGARES "]
[{"$f":"LEN(PUC[[#This Row],[AUXILIAR]])","v":6},151680,"BODEGAS "]
[{"$f":"LEN(PUC[[#This Row],[AUXILIAR]])","v":6},151695,"OTROS "]
[{"$f":"LEN(PUC[[#This Row],[AUXILIAR]])","v":6},151699,"AJUSTES POR INFLACION "]
[{"$f":"LEN(PUC[[#This Row],[AUXILIAR]])","v":6},152000,"MAQUINARIA Y EQUIPO "]
[{"$f":"LEN(PUC[[#This Row],[AUXILIAR]])","v":6},152099,"AJUSTES POR INFLACION "]
[{"$f":"LEN(PUC[[#This Row],[AUXILIAR]])","v":4},1524,"EQUIPO DE OFICINA "]
[{"$f":"LEN(PUC[[#This Row],[AUXILIAR]])","v":6},152405,"MUEBLES Y ENSERES "]
[{"$f":"LEN(PUC[[#This Row],[AUXILIAR]])","v":6},152410,"EQUIPOS "]
[{"$f":"LEN(PUC[[#This Row],[AUXILIAR]])","v":6},152495,"OTROS "]
[{"$f":"LEN(PUC[[#This Row],[AUXILIAR]])","v":6},152499,"AJUSTES POR INFLACION "]
[{"$f":"LEN(PUC[[#This Row],[AUXILIAR]])","v":4},1528,"EQUIPO DE COMPUTACION Y COMUNICACION "]
[{"$f":"LEN(PUC[[#This Row],[AUXILIAR]])","v":6},152805,"EQUIPOS DE PROCESAMIENTO DE DATOS "]
[{"$f":"LEN(PUC[[#This Row],[AUXILIAR]])","v":6},152810,"EQUIPOS DE TELECOMUNICACIONES "]
[{"$f":"LEN(PUC[[#This Row],[AUXILIAR]])","v":6},152815,"EQUIPOS DE RADIO "]
[{"$f":"LEN(PUC[[#This Row],[AUXILIAR]])","v":6},152820,"SATELITES Y ANTENAS "]
[{"$f":"LEN(PUC[[#This Row],[AUXILIAR]])","v":6},152825,"LINEAS TELEFONICAS "]
[{"$f":"LEN(PUC[[#This Row],[AUXILIAR]])","v":6},152895,"OTROS "]
[{"$f":"LEN(PUC[[#This Row],[AUXILIAR]])","v":6},152899,"AJUSTES POR INFLACION "]
[{"$f":"LEN(PUC[[#This Row],[AUXILIAR]])","v":4},1532,"EQUIPO MEDICO - CIENTIFICO "]
[{"$f":"LEN(PUC[[#This Row],[AUXILIAR]])","v":6},153205,"MEDICO "]
[{"$f":"LEN(PUC[[#This Row],[AUXILIAR]])","v":6},153210,"ODONTOLOGICO "]
[{"$f":"LEN(PUC[[#This Row],[AUXILIAR]])","v":6},153215,"LABORATORIO "]
[{"$f":"LEN(PUC[[#This Row],[AUXILIAR]])","v":6},153220,"INSTRUMENTAL "]
[{"$f":"LEN(PUC[[#This Row],[AUXILIAR]])","v":6},153295,"OTROS "]
[{"$f":"LEN(PUC[[#This Row],[AUXILIAR]])","v":6},153299,"AJUSTES POR INFLACION "]
[{"$f":"LEN(PUC[[#This Row],[AUXILIAR]])","v":4},1536,"EQUIPO DE HOTELES Y RESTAURANTES "]
[{"$f":"LEN(PUC[[#This Row],[AUXILIAR]])","v":6},153605,"DE HABITACIONES "]
[{"$f":"LEN(PUC[[#This Row],[AUXILIAR]])","v":6},153610,"DE COMESTIBLES Y BEBIDAS "]
[{"$f":"LEN(PUC[[#This Row],[AUXILIAR]])","v":6},153695,"OTROS "]
[{"$f":"LEN(PUC[[#This Row],[AUXILIAR]])","v":6},153699,"AJUSTES POR INFLACION "]
[{"$f":"LEN(PUC[[#This Row],[AUXILIAR]])","v":4},1540,"FLOTA Y EQUIPO DE TRANSPORTE "]
[{"$f":"LEN(PUC[[#This Row],[AUXILIAR]])","v":6},154005,"AUTOS, CAMIONETAS Y CAMPEROS "]
[{"$f":"LEN(PUC[[#This Row],[AUXILIAR]])","v":6},154008,"CAMIONES, VOLQUETAS Y FURGONES "]
[{"$f":"LEN(PUC[[#This Row],[AUXILIAR]])","v":6},154010,"TRACTOMULAS Y REMOLQUES "]
[{"$f":"LEN(PUC[[#This Row],[AUXILIAR]])","v":6},154015,"BUSES Y BUSETAS "]
[{"$f":"LEN(PUC[[#This Row],[AUXILIAR]])","v":6},154017,"RECOLECTORES Y CONTENEDORES "]
[{"$f":"LEN(PUC[[#This Row],[AUXILIAR]])","v":6},154020,"MONTACARGAS "]
[{"$f":"LEN(PUC[[#This Row],[AUXILIAR]])","v":6},154025,"PALAS Y GRUAS "]
[{"$f":"LEN(PUC[[#This Row],[AUXILIAR]])","v":6},154030,"MOTOCICLETAS "]
[{"$f":"LEN(PUC[[#This Row],[AUXILIAR]])","v":6},154035,"BICICLETAS "]
[{"$f":"LEN(PUC[[#This Row],[AUXILIAR]])","v":6},154040,"ESTIBAS Y CARRETAS "]
[{"$f":"LEN(PUC[[#This Row],[AUXILIAR]])","v":6},154045,"BANDAS TRANSPORTADORAS "]
[{"$f":"LEN(PUC[[#This Row],[AUXILIAR]])","v":6},154095,"OTROS "]
[{"$f":"LEN(PUC[[#This Row],[AUXILIAR]])","v":6},154099,"AJUSTES POR INFLACION "]
[{"$f":"LEN(PUC[[#This Row],[AUXILIAR]])","v":4},1544,"FLOTA Y EQUIPO FLUVIAL Y/O MARITIMO "]
[{"$f":"LEN(PUC[[#This Row],[AUXILIAR]])","v":6},154405,"BUQUES "]
[{"$f":"LEN(PUC[[#This Row],[AUXILIAR]])","v":6},154410,"LANCHAS "]
[{"$f":"LEN(PUC[[#This Row],[AUXILIAR]])","v":6},154415,"REMOLCADORAS "]
[{"$f":"LEN(PUC[[#This Row],[AUXILIAR]])","v":6},154420,"BOTES "]
[{"$f":"LEN(PUC[[#This Row],[AUXILIAR]])","v":6},154425,"BOYAS "]
[{"$f":"LEN(PUC[[#This Row],[AUXILIAR]])","v":6},154430,"AMARRES "]
[{"$f":"LEN(PUC[[#This Row],[AUXILIAR]])","v":6},154435,"CONTENEDORES Y CHASSISES "]
[{"$f":"LEN(PUC[[#This Row],[AUXILIAR]])","v":6},154440,"GABARRAS "]
[{"$f":"LEN(PUC[[#This Row],[AUXILIAR]])","v":6},154495,"OTROS "]
[{"$f":"LEN(PUC[[#This Row],[AUXILIAR]])","v":6},154499,"AJUSTES POR INFLACION "]
[{"$f":"LEN(PUC[[#This Row],[AUXILIAR]])","v":4},1548,"FLOTA Y EQUIPO AEREO "]
[{"$f":"LEN(PUC[[#This Row],[AUXILIAR]])","v":6},154805,"AVIONES "]
[{"$f":"LEN(PUC[[#This Row],[AUXILIAR]])","v":6},154810,"AVIONETAS "]
[{"$f":"LEN(PUC[[#This Row],[AUXILIAR]])","v":6},154815,"HELICOPTEROS "]
[{"$f":"LEN(PUC[[#This Row],[AUXILIAR]])","v":6},154820,"TURBINAS Y MOTORES "]
[{"$f":"LEN(PUC[[#This Row],[AUXILIAR]])","v":6},154825,"MANUALES DE ENTRENAMIENTO PERSONAL TECNICO "]
[{"$f":"LEN(PUC[[#This Row],[AUXILIAR]])","v":6},154830,"EQUIPOS DE VUELO "]
[{"$f":"LEN(PUC[[#This Row],[AUXILIAR]])","v":6},154895,"OTROS "]
[{"$f":"LEN(PUC[[#This Row],[AUXILIAR]])","v":6},154899,"AJUSTES POR INFLACION "]
[{"$f":"LEN(PUC[[#This Row],[AUXILIAR]])","v":4},1552,"FLOTA Y EQUIPO FERREO "]
[{"$f":"LEN(PUC[[#This Row],[AUXILIAR]])","v":6},155205,"LOCOMOTORAS "]
[{"$f":"LEN(PUC[[#This Row],[AUXILIAR]])","v":6},155210,"VAGONES "]
[{"$f":"LEN(PUC[[#This Row],[AUXILIAR]])","v":6},155215,"REDES FERREAS "]
[{"$f":"LEN(PUC[[#This Row],[AUXILIAR]])","v":6},155295,"OTROS "]
[{"$f":"LEN(PUC[[#This Row],[AUXILIAR]])","v":6},155299,"AJUSTES POR INFLACION "]
[{"$f":"LEN(PUC[[#This Row],[AUXILIAR]])","v":4},1556,"ACUEDUCTOS PLANTAS Y REDES "]
[{"$f":"LEN(PUC[[#This Row],[AUXILIAR]])","v":6},155605,"INSTALACIONES PARA AGUA Y ENERGIA "]
[{"$f":"LEN(PUC[[#This Row],[AUXILIAR]])","v":6},155610,"ACUEDUCTO ACEQUIAS Y CANALIZACIONES "]
[{"$f":"LEN(PUC[[#This Row],[AUXILIAR]])","v":6},155615,"PLANTAS DE GENERACION HIDRAULICA "]
[{"$f":"LEN(PUC[[#This Row],[AUXILIAR]])","v":6},155620,"PLANTAS DE GENERACION TERMICA "]
[{"$f":"LEN(PUC[[#This Row],[AUXILIAR]])","v":6},155625,"PLANTAS DE GENERACION A GAS "]
[{"$f":"LEN(PUC[[#This Row],[AUXILIAR]])","v":6},155628,"PLANTAS DE GENERACION DIESEL, GASOLINA Y PETROLEO "]
[{"$f":"LEN(PUC[[#This Row],[AUXILIAR]])","v":6},155630,"PLANTAS DE DISTRIBUCION "]
[{"$f":"LEN(PUC[[#This Row],[AUXILIAR]])","v":6},155635,"PLANTAS DE TRANSMISION Y SUBESTACIONES "]
[{"$f":"LEN(PUC[[#This Row],[AUXILIAR]])","v":6},155640,"OLEODUCTOS "]
[{"$f":"LEN(PUC[[#This Row],[AUXILIAR]])","v":6},155645,"GASODUCTOS "]
[{"$f":"LEN(PUC[[#This Row],[AUXILIAR]])","v":6},155647,"POLIDUCTOS "]
[{"$f":"LEN(PUC[[#This Row],[AUXILIAR]])","v":6},155650,"REDES DE DISTRIBUCION "]
[{"$f":"LEN(PUC[[#This Row],[AUXILIAR]])","v":6},155655,"PLANTAS DE TRATAMIENTO "]
[{"$f":"LEN(PUC[[#This Row],[AUXILIAR]])","v":6},155660,"REDES DE RECOLECCION DE AGUAS NEGRAS "]
[{"$f":"LEN(PUC[[#This Row],[AUXILIAR]])","v":6},155665,"INSTALACIONES Y EQUIPO DE BOMBEO "]
[{"$f":"LEN(PUC[[#This Row],[AUXILIAR]])","v":6},155670,"REDES DE DISTRIBUCION DE VAPOR "]
[{"$f":"LEN(PUC[[#This Row],[AUXILIAR]])","v":6},155675,"REDES DE AIRE "]
[{"$f":"LEN(PUC[[#This Row],[AUXILIAR]])","v":6},155680,"REDES ALIMENTACION DE GAS "]
[{"$f":"LEN(PUC[[#This Row],[AUXILIAR]])","v":6},155682,"REDES EXTERNAS DE TELEFONIA "]
[{"$f":"LEN(PUC[[#This Row],[AUXILIAR]])","v":6},155685,"PLANTAS DESHIDRATADORAS "]
[{"$f":"LEN(PUC[[#This Row],[AUXILIAR]])","v":6},155695,"OTROS "]
[{"$f":"LEN(PUC[[#This Row],[AUXILIAR]])","v":6},155699,"AJUSTES POR INFLACION "]
[{"$f":"LEN(PUC[[#This Row],[AUXILIAR]])","v":4},1560,"ARMAMENTO DE VIGILANCIA "]
[{"$f":"LEN(PUC[[#This Row],[AUXILIAR]])","v":6},156099,"AJUSTES POR INFLACION "]
[{"$f":"LEN(PUC[[#This Row],[AUXILIAR]])","v":4},1562,"ENVASES Y EMPAQUES "]
[{"$f":"LEN(PUC[[#This Row],[AUXILIAR]])","v":6},156299,"AJUSTES POR INFLACION "]
[{"$f":"LEN(PUC[[#This Row],[AUXILIAR]])","v":4},1564,"PLANTACIONES AGRICOLAS Y FORESTALES "]
[{"$f":"LEN(PUC[[#This Row],[AUXILIAR]])","v":6},156405,"CULTIVOS EN DESARROLLO "]
[{"$f":"LEN(PUC[[#This Row],[AUXILIAR]])","v":6},156410,"CULTIVOS AMORTIZABLES "]
[{"$f":"LEN(PUC[[#This Row],[AUXILIAR]])","v":6},156499,"AJUSTES POR INFLACION "]
[{"$f":"LEN(PUC[[#This Row],[AUXILIAR]])","v":4},1568,"VIAS DE COMUNICACION "]
[{"$f":"LEN(PUC[[#This Row],[AUXILIAR]])","v":6},156805,"PAVIMENTACION Y PATIOS "]
[{"$f":"LEN(PUC[[#This Row],[AUXILIAR]])","v":6},156810,"VIAS "]
[{"$f":"LEN(PUC[[#This Row],[AUXILIAR]])","v":6},156815,"PUENTES "]
[{"$f":"LEN(PUC[[#This Row],[AUXILIAR]])","v":6},156820,"CALLES "]
[{"$f":"LEN(PUC[[#This Row],[AUXILIAR]])","v":6},156825,"AERODROMOS "]
[{"$f":"LEN(PUC[[#This Row],[AUXILIAR]])","v":6},156895,"OTROS "]
[{"$f":"LEN(PUC[[#This Row],[AUXILIAR]])","v":6},156899,"AJUSTES POR INFLACION "]
[{"$f":"LEN(PUC[[#This Row],[AUXILIAR]])","v":4},1572,"MINAS Y CANTERAS "]
[{"$f":"LEN(PUC[[#This Row],[AUXILIAR]])","v":6},157205,"MINAS "]
[{"$f":"LEN(PUC[[#This Row],[AUXILIAR]])","v":6},157210,"CANTERAS "]
[{"$f":"LEN(PUC[[#This Row],[AUXILIAR]])","v":6},157299,"AJUSTES POR INFLACION "]
[{"$f":"LEN(PUC[[#This Row],[AUXILIAR]])","v":4},1576,"POZOS ARTESIANOS "]
[{"$f":"LEN(PUC[[#This Row],[AUXILIAR]])","v":6},157699,"AJUSTES POR INFLACION "]
[{"$f":"LEN(PUC[[#This Row],[AUXILIAR]])","v":4},1580,"YACIMIENTOS "]
[{"$f":"LEN(PUC[[#This Row],[AUXILIAR]])","v":6},158099,"AJUSTES POR INFLACION "]
[{"$f":"LEN(PUC[[#This Row],[AUXILIAR]])","v":4},1584,"SEMOVIENTES "]
[{"$f":"LEN(PUC[[#This Row],[AUXILIAR]])","v":6},158405,"ESPECIES MENORES "]
[{"$f":"LEN(PUC[[#This Row],[AUXILIAR]])","v":6},158410,"ESPECIES MAYORES "]
[{"$f":"LEN(PUC[[#This Row],[AUXILIAR]])","v":6},158499,"AJUSTES POR INFLACION "]
[{"$f":"LEN(PUC[[#This Row],[AUXILIAR]])","v":4},1588,"PROPIEDADES PLANTA Y EQUIPO EN TRANSITO "]
[{"$f":"LEN(PUC[[#This Row],[AUXILIAR]])","v":6},158805,"MAQUINARIA Y EQUIPO "]
[{"$f":"LEN(PUC[[#This Row],[AUXILIAR]])","v":6},158810,"EQUIPO DE OFICINA "]
[{"$f":"LEN(PUC[[#This Row],[AUXILIAR]])","v":6},158815,"EQUIPO DE COMPUTACION Y COMUNICACION "]
[{"$f":"LEN(PUC[[#This Row],[AUXILIAR]])","v":6},158820,"EQUIPO MEDICO CIENTIFICO "]
[{"$f":"LEN(PUC[[#This Row],[AUXILIAR]])","v":6},158825,"EQUIPO DE HOTELES Y RESTAURANTES "]
[{"$f":"LEN(PUC[[#This Row],[AUXILIAR]])","v":6},158830,"FLOTA Y EQUIPO DE TRANSPORTE "]
[{"$f":"LEN(PUC[[#This Row],[AUXILIAR]])","v":6},158835,"FLOTA Y EQUIPO FLUVIAL Y/O MARITIMO "]
[{"$f":"LEN(PUC[[#This Row],[AUXILIAR]])","v":6},158840,"FLOTA Y EQUIPO AEREO "]
[{"$f":"LEN(PUC[[#This Row],[AUXILIAR]])","v":6},158845,"FLOTA Y EQUIPO FERREO "]
[{"$f":"LEN(PUC[[#This Row],[AUXILIAR]])","v":6},158850,"PLANTAS Y REDES "]
[{"$f":"LEN(PUC[[#This Row],[AUXILIAR]])","v":6},158855,"ARMAMENTO DE VIGILANCIA "]
[{"$f":"LEN(PUC[[#This Row],[AUXILIAR]])","v":6},158860,"SEMOVIENTES "]
[{"$f":"LEN(PUC[[#This Row],[AUXILIAR]])","v":6},158865,"ENVASES Y EMPAQUES "]
[{"$f":"LEN(PUC[[#This Row],[AUXILIAR]])","v":6},158899,"AJUSTES POR INFLACION "]
[{"$f":"LEN(PUC[[#This Row],[AUXILIAR]])","v":4},1592,"DEPRECIACION ACUMULADA "]
[{"$f":"LEN(PUC[[#This Row],[AUXILIAR]])","v":6},159205,"CONSTRUCCIONES Y EDIFICACIONES "]
[{"$f":"LEN(PUC[[#This Row],[AUXILIAR]])","v":6},159210,"MAQUINARIA Y EQUIPO "]
[{"$f":"LEN(PUC[[#This Row],[AUXILIAR]])","v":6},159215,"EQUIPO DE OFICINA "]
[{"$f":"LEN(PUC[[#This Row],[AUXILIAR]])","v":6},159220,"EQUIPO DE COMPUTACION Y COMUNICACION "]
[{"$f":"LEN(PUC[[#This Row],[AUXILIAR]])","v":6},159225,"EQUIPO MEDICO CIENTIFICO "]
[{"$f":"LEN(PUC[[#This Row],[AUXILIAR]])","v":6},159230,"EQUIPO DE HOTELES Y RESTAURANTES "]
[{"$f":"LEN(PUC[[#This Row],[AUXILIAR]])","v":6},159235,"FLOTA Y EQUIPO DE TRANSPORTE "]
[{"$f":"LEN(PUC[[#This Row],[AUXILIAR]])","v":6},159240,"FLOTA Y EQUIPO FLUVIAL Y/O MARITIMO "]
[{"$f":"LEN(PUC[[#This Row],[AUXILIAR]])","v":6},159245,"FLOTA Y EQUIPO AEREO "]
[{"$f":"LEN(PUC[[#This Row],[AUXILIAR]])","v":6},159250,"FLOTA Y EQUIPO FERREO "]
[{"$f":"LEN(PUC[[#This Row],[AUXILIAR]])","v":6},159255,"ACUEDUCTOS PLANTAS Y REDES "]
[{"$f":"LEN(PUC[[#This Row],[AUXILIAR]])","v":6},159260,"ARMAMENTO DE VIGILANCIA "]
[{"$f":"LEN(PUC[[#This Row],[AUXILIAR]])","v":6},159265,"ENVASES Y EMPAQUES "]
[{"$f":"LEN(PUC[[#This Row],[AUXILIAR]])","v":6},159299,"AJUSTES POR INFLACION "]
[{"$f":"LEN(PUC[[#This Row],[AUXILIAR]])","v":4},1596,"DEPRECIACION DIFERIDA "]
[{"$f":"LEN(PUC[[#This Row],[AUXILIAR]])","v":6},159605,"EXCESO FISCAL SOBRE LA CONTABLE "]
[{"$f":"LEN(PUC[[#This Row],[AUXILIAR]])","v":6},159610,"DEFECTO FISCAL SOBRE LA CONTABLE (CR) "]
[{"$f":"LEN(PUC[[#This Row],[AUXILIAR]])","v":6},159699,"AJUSTES POR INFLACION "]
[{"$f":"LEN(PUC[[#This Row],[AUXILIAR]])","v":4},1597,"AMORTIZACION ACUMULADA "]
[{"$f":"LEN(PUC[[#This Row],[AUXILIAR]])","v":6},159705,"PLANTACIONES AGRICOLAS Y FORESTALES "]
[{"$f":"LEN(PUC[[#This Row],[AUXILIAR]])","v":6},159710,"VIAS DE COMUNICACION "]
[{"$f":"LEN(PUC[[#This Row],[AUXILIAR]])","v":6},159715,"SEMOVIENTES "]
[{"$f":"LEN(PUC[[#This Row],[AUXILIAR]])","v":6},159799,"AJUSTES POR INFLACION "]
[{"$f":"LEN(PUC[[#This Row],[AUXILIAR]])","v":4},1598,"AGOTAMIENTO ACUMULADO "]
[{"$f":"LEN(PUC[[#This Row],[AUXILIAR]])","v":6},159805,"MINAS Y CANTERAS "]
[{"$f":"LEN(PUC[[#This Row],[AUXILIAR]])","v":6},159815,"POZOS ARTESIANOS "]
[{"$f":"LEN(PUC[[#This Row],[AUXILIAR]])","v":6},159820,"YACIMIENTOS "]
[{"$f":"LEN(PUC[[#This Row],[AUXILIAR]])","v":6},159899,"AJUSTES POR INFLACION "]
[{"$f":"LEN(PUC[[#This Row],[AUXILIAR]])","v":4},1599,"PROVISIONES "]
[{"$f":"LEN(PUC[[#This Row],[AUXILIAR]])","v":6},159904,"TERRENOS "]
[{"$f":"LEN(PUC[[#This Row],[AUXILIAR]])","v":6},159906,"MATERIALES PROYECTOS PETROLEROS "]
[{"$f":"LEN(PUC[[#This Row],[AUXILIAR]])","v":6},159908,"CONSTRUCCIONES EN CURSO "]
[{"$f":"LEN(PUC[[#This Row],[AUXILIAR]])","v":6},159912,"MAQUINARIA EN MONTAJE "]
[{"$f":"LEN(PUC[[#This Row],[AUXILIAR]])","v":6},159916,"CONSTRUCCIONES Y EDIFICACIONES "]
[{"$f":"LEN(PUC[[#This Row],[AUXILIAR]])","v":6},159920,"MAQUINARIA Y EQUIPO "]
[{"$f":"LEN(PUC[[#This Row],[AUXILIAR]])","v":6},159924,"EQUIPO DE OFICINA "]
[{"$f":"LEN(PUC[[#This Row],[AUXILIAR]])","v":6},159928,"EQUIPO DE COMPUTACION Y COMUNICACION "]
[{"$f":"LEN(PUC[[#This Row],[AUXILIAR]])","v":6},159932,"EQUIPO MEDICO CIENTIFICO "]
[{"$f":"LEN(PUC[[#This Row],[AUXILIAR]])","v":6},159936,"EQUIPO DE HOTELES Y RESTAURANTES "]
[{"$f":"LEN(PUC[[#This Row],[AUXILIAR]])","v":6},159940,"FLOTA Y EQUIPO DE TRANSPORTE "]
[{"$f":"LEN(PUC[[#This Row],[AUXILIAR]])","v":6},159944,"FLOTA Y EQUIPO FLUVIAL Y/O MARITIMO "]
[{"$f":"LEN(PUC[[#This Row],[AUXILIAR]])","v":6},159948,"FLOTA Y EQUIPO AEREO "]
[{"$f":"LEN(PUC[[#This Row],[AUXILIAR]])","v":6},159952,"FLOTA Y EQUIPO FERREO "]
[{"$f":"LEN(PUC[[#This Row],[AUXILIAR]])","v":6},159956,"ACUEDUCTOS, PLANTAS Y REDES "]
[{"$f":"LEN(PUC[[#This Row],[AUXILIAR]])","v":6},159960,"ARMAMENTO DE VIGILANCIA "]
[{"$f":"LEN(PUC[[#This Row],[AUXILIAR]])","v":6},159962,"ENVASES Y EMPAQUES "]
[{"$f":"LEN(PUC[[#This Row],[AUXILIAR]])","v":6},159964,"PLANTACIONES AGRICOLAS Y FORESTALES "]
[{"$f":"LEN(PUC[[#This Row],[AUXILIAR]])","v":6},159968,"VIAS DE COMUNICACION "]
[{"$f":"LEN(PUC[[#This Row],[AUXILIAR]])","v":6},159972,"MINAS Y CANTERAS "]
[{"$f":"LEN(PUC[[#This Row],[AUXILIAR]])","v":6},159980,"POZOS ARTESIANOS "]
[{"$f":"LEN(PUC[[#This Row],[AUXILIAR]])","v":6},159984,"YACIMIENTOS "]
[{"$f":"LEN(PUC[[#This Row],[AUXILIAR]])","v":6},159988,"SEMOVIENTES "]
[{"$f":"LEN(PUC[[#This Row],[AUXILIAR]])","v":6},159992,"PROPIEDADES PLANTA Y EQUIPO EN TRANSITO "]
[{"$f":"LEN(PUC[[#This Row],[AUXILIAR]])","v":2},16,"INTANGIBLES "]
[{"$f":"LEN(PUC[[#This Row],[AUXILIAR]])","v":4},1605,"CREDITO MERCANTIL "]
[{"$f":"LEN(PUC[[#This Row],[AUXILIAR]])","v":6},160505,"FORMADO O ESTIMADO "]
[{"$f":"LEN(PUC[[#This Row],[AUXILIAR]])","v":6},160510,"ADQUIRIDO O COMPRADO "]
[{"$f":"LEN(PUC[[#This Row],[AUXILIAR]])","v":6},160599,"AJUSTES POR INFLACION "]
[{"$f":"LEN(PUC[[#This Row],[AUXILIAR]])","v":4},1610,"MARCAS "]
[{"$f":"LEN(PUC[[#This Row],[AUXILIAR]])","v":6},161005,"ADQUIRIDAS "]
[{"$f":"LEN(PUC[[#This Row],[AUXILIAR]])","v":6},161010,"FORMADAS "]
[{"$f":"LEN(PUC[[#This Row],[AUXILIAR]])","v":6},161099,"AJUSTES POR INFLACION "]
[{"$f":"LEN(PUC[[#This Row],[AUXILIAR]])","v":4},1615,"PATENTES "]
[{"$f":"LEN(PUC[[#This Row],[AUXILIAR]])","v":6},161505,"ADQUIRIDAS "]
[{"$f":"LEN(PUC[[#This Row],[AUXILIAR]])","v":6},161510,"FORMADAS "]
[{"$f":"LEN(PUC[[#This Row],[AUXILIAR]])","v":6},161599,"AJUSTES POR INFLACION "]
[{"$f":"LEN(PUC[[#This Row],[AUXILIAR]])","v":4},1620,"CONCESIONES Y FRANQUICIAS "]
[{"$f":"LEN(PUC[[#This Row],[AUXILIAR]])","v":6},162005,"CONCESIONES "]
[{"$f":"LEN(PUC[[#This Row],[AUXILIAR]])","v":6},162010,"FRANQUICIAS "]
[{"$f":"LEN(PUC[[#This Row],[AUXILIAR]])","v":6},162099,"AJUSTES POR INFLACION "]
[{"$f":"LEN(PUC[[#This Row],[AUXILIAR]])","v":4},1625,"DERECHOS "]
[{"$f":"LEN(PUC[[#This Row],[AUXILIAR]])","v":6},162505,"DERECHOS DE AUTOR "]
[{"$f":"LEN(PUC[[#This Row],[AUXILIAR]])","v":6},162510,"PUESTO DE BOLSA "]
[{"$f":"LEN(PUC[[#This Row],[AUXILIAR]])","v":6},162515,"EN FIDEICOMISOS INMOBILIARIOS "]
[{"$f":"LEN(PUC[[#This Row],[AUXILIAR]])","v":6},162520,"EN FIDEICOMISOS DE GARANTIA "]
[{"$f":"LEN(PUC[[#This Row],[AUXILIAR]])","v":6},162525,"EN FIDEICOMISOS DE ADMINISTRACION "]
[{"$f":"LEN(PUC[[#This Row],[AUXILIAR]])","v":6},162595,"OTROS "]
[{"$f":"LEN(PUC[[#This Row],[AUXILIAR]])","v":6},162599,"AJUSTES POR INFLACION "]
[{"$f":"LEN(PUC[[#This Row],[AUXILIAR]])","v":4},1630,"KNOW HOW "]
[{"$f":"LEN(PUC[[#This Row],[AUXILIAR]])","v":6},163099,"AJUSTES POR INFLACION "]
[{"$f":"LEN(PUC[[#This Row],[AUXILIAR]])","v":4},1635,"LICENCIAS "]
[{"$f":"LEN(PUC[[#This Row],[AUXILIAR]])","v":6},163599,"AJUSTES POR INFLACION "]
[{"$f":"LEN(PUC[[#This Row],[AUXILIAR]])","v":4},1698,"AMORTIZACION ACUMULADA "]
[{"$f":"LEN(PUC[[#This Row],[AUXILIAR]])","v":6},169805,"CREDITO MERCANTIL "]
[{"$f":"LEN(PUC[[#This Row],[AUXILIAR]])","v":6},169810,"MARCAS "]
[{"$f":"LEN(PUC[[#This Row],[AUXILIAR]])","v":6},169815,"PATENTES "]
[{"$f":"LEN(PUC[[#This Row],[AUXILIAR]])","v":6},169820,"CONCESIONES Y FRANQUICIAS "]
[{"$f":"LEN(PUC[[#This Row],[AUXILIAR]])","v":6},169830,"DERECHOS "]
[{"$f":"LEN(PUC[[#This Row],[AUXILIAR]])","v":6},169835,"KNOW HOW "]
[{"$f":"LEN(PUC[[#This Row],[AUXILIAR]])","v":6},169840,"LICENCIAS "]
[{"$f":"LEN(PUC[[#This Row],[AUXILIAR]])","v":6},169899,"AJUSTES POR INFLACION "]
[{"$f":"LEN(PUC[[#This Row],[AUXILIAR]])","v":4},1699,"PROVISIONES "]
[{"$f":"LEN(PUC[[#This Row],[AUXILIAR]])","v":2},17,"DIFERIDOS "]
[{"$f":"LEN(PUC[[#This Row],[AUXILIAR]])","v":4},1705,"GASTOS PAGADOS POR ANTICIPADO "]
[{"$f":"LEN(PUC[[#This Row],[AUXILIAR]])","v":6},170505,"INTERESES "]
[{"$f":"LEN(PUC[[#This Row],[AUXILIAR]])","v":6},170510,"HONORARIOS "]
[{"$f":"LEN(PUC[[#This Row],[AUXILIAR]])","v":6},170515,"COMISIONES "]
[{"$f":"LEN(PUC[[#This Row],[AUXILIAR]])","v":6},170520,"SEGUROS Y FIANZAS "]
[{"$f":"LEN(PUC[[#This Row],[AUXILIAR]])","v":6},170525,"ARRENDAMIENTOS "]
[{"$f":"LEN(PUC[[#This Row],[AUXILIAR]])","v":6},170530,"BODEGAJES "]
[{"$f":"LEN(PUC[[#This Row],[AUXILIAR]])","v":6},170535,"MANTENIMIENTO EQUIPOS "]
[{"$f":"LEN(PUC[[#This Row],[AUXILIAR]])","v":6},170540,"SERVICIOS "]
[{"$f":"LEN(PUC[[#This Row],[AUXILIAR]])","v":6},170545,"SUSCRIPCIONES "]
[{"$f":"LEN(PUC[[#This Row],[AUXILIAR]])","v":6},170595,"OTROS "]
[{"$f":"LEN(PUC[[#This Row],[AUXILIAR]])","v":4},1710,"CARGOS DIFERIDOS "]
[{"$f":"LEN(PUC[[#This Row],[AUXILIAR]])","v":6},171004,"ORGANIZACION Y PREOPERATIVOS "]
[{"$f":"LEN(PUC[[#This Row],[AUXILIAR]])","v":6},171008,"REMODELACIONES "]
[{"$f":"LEN(PUC[[#This Row],[AUXILIAR]])","v":6},171012,"ESTUDIOS, INVESTIGACIONES Y PROYECTOS "]
[{"$f":"LEN(PUC[[#This Row],[AUXILIAR]])","v":6},171016,"PROGRAMAS PARA COMPUTADOR (SOFTWARE) "]
[{"$f":"LEN(PUC[[#This Row],[AUXILIAR]])","v":6},171020,"UTILES Y PAPELERIA "]
[{"$f":"LEN(PUC[[#This Row],[AUXILIAR]])","v":6},171024,"MEJORAS A PROPIEDADES AJENAS "]
[{"$f":"LEN(PUC[[#This Row],[AUXILIAR]])","v":6},171028,"CONTRIBUCIONES Y AFILIACIONES "]
[{"$f":"LEN(PUC[[#This Row],[AUXILIAR]])","v":6},171032,"ENTRENAMIENTO DE PERSONAL "]
[{"$f":"LEN(PUC[[#This Row],[AUXILIAR]])","v":6},171036,"FERIAS Y EXPOSICIONES "]
[{"$f":"LEN(PUC[[#This Row],[AUXILIAR]])","v":6},171040,"LICENCIAS "]
[{"$f":"LEN(PUC[[#This Row],[AUXILIAR]])","v":6},171044,"PUBLICIDAD, PROPAGANDA Y AVISOS "]
[{"$f":"LEN(PUC[[#This Row],[AUXILIAR]])","v":6},171048,"ELEMENTOS DE ASEO Y CAFETERIA "]
[{"$f":"LEN(PUC[[#This Row],[AUXILIAR]])","v":6},171052,"MOLDES Y TROQUELES "]
[{"$f":"LEN(PUC[[#This Row],[AUXILIAR]])","v":6},171056,"INSTRUMENTAL QUIRURGICO "]
[{"$f":"LEN(PUC[[#This Row],[AUXILIAR]])","v":6},171060,"DOTACION Y SUMINISTRO A TRABAJADORES "]
[{"$f":"LEN(PUC[[#This Row],[AUXILIAR]])","v":6},171064,"ELEMENTOS DE ROPERIA Y LENCERIA "]
[{"$f":"LEN(PUC[[#This Row],[AUXILIAR]])","v":6},171068,"LOZA Y CRISTALERIA "]
[{"$f":"LEN(PUC[[#This Row],[AUXILIAR]])","v":6},171072,"DESCUENTO EN COLOCACION DE BONOS "]
[{"$f":"LEN(PUC[[#This Row],[AUXILIAR]])","v":6},171076,"IMPUESTO DE RENTA DIFERIDO \"DEBITOS\" POR DIFERENCIAS TEMPORALES "]
[{"$f":"LEN(PUC[[#This Row],[AUXILIAR]])","v":6},171080,"CONCURSOS Y LICITACIONES "]
[{"$f":"LEN(PUC[[#This Row],[AUXILIAR]])","v":6},171095,"OTROS "]
[{"$f":"LEN(PUC[[#This Row],[AUXILIAR]])","v":6},171099,"AJUSTES POR INFLACION "]
[{"$f":"LEN(PUC[[#This Row],[AUXILIAR]])","v":4},1715,"COSTOS DE EXPLORACION POR AMORTIZAR "]
[{"$f":"LEN(PUC[[#This Row],[AUXILIAR]])","v":6},171505,"POZOS SECOS "]
[{"$f":"LEN(PUC[[#This Row],[AUXILIAR]])","v":6},171510,"POZOS NO COMERCIALES "]
[{"$f":"LEN(PUC[[#This Row],[AUXILIAR]])","v":6},171515,"OTROS COSTOS DE EXPLORACION "]
[{"$f":"LEN(PUC[[#This Row],[AUXILIAR]])","v":6},171599,"AJUSTES POR INFLACION "]
[{"$f":"LEN(PUC[[#This Row],[AUXILIAR]])","v":4},1720,"COSTOS DE EXPLOTACION Y DESARROLLO "]
[{"$f":"LEN(PUC[[#This Row],[AUXILIAR]])","v":6},172005,"PERFORACION Y EXPLOTACION "]
[{"$f":"LEN(PUC[[#This Row],[AUXILIAR]])","v":6},172010,"PERFORACIONES CAMPOS EN DESARROLLO "]
[{"$f":"LEN(PUC[[#This Row],[AUXILIAR]])","v":6},172015,"FACILIDADES DE PRODUCCION "]
[{"$f":"LEN(PUC[[#This Row],[AUXILIAR]])","v":6},172020,"SERVICIO A POZOS "]
[{"$f":"LEN(PUC[[#This Row],[AUXILIAR]])","v":6},172099,"AJUSTES POR INFLACION "]
[{"$f":"LEN(PUC[[#This Row],[AUXILIAR]])","v":4},1730,"CARGOS POR CORRECCION MONETARIA DIFERIDA "]
[{"$f":"LEN(PUC[[#This Row],[AUXILIAR]])","v":4},1798,"AMORTIZACION ACUMULADA "]
[{"$f":"LEN(PUC[[#This Row],[AUXILIAR]])","v":6},179805,"COSTOS DE EXPLORACION POR AMORTIZAR "]
[{"$f":"LEN(PUC[[#This Row],[AUXILIAR]])","v":6},179810,"COSTOS DE EXPLOTACION Y DESARROLLO "]
[{"$f":"LEN(PUC[[#This Row],[AUXILIAR]])","v":6},179899,"AJUSTES POR INFLACION "]
[{"$f":"LEN(PUC[[#This Row],[AUXILIAR]])","v":2},18,"OTROS ACTIVOS "]
[{"$f":"LEN(PUC[[#This Row],[AUXILIAR]])","v":4},1805,"BIENES DE ARTE Y CULTURA "]
[{"$f":"LEN(PUC[[#This Row],[AUXILIAR]])","v":6},180505,"OBRAS DE ARTE "]
[{"$f":"LEN(PUC[[#This Row],[AUXILIAR]])","v":6},180510,"BIBLIOTECAS "]
[{"$f":"LEN(PUC[[#This Row],[AUXILIAR]])","v":6},180595,"OTROS "]
[{"$f":"LEN(PUC[[#This Row],[AUXILIAR]])","v":6},180599,"AJUSTES POR INFLACION "]
[{"$f":"LEN(PUC[[#This Row],[AUXILIAR]])","v":4},1895,"DIVERSOS "]
[{"$f":"LEN(PUC[[#This Row],[AUXILIAR]])","v":6},189505,"MAQUINAS PORTEADORAS "]
[{"$f":"LEN(PUC[[#This Row],[AUXILIAR]])","v":6},189510,"BIENES ENTREGADOS EN COMODATO "]
[{"$f":"LEN(PUC[[#This Row],[AUXILIAR]])","v":6},189515,"AMORTIZACION ACUMULADA DE BIENES ENTREGADOS EN COMODATO (CR) "]
[{"$f":"LEN(PUC[[#This Row],[AUXILIAR]])","v":6},189520,"BIENES RECIBIDOS EN PAGO "]
[{"$f":"LEN(PUC[[#This Row],[AUXILIAR]])","v":6},189525,"DERECHOS SUCESORALES "]
[{"$f":"LEN(PUC[[#This Row],[AUXILIAR]])","v":6},189530,"ESTAMPILLAS "]
[{"$f":"LEN(PUC[[#This Row],[AUXILIAR]])","v":6},189595,"OTROS "]
[{"$f":"LEN(PUC[[#This Row],[AUXILIAR]])","v":6},189599,"AJUSTES POR INFLACION "]
[{"$f":"LEN(PUC[[#This Row],[AUXILIAR]])","v":4},1899,"PROVISIONES "]
[{"$f":"LEN(PUC[[#This Row],[AUXILIAR]])","v":6},189905,"BIENES DE ARTE Y CULTURA "]
[{"$f":"LEN(PUC[[#This Row],[AUXILIAR]])","v":6},189995,"DIVERSOS "]
[{"$f":"LEN(PUC[[#This Row],[AUXILIAR]])","v":2},19,"VALORIZACIONES "]
[{"$f":"LEN(PUC[[#This Row],[AUXILIAR]])","v":4},1905,"DE INVERSIONES "]
[{"$f":"LEN(PUC[[#This Row],[AUXILIAR]])","v":6},190505,"ACCIONES "]
[{"$f":"LEN(PUC[[#This Row],[AUXILIAR]])","v":6},190510,"CUOTAS O PARTES DE INTERES SOCIAL "]
[{"$f":"LEN(PUC[[#This Row],[AUXILIAR]])","v":6},190515,"DERECHOS FIDUCIARIOS "]
[{"$f":"LEN(PUC[[#This Row],[AUXILIAR]])","v":4},1910,"DE PROPIEDADES PLANTA Y EQUIPO "]
[{"$f":"LEN(PUC[[#This Row],[AUXILIAR]])","v":6},191004,"TERRENOS "]
[{"$f":"LEN(PUC[[#This Row],[AUXILIAR]])","v":6},191006,"MATERIALES PROYECTOS PETROLEROS "]
[{"$f":"LEN(PUC[[#This Row],[AUXILIAR]])","v":6},191008,"CONSTRUCCIONES Y EDIFICACIONES "]
[{"$f":"LEN(PUC[[#This Row],[AUXILIAR]])","v":6},191012,"MAQUINARIA Y EQUIPO "]
[{"$f":"LEN(PUC[[#This Row],[AUXILIAR]])","v":6},191016,"EQUIPO DE OFICINA "]
[{"$f":"LEN(PUC[[#This Row],[AUXILIAR]])","v":6},191020,"EQUIPO DE COMPUTACION Y COMUNICACION "]
[{"$f":"LEN(PUC[[#This Row],[AUXILIAR]])","v":6},191024,"EQUIPO MEDICO CIENTIFICO "]
[{"$f":"LEN(PUC[[#This Row],[AUXILIAR]])","v":6},191028,"EQUIPO DE HOTELES Y RESTAURANTES "]
[{"$f":"LEN(PUC[[#This Row],[AUXILIAR]])","v":6},191032,"FLOTA Y EQUIPO DE TRANSPORTE "]
[{"$f":"LEN(PUC[[#This Row],[AUXILIAR]])","v":6},191036,"FLOTA Y EQUIPO FLUVIAL Y/O MARITIMO "]
[{"$f":"LEN(PUC[[#This Row],[AUXILIAR]])","v":6},191040,"FLOTA Y EQUIPO AEREO "]
[{"$f":"LEN(PUC[[#This Row],[AUXILIAR]])","v":6},191044,"FLOTA Y EQUIPO FERREO "]
[{"$f":"LEN(PUC[[#This Row],[AUXILIAR]])","v":6},191048,"ACUEDUCTOS PLANTAS Y REDES "]
[{"$f":"LEN(PUC[[#This Row],[AUXILIAR]])","v":6},191052,"ARMAMENTO DE VIGILANCIA "]
[{"$f":"LEN(PUC[[#This Row],[AUXILIAR]])","v":6},191056,"ENVASES Y EMPAQUES "]
[{"$f":"LEN(PUC[[#This Row],[AUXILIAR]])","v":6},191060,"PLANTACIONES AGRICOLAS Y FORESTALES "]
[{"$f":"LEN(PUC[[#This Row],[AUXILIAR]])","v":6},191064,"VIAS DE COMUNICACION "]
[{"$f":"LEN(PUC[[#This Row],[AUXILIAR]])","v":6},191068,"MINAS Y CANTERAS "]
[{"$f":"LEN(PUC[[#This Row],[AUXILIAR]])","v":6},191072,"POZOS ARTESIANOS "]
[{"$f":"LEN(PUC[[#This Row],[AUXILIAR]])","v":6},191076,"YACIMIENTOS "]
[{"$f":"LEN(PUC[[#This Row],[AUXILIAR]])","v":6},191080,"SEMOVIENTES "]
[{"$f":"LEN(PUC[[#This Row],[AUXILIAR]])","v":4},1995,"DE OTROS ACTIVOS "]
[{"$f":"LEN(PUC[[#This Row],[AUXILIAR]])","v":6},199505,"BIENES DE ARTE Y CULTURA "]
[{"$f":"LEN(PUC[[#This Row],[AUXILIAR]])","v":6},199510,"BIENES ENTREGADOS EN COMODATO "]
[{"$f":"LEN(PUC[[#This Row],[AUXILIAR]])","v":6},199515,"BIENES RECIBIDOS EN PAGO "]
[{"$f":"LEN(PUC[[#This Row],[AUXILIAR]])","v":6},199520,"INVENTARIO DE SEMOVIENTES "]
[{"$f":"LEN(PUC[[#This Row],[AUXILIAR]])","v":1},2,"PASIVO "]
[{"$f":"LEN(PUC[[#This Row],[AUXILIAR]])","v":2},21,"OBLIGACIONES FINANCIERAS "]
[{"$f":"LEN(PUC[[#This Row],[AUXILIAR]])","v":4},2105,"BANCOS NACIONALES "]
[{"$f":"LEN(PUC[[#This Row],[AUXILIAR]])","v":6},210505,"SOBREGIROS "]
[{"$f":"LEN(PUC[[#This Row],[AUXILIAR]])","v":6},210510,"PAGARES "]
[{"$f":"LEN(PUC[[#This Row],[AUXILIAR]])","v":6},210515,"CARTAS DE CREDITO "]
[{"$f":"LEN(PUC[[#This Row],[AUXILIAR]])","v":6},210520,"ACEPTACIONES BANCARIAS "]
[{"$f":"LEN(PUC[[#This Row],[AUXILIAR]])","v":4},2110,"BANCOS DEL EXTERIOR "]
[{"$f":"LEN(PUC[[#This Row],[AUXILIAR]])","v":6},211005,"SOBREGIROS "]
[{"$f":"LEN(PUC[[#This Row],[AUXILIAR]])","v":6},211010,"PAGARES "]
[{"$f":"LEN(PUC[[#This Row],[AUXILIAR]])","v":6},211015,"CARTAS DE CREDITO "]
[{"$f":"LEN(PUC[[#This Row],[AUXILIAR]])","v":6},211020,"ACEPTACIONES BANCARIAS "]
[{"$f":"LEN(PUC[[#This Row],[AUXILIAR]])","v":4},2115,"CORPORACIONES FINANCIERAS "]
[{"$f":"LEN(PUC[[#This Row],[AUXILIAR]])","v":6},211505,"PAGARES "]
[{"$f":"LEN(PUC[[#This Row],[AUXILIAR]])","v":6},211510,"ACEPTACIONES FINANCIERAS "]
[{"$f":"LEN(PUC[[#This Row],[AUXILIAR]])","v":6},211515,"CARTAS DE CREDITO "]
[{"$f":"LEN(PUC[[#This Row],[AUXILIAR]])","v":4},2120,"COMPAÑIAS DE FINANCIAMIENTO COMERCIAL "]
[{"$f":"LEN(PUC[[#This Row],[AUXILIAR]])","v":6},212005,"PAGARES "]
[{"$f":"LEN(PUC[[#This Row],[AUXILIAR]])","v":6},212010,"ACEPTACIONES FINANCIERAS "]
[{"$f":"LEN(PUC[[#This Row],[AUXILIAR]])","v":4},2125,"CORPORACIONES DE AHORRO Y VIVIENDA "]
[{"$f":"LEN(PUC[[#This Row],[AUXILIAR]])","v":6},212505,"SOBREGIROS "]
[{"$f":"LEN(PUC[[#This Row],[AUXILIAR]])","v":6},212510,"PAGARES "]
[{"$f":"LEN(PUC[[#This Row],[AUXILIAR]])","v":6},212515,"HIPOTECARIAS "]
[{"$f":"LEN(PUC[[#This Row],[AUXILIAR]])","v":4},2130,"ENTIDADES FINANCIERAS DEL EXTERIOR "]
[{"$f":"LEN(PUC[[#This Row],[AUXILIAR]])","v":4},2135,"COMPROMISOS DE RECOMPRA DE INVERSIONES NEGOCIADAS "]
[{"$f":"LEN(PUC[[#This Row],[AUXILIAR]])","v":6},213505,"ACCIONES "]
[{"$f":"LEN(PUC[[#This Row],[AUXILIAR]])","v":6},213510,"CUOTAS O PARTES DE INTERES SOCIAL "]
[{"$f":"LEN(PUC[[#This Row],[AUXILIAR]])","v":6},213515,"BONOS "]
[{"$f":"LEN(PUC[[#This Row],[AUXILIAR]])","v":6},213520,"CEDULAS "]
[{"$f":"LEN(PUC[[#This Row],[AUXILIAR]])","v":6},213525,"CERTIFICADOS "]
[{"$f":"LEN(PUC[[#This Row],[AUXILIAR]])","v":6},213530,"PAPELES COMERCIALES "]
[{"$f":"LEN(PUC[[#This Row],[AUXILIAR]])","v":6},213535,"TITULOS "]
[{"$f":"LEN(PUC[[#This Row],[AUXILIAR]])","v":6},213540,"ACEPTACIONES BANCARIAS O FINANCIERAS "]
[{"$f":"LEN(PUC[[#This Row],[AUXILIAR]])","v":6},213595,"OTROS "]
[{"$f":"LEN(PUC[[#This Row],[AUXILIAR]])","v":4},2140,"COMPROMISOS DE RECOMPRA DE CARTERA NEGOCIADA "]
[{"$f":"LEN(PUC[[#This Row],[AUXILIAR]])","v":4},2145,"OBLIGACIONES GUBERNAMENTALES "]
[{"$f":"LEN(PUC[[#This Row],[AUXILIAR]])","v":6},214505,"GOBIERNO NACIONAL "]
[{"$f":"LEN(PUC[[#This Row],[AUXILIAR]])","v":6},214510,"ENTIDADES OFICIALES "]
[{"$f":"LEN(PUC[[#This Row],[AUXILIAR]])","v":4},2195,"OTRAS OBLIGACIONES "]
[{"$f":"LEN(PUC[[#This Row],[AUXILIAR]])","v":6},219505,"PARTICULARES "]
[{"$f":"LEN(PUC[[#This Row],[AUXILIAR]])","v":6},219510,"COMPAÑIAS VINCULADAS "]
[{"$f":"LEN(PUC[[#This Row],[AUXILIAR]])","v":6},219515,"CASA MATRIZ "]
[{"$f":"LEN(PUC[[#This Row],[AUXILIAR]])","v":6},219520,"SOCIOS O ACCIONISTAS "]
[{"$f":"LEN(PUC[[#This Row],[AUXILIAR]])","v":6},219525,"FONDOS Y COOPERATIVAS "]
[{"$f":"LEN(PUC[[#This Row],[AUXILIAR]])","v":6},219595,"OTRAS "]
[{"$f":"LEN(PUC[[#This Row],[AUXILIAR]])","v":2},22,"PROVEEDORES "]
[{"$f":"LEN(PUC[[#This Row],[AUXILIAR]])","v":4},2205,"NACIONALES "]
[{"$f":"LEN(PUC[[#This Row],[AUXILIAR]])","v":6},250505,"PROVEEDORES NACIONALES"]
[{"$f":"LEN(PUC[[#This Row],[AUXILIAR]])","v":4},2210,"DEL EXTERIOR "]
[{"$f":"LEN(PUC[[#This Row],[AUXILIAR]])","v":4},2215,"CUENTAS CORRIENTES COMERCIALES "]
[{"$f":"LEN(PUC[[#This Row],[AUXILIAR]])","v":4},2220,"CASA MATRIZ "]
[{"$f":"LEN(PUC[[#This Row],[AUXILIAR]])","v":4},2225,"COMPAÑIAS VINCULADAS "]
[{"$f":"LEN(PUC[[#This Row],[AUXILIAR]])","v":2},23,"CUENTAS POR PAGAR "]
[{"$f":"LEN(PUC[[#This Row],[AUXILIAR]])","v":4},2305,"CUENTAS CORRIENTES COMERCIALES "]
[{"$f":"LEN(PUC[[#This Row],[AUXILIAR]])","v":4},2310,"A CASA MATRIZ "]
[{"$f":"LEN(PUC[[#This Row],[AUXILIAR]])","v":4},2315,"A COMPAÑIAS VINCULADAS "]
[{"$f":"LEN(PUC[[#This Row],[AUXILIAR]])","v":4},2320,"A CONTRATISTAS "]
[{"$f":"LEN(PUC[[#This Row],[AUXILIAR]])","v":4},2330,"ORDENES DE COMPRA POR UTILIZAR "]
[{"$f":"LEN(PUC[[#This Row],[AUXILIAR]])","v":4},2335,"COSTOS Y GASTOS POR PAGAR "]
[{"$f":"LEN(PUC[[#This Row],[AUXILIAR]])","v":6},233505,"GASTOS FINANCIEROS "]
[{"$f":"LEN(PUC[[#This Row],[AUXILIAR]])","v":6},233510,"GASTOS LEGALES "]
[{"$f":"LEN(PUC[[#This Row],[AUXILIAR]])","v":6},233515,"LIBROS, SUSCRIPCIONES, PERIODICOS Y REVISTAS "]
[{"$f":"LEN(PUC[[#This Row],[AUXILIAR]])","v":6},233520,"COMISIONES "]
[{"$f":"LEN(PUC[[#This Row],[AUXILIAR]])","v":6},233525,"HONORARIOS "]
[{"$f":"LEN(PUC[[#This Row],[AUXILIAR]])","v":6},233530,"SERVICIOS TECNICOS "]
[{"$f":"LEN(PUC[[#This Row],[AUXILIAR]])","v":6},233535,"SERVICIOS DE MANTENIMIENTO "]
[{"$f":"LEN(PUC[[#This Row],[AUXILIAR]])","v":6},233540,"ARRENDAMIENTOS "]
[{"$f":"LEN(PUC[[#This Row],[AUXILIAR]])","v":6},233545,"TRANSPORTES, FLETES Y ACARREOS "]
[{"$f":"LEN(PUC[[#This Row],[AUXILIAR]])","v":6},233550,"SERVICIOS PUBLICOS "]
[{"$f":"LEN(PUC[[#This Row],[AUXILIAR]])","v":6},233555,"SEGUROS "]
[{"$f":"LEN(PUC[[#This Row],[AUXILIAR]])","v":6},233560,"GASTOS DE VIAJE "]
[{"$f":"LEN(PUC[[#This Row],[AUXILIAR]])","v":6},233565,"GASTOS DE REPRESENTACION Y RELACIONES PUBLICAS "]
[{"$f":"LEN(PUC[[#This Row],[AUXILIAR]])","v":6},233570,"SERVICIOS ADUANEROS "]
[{"$f":"LEN(PUC[[#This Row],[AUXILIAR]])","v":6},233595,"OTROS SERVICIOS"]
[{"$f":"LEN(PUC[[#This Row],[AUXILIAR]])","v":4},2340,"INSTALAMENTOS POR PAGAR "]
[{"$f":"LEN(PUC[[#This Row],[AUXILIAR]])","v":4},2345,"ACREEDORES OFICIALES "]
[{"$f":"LEN(PUC[[#This Row],[AUXILIAR]])","v":4},2350,"REGALIAS POR PAGAR "]
[{"$f":"LEN(PUC[[#This Row],[AUXILIAR]])","v":4},2355,"DEUDAS CON ACCIONISTAS O SOCIOS "]
[{"$f":"LEN(PUC[[#This Row],[AUXILIAR]])","v":6},235505,"ACCIONISTAS "]
[{"$f":"LEN(PUC[[#This Row],[AUXILIAR]])","v":6},235510,"SOCIOS "]
[{"$f":"LEN(PUC[[#This Row],[AUXILIAR]])","v":4},2360,"DIVIDENDOS O PARTICIPACIONES POR PAGAR "]
[{"$f":"LEN(PUC[[#This Row],[AUXILIAR]])","v":6},236005,"DIVIDENDOS "]
[{"$f":"LEN(PUC[[#This Row],[AUXILIAR]])","v":6},236010,"PARTICIPACIONES "]
[{"$f":"LEN(PUC[[#This Row],[AUXILIAR]])","v":4},2365,"RETENCION EN LA FUENTE "]
[{"$f":"LEN(PUC[[#This Row],[AUXILIAR]])","v":6},236505,"SALARIOS Y PAGOS LABORALES "]
[{"$f":"LEN(PUC[[#This Row],[AUXILIAR]])","v":6},236510,"DIVIDENDOS Y/O PARTICIPACIONES "]
[{"$f":"LEN(PUC[[#This Row],[AUXILIAR]])","v":6},236515,"HONORARIOS "]
[{"$f":"LEN(PUC[[#This Row],[AUXILIAR]])","v":6},236520,"COMISIONES "]
[{"$f":"LEN(PUC[[#This Row],[AUXILIAR]])","v":6},236525,"SERVICIOS "]
[{"$f":"LEN(PUC[[#This Row],[AUXILIAR]])","v":6},236530,"ARRENDAMIENTOS "]
[{"$f":"LEN(PUC[[#This Row],[AUXILIAR]])","v":6},236535,"RENDIMIENTOS FINANCIEROS "]
[{"$f":"LEN(PUC[[#This Row],[AUXILIAR]])","v":6},236540,"COMPRAS "]
[{"$f":"LEN(PUC[[#This Row],[AUXILIAR]])","v":6},236545,"LOTERIAS, RIFAS, APUESTAS Y SIMILARES "]
[{"$f":"LEN(PUC[[#This Row],[AUXILIAR]])","v":6},236550,"POR PAGOS AL EXTERIOR "]
[{"$f":"LEN(PUC[[#This Row],[AUXILIAR]])","v":6},236555,"POR INGRESOS OBTENIDOS EN EL EXTERIOR "]
[{"$f":"LEN(PUC[[#This Row],[AUXILIAR]])","v":6},236560,"ENAJENACION PROPIEDADES PLANTA Y EQUIPO PERSONAS NATURALES "]
[{"$f":"LEN(PUC[[#This Row],[AUXILIAR]])","v":6},236565,"POR IMPUESTO DE TIMBRE "]
[{"$f":"LEN(PUC[[#This Row],[AUXILIAR]])","v":6},236570,"OTRAS RETENCIONES Y PATRIMONIO "]
[{"$f":"LEN(PUC[[#This Row],[AUXILIAR]])","v":6},236575,"AUTORRETENCIONES "]
[{"$f":"LEN(PUC[[#This Row],[AUXILIAR]])","v":4},2370,"RETENCIONES Y APORTES DE NOMINA "]
[{"$f":"LEN(PUC[[#This Row],[AUXILIAR]])","v":6},237005,"APORTES AL I.S.S. "]
[{"$f":"LEN(PUC[[#This Row],[AUXILIAR]])","v":6},237010,"APORTES AL I.C.B.F., SENA Y CAJAS DE COMPENSACION "]
[{"$f":"LEN(PUC[[#This Row],[AUXILIAR]])","v":6},237015,"APORTES AL F.I.C. "]
[{"$f":"LEN(PUC[[#This Row],[AUXILIAR]])","v":6},237025,"EMBARGOS JUDICIALES "]
[{"$f":"LEN(PUC[[#This Row],[AUXILIAR]])","v":6},237030,"LIBRANZAS "]
[{"$f":"LEN(PUC[[#This Row],[AUXILIAR]])","v":6},237035,"SINDICATOS "]
[{"$f":"LEN(PUC[[#This Row],[AUXILIAR]])","v":6},237040,"COOPERATIVAS "]
[{"$f":"LEN(PUC[[#This Row],[AUXILIAR]])","v":6},237045,"FONDOS "]
[{"$f":"LEN(PUC[[#This Row],[AUXILIAR]])","v":6},237095,"OTROS "]
[{"$f":"LEN(PUC[[#This Row],[AUXILIAR]])","v":4},2375,"CUOTAS POR DEVOLVER "]
[{"$f":"LEN(PUC[[#This Row],[AUXILIAR]])","v":4},2380,"ACREEDORES VARIOS "]
[{"$f":"LEN(PUC[[#This Row],[AUXILIAR]])","v":6},238005,"DEPOSITARIOS "]
[{"$f":"LEN(PUC[[#This Row],[AUXILIAR]])","v":6},238010,"COMISIONISTAS DE BOLSAS "]
[{"$f":"LEN(PUC[[#This Row],[AUXILIAR]])","v":6},238015,"SOCIEDAD ADMINISTRADORA - FONDOS DE INVERSION "]
[{"$f":"LEN(PUC[[#This Row],[AUXILIAR]])","v":6},238020,"REINTEGROS POR PAGAR "]
[{"$f":"LEN(PUC[[#This Row],[AUXILIAR]])","v":6},238025,"FONDO DE PERSEVERANCIA "]
[{"$f":"LEN(PUC[[#This Row],[AUXILIAR]])","v":6},238030,"FONDOS DE CESANTIAS Y/O PENSIONES "]
[{"$f":"LEN(PUC[[#This Row],[AUXILIAR]])","v":6},238035,"DONACIONES ASIGNADAS POR PAGAR "]
[{"$f":"LEN(PUC[[#This Row],[AUXILIAR]])","v":6},238095,"OTROS "]
[{"$f":"LEN(PUC[[#This Row],[AUXILIAR]])","v":2},24,"IMPUESTOS, GRAVAMENES Y TASAS "]
[{"$f":"LEN(PUC[[#This Row],[AUXILIAR]])","v":4},2404,"DE RENTA Y COMPLEMENTARIOS "]
[{"$f":"LEN(PUC[[#This Row],[AUXILIAR]])","v":6},240405,"VIGENCIA FISCAL CORRIENTE "]
[{"$f":"LEN(PUC[[#This Row],[AUXILIAR]])","v":6},240410,"VIGENCIAS FISCALES ANTERIORES "]
[{"$f":"LEN(PUC[[#This Row],[AUXILIAR]])","v":4},2408,"IMPUESTO SOBRE LAS VENTAS POR PAGAR "]
[{"$f":"LEN(PUC[[#This Row],[AUXILIAR]])","v":4},2412,"DE INDUSTRIA Y COMERCIO "]
[{"$f":"LEN(PUC[[#This Row],[AUXILIAR]])","v":6},241205,"VIGENCIA FISCAL CORRIENTE "]
[{"$f":"LEN(PUC[[#This Row],[AUXILIAR]])","v":6},241210,"VIGENCIAS FISCALES ANTERIORES "]
[{"$f":"LEN(PUC[[#This Row],[AUXILIAR]])","v":4},2416,"A LA PROPIEDAD RAIZ "]
[{"$f":"LEN(PUC[[#This Row],[AUXILIAR]])","v":4},2420,"DERECHOS SOBRE INSTRUMENTOS PUBLICOS "]
[{"$f":"LEN(PUC[[#This Row],[AUXILIAR]])","v":4},2424,"DE VALORIZACION "]
[{"$f":"LEN(PUC[[#This Row],[AUXILIAR]])","v":6},242405,"VIGENCIA FISCAL CORRIENTE "]
[{"$f":"LEN(PUC[[#This Row],[AUXILIAR]])","v":6},242410,"VIGENCIAS FISCALES ANTERIORES "]
[{"$f":"LEN(PUC[[#This Row],[AUXILIAR]])","v":4},2428,"DE TURISMO "]
[{"$f":"LEN(PUC[[#This Row],[AUXILIAR]])","v":4},2432,"TASA POR UTILIZACION DE PUERTOS "]
[{"$f":"LEN(PUC[[#This Row],[AUXILIAR]])","v":4},2436,"DE VEHICULOS "]
[{"$f":"LEN(PUC[[#This Row],[AUXILIAR]])","v":6},243605,"VIGENCIA FISCAL CORRIENTE "]
[{"$f":"LEN(PUC[[#This Row],[AUXILIAR]])","v":6},243610,"VIGENCIAS FISCALES ANTERIORES "]
[{"$f":"LEN(PUC[[#This Row],[AUXILIAR]])","v":4},2440,"DE ESPECTACULOS PUBLICOS "]
[{"$f":"LEN(PUC[[#This Row],[AUXILIAR]])","v":4},2444,"DE HIDROCARBUROS Y MINAS "]
[{"$f":"LEN(PUC[[#This Row],[AUXILIAR]])","v":6},244405,"DE HIDROCARBUROS "]
[{"$f":"LEN(PUC[[#This Row],[AUXILIAR]])","v":6},244410,"DE MINAS "]
[{"$f":"LEN(PUC[[#This Row],[AUXILIAR]])","v":4},2448,"REGALIAS E IMPUESTOS A LA PEQUEÑA Y MEDIANA MINERIA "]
[{"$f":"LEN(PUC[[#This Row],[AUXILIAR]])","v":4},2452,"A LAS EXPORTACIONES CAFETERAS "]
[{"$f":"LEN(PUC[[#This Row],[AUXILIAR]])","v":4},2456,"A LAS IMPORTACIONES "]
[{"$f":"LEN(PUC[[#This Row],[AUXILIAR]])","v":4},2460,"CUOTAS DE FOMENTO "]
[{"$f":"LEN(PUC[[#This Row],[AUXILIAR]])","v":4},2464,"DE LICORES, CERVEZAS Y CIGARRILLOS "]
[{"$f":"LEN(PUC[[#This Row],[AUXILIAR]])","v":6},246405,"DE LICORES "]
[{"$f":"LEN(PUC[[#This Row],[AUXILIAR]])","v":6},246410,"DE CERVEZAS "]
[{"$f":"LEN(PUC[[#This Row],[AUXILIAR]])","v":6},246415,"DE CIGARRILLOS "]
[{"$f":"LEN(PUC[[#This Row],[AUXILIAR]])","v":4},2468,"AL SACRIFICIO DE GANADO "]
[{"$f":"LEN(PUC[[#This Row],[AUXILIAR]])","v":4},2472,"AL AZAR Y JUEGOS "]
[{"$f":"LEN(PUC[[#This Row],[AUXILIAR]])","v":4},2476,"GRAVAMENES Y REGALIAS POR UTILIZACION DEL SUELO "]
[{"$f":"LEN(PUC[[#This Row],[AUXILIAR]])","v":4},2495,"OTROS "]
[{"$f":"LEN(PUC[[#This Row],[AUXILIAR]])","v":2},25,"OBLIGACIONES LABORALES "]
[{"$f":"LEN(PUC[[#This Row],[AUXILIAR]])","v":4},2505,"SALARIOS POR PAGAR "]
[{"$f":"LEN(PUC[[#This Row],[AUXILIAR]])","v":6},250501,"SALARIOS POR PAGAR "]
[{"$f":"LEN(PUC[[#This Row],[AUXILIAR]])","v":4},2510,"CESANTIAS CONSOLIDADAS "]
[{"$f":"LEN(PUC[[#This Row],[AUXILIAR]])","v":6},251005,"LEY LABORAL ANTERIOR "]
[{"$f":"LEN(PUC[[#This Row],[AUXILIAR]])","v":6},251010,"LEY 50 DE 1990 Y NORMAS POSTERIORES "]
[{"$f":"LEN(PUC[[#This Row],[AUXILIAR]])","v":4},2515,"INTERESES SOBRE CESANTIAS "]
[{"$f":"LEN(PUC[[#This Row],[AUXILIAR]])","v":4},2520,"PRIMA DE SERVICIOS "]
[{"$f":"LEN(PUC[[#This Row],[AUXILIAR]])","v":4},2525,"VACACIONES CONSOLIDADAS "]
[{"$f":"LEN(PUC[[#This Row],[AUXILIAR]])","v":4},2530,"PRESTACIONES EXTRALEGALES "]
[{"$f":"LEN(PUC[[#This Row],[AUXILIAR]])","v":6},253005,"PRIMAS "]
[{"$f":"LEN(PUC[[#This Row],[AUXILIAR]])","v":6},253010,"AUXILIOS "]
[{"$f":"LEN(PUC[[#This Row],[AUXILIAR]])","v":6},253015,"DOTACION Y SUMINISTRO A TRABAJADORES "]
[{"$f":"LEN(PUC[[#This Row],[AUXILIAR]])","v":6},253020,"BONIFICACIONES "]
[{"$f":"LEN(PUC[[#This Row],[AUXILIAR]])","v":6},253025,"SEGUROS "]
[{"$f":"LEN(PUC[[#This Row],[AUXILIAR]])","v":6},253095,"OTRAS "]
[{"$f":"LEN(PUC[[#This Row],[AUXILIAR]])","v":4},2532,"PENSIONES POR PAGAR "]
[{"$f":"LEN(PUC[[#This Row],[AUXILIAR]])","v":4},2535,"CUOTAS PARTES PENSIONES DE JUBILACION "]
[{"$f":"LEN(PUC[[#This Row],[AUXILIAR]])","v":4},2540,"INDEMNIZACIONES LABORALES "]
[{"$f":"LEN(PUC[[#This Row],[AUXILIAR]])","v":2},26,"PASIVOS ESTIMADOS Y PROVISIONES "]
[{"$f":"LEN(PUC[[#This Row],[AUXILIAR]])","v":4},2605,"PARA COSTOS Y GASTOS "]
[{"$f":"LEN(PUC[[#This Row],[AUXILIAR]])","v":6},260505,"INTERESES "]
[{"$f":"LEN(PUC[[#This Row],[AUXILIAR]])","v":6},260510,"COMISIONES "]
[{"$f":"LEN(PUC[[#This Row],[AUXILIAR]])","v":6},260515,"HONORARIOS "]
[{"$f":"LEN(PUC[[#This Row],[AUXILIAR]])","v":6},260520,"SERVICIOS TECNICOS "]
[{"$f":"LEN(PUC[[#This Row],[AUXILIAR]])","v":6},260525,"TRANSPORTES, FLETES Y ACARREOS "]
[{"$f":"LEN(PUC[[#This Row],[AUXILIAR]])","v":6},260530,"GASTOS DE VIAJE "]
[{"$f":"LEN(PUC[[#This Row],[AUXILIAR]])","v":6},260535,"SERVICIOS PUBLICOS "]
[{"$f":"LEN(PUC[[#This Row],[AUXILIAR]])","v":6},260540,"REGALIAS "]
[{"$f":"LEN(PUC[[#This Row],[AUXILIAR]])","v":6},260545,"GARANTIAS "]
[{"$f":"LEN(PUC[[#This Row],[AUXILIAR]])","v":6},260550,"MATERIALES Y REPUESTOS "]
[{"$f":"LEN(PUC[[#This Row],[AUXILIAR]])","v":6},260595,"OTROS "]
[{"$f":"LEN(PUC[[#This Row],[AUXILIAR]])","v":4},2610,"PARA OBLIGACIONES LABORALES "]
[{"$f":"LEN(PUC[[#This Row],[AUXILIAR]])","v":6},261005,"CESANTIAS "]
[{"$f":"LEN(PUC[[#This Row],[AUXILIAR]])","v":6},261010,"INTERESES SOBRE CESANTIAS "]
[{"$f":"LEN(PUC[[#This Row],[AUXILIAR]])","v":6},261015,"VACACIONES "]
[{"$f":"LEN(PUC[[#This Row],[AUXILIAR]])","v":6},261020,"PRIMA DE SERVICIOS "]
[{"$f":"LEN(PUC[[#This Row],[AUXILIAR]])","v":6},261025,"PRESTACIONES EXTRALEGALES "]
[{"$f":"LEN(PUC[[#This Row],[AUXILIAR]])","v":6},261030,"VIATICOS "]
[{"$f":"LEN(PUC[[#This Row],[AUXILIAR]])","v":6},261095,"OTRAS "]
[{"$f":"LEN(PUC[[#This Row],[AUXILIAR]])","v":4},2615,"PARA OBLIGACIONES FISCALES "]
[{"$f":"LEN(PUC[[#This Row],[AUXILIAR]])","v":6},261505,"DE RENTA Y COMPLEMENTARIOS "]
[{"$f":"LEN(PUC[[#This Row],[AUXILIAR]])","v":6},261510,"DE INDUSTRIA Y COMERCIO "]
[{"$f":"LEN(PUC[[#This Row],[AUXILIAR]])","v":6},261515,"TASA POR UTILIZACION DE PUERTOS "]
[{"$f":"LEN(PUC[[#This Row],[AUXILIAR]])","v":6},261520,"DE VEHICULOS "]
[{"$f":"LEN(PUC[[#This Row],[AUXILIAR]])","v":6},261525,"DE HIDROCARBUROS Y MINAS "]
[{"$f":"LEN(PUC[[#This Row],[AUXILIAR]])","v":6},261595,"OTROS "]
[{"$f":"LEN(PUC[[#This Row],[AUXILIAR]])","v":4},2620,"PENSIONES DE JUBILACION "]
[{"$f":"LEN(PUC[[#This Row],[AUXILIAR]])","v":6},262005,"CALCULO ACTUARIAL PENSIONES DE JUBILACION "]
[{"$f":"LEN(PUC[[#This Row],[AUXILIAR]])","v":6},262010,"PENSIONES DE JUBILACION POR AMORTIZAR (DB) "]
[{"$f":"LEN(PUC[[#This Row],[AUXILIAR]])","v":4},2625,"PARA OBRAS DE URBANISMO "]
[{"$f":"LEN(PUC[[#This Row],[AUXILIAR]])","v":6},262505,"ACUEDUCTO Y ALCANTARILLADO "]
[{"$f":"LEN(PUC[[#This Row],[AUXILIAR]])","v":6},262510,"ENERGIA ELECTRICA "]
[{"$f":"LEN(PUC[[#This Row],[AUXILIAR]])","v":6},262515,"TELEFONOS "]
[{"$f":"LEN(PUC[[#This Row],[AUXILIAR]])","v":6},262595,"OTROS "]
[{"$f":"LEN(PUC[[#This Row],[AUXILIAR]])","v":4},2630,"PARA MANTENIMIENTO Y REPARACIONES "]
[{"$f":"LEN(PUC[[#This Row],[AUXILIAR]])","v":6},263005,"TERRENOS "]
[{"$f":"LEN(PUC[[#This Row],[AUXILIAR]])","v":6},263010,"CONSTRUCCIONES Y EDIFICACIONES "]
[{"$f":"LEN(PUC[[#This Row],[AUXILIAR]])","v":6},263015,"MAQUINARIA Y EQUIPO "]
[{"$f":"LEN(PUC[[#This Row],[AUXILIAR]])","v":6},263020,"EQUIPO DE OFICINA "]
[{"$f":"LEN(PUC[[#This Row],[AUXILIAR]])","v":6},263025,"EQUIPO DE COMPUTACION Y COMUNICACION "]
[{"$f":"LEN(PUC[[#This Row],[AUXILIAR]])","v":6},263030,"EQUIPO MEDICO - CIENTIFICO "]
[{"$f":"LEN(PUC[[#This Row],[AUXILIAR]])","v":6},263035,"EQUIPO DE HOTELES Y RESTAURANTES "]
[{"$f":"LEN(PUC[[#This Row],[AUXILIAR]])","v":6},263040,"FLOTA Y EQUIPO DE TRANSPORTE "]
[{"$f":"LEN(PUC[[#This Row],[AUXILIAR]])","v":6},263045,"FLOTA Y EQUIPO FLUVIAL Y/O MARITIMO "]
[{"$f":"LEN(PUC[[#This Row],[AUXILIAR]])","v":6},263050,"FLOTA Y EQUIPO AEREO "]
[{"$f":"LEN(PUC[[#This Row],[AUXILIAR]])","v":6},263055,"FLOTA Y EQUIPO FERREO "]
[{"$f":"LEN(PUC[[#This Row],[AUXILIAR]])","v":6},263060,"ACUEDUCTOS PLANTAS Y REDES "]
[{"$f":"LEN(PUC[[#This Row],[AUXILIAR]])","v":6},263065,"ARMAMENTO DE VIGILANCIA "]
[{"$f":"LEN(PUC[[#This Row],[AUXILIAR]])","v":6},263070,"ENVASES Y EMPAQUES "]
[{"$f":"LEN(PUC[[#This Row],[AUXILIAR]])","v":6},263075,"PLANTACIONES AGRICOLAS Y FORESTALES "]
[{"$f":"LEN(PUC[[#This Row],[AUXILIAR]])","v":6},263080,"VIAS DE CUMUNICACION "]
[{"$f":"LEN(PUC[[#This Row],[AUXILIAR]])","v":6},263085,"POZOS ARTESIANOS "]
[{"$f":"LEN(PUC[[#This Row],[AUXILIAR]])","v":6},263095,"OTROS "]
[{"$f":"LEN(PUC[[#This Row],[AUXILIAR]])","v":4},2635,"PARA CONTINGENCIAS "]
[{"$f":"LEN(PUC[[#This Row],[AUXILIAR]])","v":6},263505,"MULTAS Y SANCIONES AUTORIDADES ADMINISTRATIVAS "]
[{"$f":"LEN(PUC[[#This Row],[AUXILIAR]])","v":6},263510,"INTERESES POR MULTAS Y SANCIONES "]
[{"$f":"LEN(PUC[[#This Row],[AUXILIAR]])","v":6},263515,"RECLAMOS "]
[{"$f":"LEN(PUC[[#This Row],[AUXILIAR]])","v":6},263520,"LABORALES "]
[{"$f":"LEN(PUC[[#This Row],[AUXILIAR]])","v":6},263525,"CIVILES "]
[{"$f":"LEN(PUC[[#This Row],[AUXILIAR]])","v":6},263530,"PENALES "]
[{"$f":"LEN(PUC[[#This Row],[AUXILIAR]])","v":6},263535,"ADMINISTRATIVOS "]
[{"$f":"LEN(PUC[[#This Row],[AUXILIAR]])","v":6},263540,"COMERCIALES "]
[{"$f":"LEN(PUC[[#This Row],[AUXILIAR]])","v":6},263595,"OTRAS "]
[{"$f":"LEN(PUC[[#This Row],[AUXILIAR]])","v":4},2640,"PARA OBLIGACIONES DE GARANTIAS "]
[{"$f":"LEN(PUC[[#This Row],[AUXILIAR]])","v":4},2695,"PROVISIONES DIVERSAS "]
[{"$f":"LEN(PUC[[#This Row],[AUXILIAR]])","v":6},269505,"PARA BENEFICENCIA "]
[{"$f":"LEN(PUC[[#This Row],[AUXILIAR]])","v":6},269510,"PARA COMUNICACIONES "]
[{"$f":"LEN(PUC[[#This Row],[AUXILIAR]])","v":6},269515,"PARA PERDIDA EN TRANSPORTE "]
[{"$f":"LEN(PUC[[#This Row],[AUXILIAR]])","v":6},269520,"PARA OPERACION "]
[{"$f":"LEN(PUC[[#This Row],[AUXILIAR]])","v":6},269525,"PARA PROTECCION DE BIENES AGOTABLES "]
[{"$f":"LEN(PUC[[#This Row],[AUXILIAR]])","v":6},269530,"PARA AJUSTES EN REDENCION DE UNIDADES "]
[{"$f":"LEN(PUC[[#This Row],[AUXILIAR]])","v":6},269535,"AUTOSEGURO "]
[{"$f":"LEN(PUC[[#This Row],[AUXILIAR]])","v":6},269540,"PLANES Y PROGRAMAS DE REFORESTACION Y ELECTRIFICACION "]
[{"$f":"LEN(PUC[[#This Row],[AUXILIAR]])","v":6},269595,"OTRAS "]
[{"$f":"LEN(PUC[[#This Row],[AUXILIAR]])","v":2},27,"DIFERIDOS "]
[{"$f":"LEN(PUC[[#This Row],[AUXILIAR]])","v":4},2705,"INGRESOS RECIBIDOS POR ANTICIPADO "]
[{"$f":"LEN(PUC[[#This Row],[AUXILIAR]])","v":6},270505,"INTERESES "]
[{"$f":"LEN(PUC[[#This Row],[AUXILIAR]])","v":6},270510,"COMISIONES "]
[{"$f":"LEN(PUC[[#This Row],[AUXILIAR]])","v":6},270515,"ARRENDAMIENTOS "]
[{"$f":"LEN(PUC[[#This Row],[AUXILIAR]])","v":6},270520,"HONORARIOS "]
[{"$f":"LEN(PUC[[#This Row],[AUXILIAR]])","v":6},270525,"SERVICIOS TECNICOS "]
[{"$f":"LEN(PUC[[#This Row],[AUXILIAR]])","v":6},270530,"DE SUSCRIPTORES "]
[{"$f":"LEN(PUC[[#This Row],[AUXILIAR]])","v":6},270535,"TRANSPORTES, FLETES Y ACARREOS "]
[{"$f":"LEN(PUC[[#This Row],[AUXILIAR]])","v":6},270540,"MERCANCIA EN TRANSITO YA VENDIDA "]
[{"$f":"LEN(PUC[[#This Row],[AUXILIAR]])","v":6},270545,"MATRICULAS Y PENSIONES "]
[{"$f":"LEN(PUC[[#This Row],[AUXILIAR]])","v":6},270550,"CUOTAS DE ADMINISTRACION "]
[{"$f":"LEN(PUC[[#This Row],[AUXILIAR]])","v":6},270595,"OTROS "]
[{"$f":"LEN(PUC[[#This Row],[AUXILIAR]])","v":4},2710,"ABONOS DIFERIDOS "]
[{"$f":"LEN(PUC[[#This Row],[AUXILIAR]])","v":6},271005,"REAJUSTE DEL SISTEMA "]
[{"$f":"LEN(PUC[[#This Row],[AUXILIAR]])","v":4},2715,"UTILIDAD DIFERIDA EN VENTAS A PLAZOS "]
[{"$f":"LEN(PUC[[#This Row],[AUXILIAR]])","v":4},2720,"CREDITO POR CORRECCION MONETARIA DIFERIDA "]
[{"$f":"LEN(PUC[[#This Row],[AUXILIAR]])","v":4},2725,"IMPUESTOS DIFERIDOS "]
[{"$f":"LEN(PUC[[#This Row],[AUXILIAR]])","v":6},272505,"POR DEPRECIACION FLEXIBLE "]
[{"$f":"LEN(PUC[[#This Row],[AUXILIAR]])","v":6},272595,"DIVERSOS "]
[{"$f":"LEN(PUC[[#This Row],[AUXILIAR]])","v":6},272599,"AJUSTES POR INFLACION "]
[{"$f":"LEN(PUC[[#This Row],[AUXILIAR]])","v":2},28,"OTROS PASIVOS "]
[{"$f":"LEN(PUC[[#This Row],[AUXILIAR]])","v":4},2805,"ANTICIPOS Y AVANCES RECIBIDOS "]
[{"$f":"LEN(PUC[[#This Row],[AUXILIAR]])","v":6},280505,"DE CLIENTES "]
[{"$f":"LEN(PUC[[#This Row],[AUXILIAR]])","v":6},280510,"SOBRE CONTRATOS "]
[{"$f":"LEN(PUC[[#This Row],[AUXILIAR]])","v":6},280515,"PARA OBRAS EN PROCESO "]
[{"$f":"LEN(PUC[[#This Row],[AUXILIAR]])","v":6},280595,"OTROS "]
[{"$f":"LEN(PUC[[#This Row],[AUXILIAR]])","v":4},2810,"DEPOSITOS RECIBIDOS "]
[{"$f":"LEN(PUC[[#This Row],[AUXILIAR]])","v":6},281005,"PARA FUTURA SUSCRIPCION DE ACCIONES "]
[{"$f":"LEN(PUC[[#This Row],[AUXILIAR]])","v":6},281010,"PARA FUTURO PAGO DE CUOTAS O DERECHOS SOCIALES "]
[{"$f":"LEN(PUC[[#This Row],[AUXILIAR]])","v":6},281015,"PARA GARANTIA EN LA PRESTACION DE SERVICIOS "]
[{"$f":"LEN(PUC[[#This Row],[AUXILIAR]])","v":6},281020,"PARA GARANTIA DE CONTRATOS "]
[{"$f":"LEN(PUC[[#This Row],[AUXILIAR]])","v":6},281025,"DE LICITACIONES "]
[{"$f":"LEN(PUC[[#This Row],[AUXILIAR]])","v":6},281030,"DE MANEJO DE BIENES "]
[{"$f":"LEN(PUC[[#This Row],[AUXILIAR]])","v":6},281035,"FONDO DE RESERVA "]
[{"$f":"LEN(PUC[[#This Row],[AUXILIAR]])","v":6},281095,"OTROS "]
[{"$f":"LEN(PUC[[#This Row],[AUXILIAR]])","v":4},2815,"INGRESOS RECIBIDOS PARA TERCEROS "]
[{"$f":"LEN(PUC[[#This Row],[AUXILIAR]])","v":6},281505,"VALORES RECIBIDOS PARA TERCEROS "]
[{"$f":"LEN(PUC[[#This Row],[AUXILIAR]])","v":6},281510,"VENTA POR CUENTA DE TERCEROS "]
[{"$f":"LEN(PUC[[#This Row],[AUXILIAR]])","v":4},2820,"CUENTAS DE OPERACION CONJUNTA "]
[{"$f":"LEN(PUC[[#This Row],[AUXILIAR]])","v":4},2825,"RETENCIONES A TERCEROS SOBRE CONTRATOS "]
[{"$f":"LEN(PUC[[#This Row],[AUXILIAR]])","v":6},282505,"CUMPLIMIENTO OBLIGACIONES LABORALES "]
[{"$f":"LEN(PUC[[#This Row],[AUXILIAR]])","v":6},282510,"PARA ESTABILIDAD DE OBRA "]
[{"$f":"LEN(PUC[[#This Row],[AUXILIAR]])","v":6},282515,"GARANTIA CUMPLIMIENTO DE CONTRATOS "]
[{"$f":"LEN(PUC[[#This Row],[AUXILIAR]])","v":4},2830,"EMBARGOS JUDICIALES "]
[{"$f":"LEN(PUC[[#This Row],[AUXILIAR]])","v":6},283005,"INDEMNIZACIONES "]
[{"$f":"LEN(PUC[[#This Row],[AUXILIAR]])","v":6},283010,"DEPOSITOS JUDICIALES "]
[{"$f":"LEN(PUC[[#This Row],[AUXILIAR]])","v":4},2835,"ACREEDORES DEL SISTEMA "]
[{"$f":"LEN(PUC[[#This Row],[AUXILIAR]])","v":6},283505,"CUOTAS NETAS "]
[{"$f":"LEN(PUC[[#This Row],[AUXILIAR]])","v":6},283510,"GRUPOS EN FORMACION "]
[{"$f":"LEN(PUC[[#This Row],[AUXILIAR]])","v":4},2840,"CUENTAS EN PARTICIPACION "]
[{"$f":"LEN(PUC[[#This Row],[AUXILIAR]])","v":4},2895,"DIVERSOS "]
[{"$f":"LEN(PUC[[#This Row],[AUXILIAR]])","v":6},289505,"PRESTAMOS DE PRODUCTOS "]
[{"$f":"LEN(PUC[[#This Row],[AUXILIAR]])","v":6},289510,"REEMBOLSO DE COSTOS EXPLORATORIOS "]
[{"$f":"LEN(PUC[[#This Row],[AUXILIAR]])","v":6},289515,"PROGRAMA DE EXTENSION AGROPECUARIA "]
[{"$f":"LEN(PUC[[#This Row],[AUXILIAR]])","v":2},29,"BONOS Y PAPELES COMERCIALES "]
[{"$f":"LEN(PUC[[#This Row],[AUXILIAR]])","v":4},2905,"BONOS EN CIRCULACION "]
[{"$f":"LEN(PUC[[#This Row],[AUXILIAR]])","v":6},290505,"GARANTIA GENERAL "]
[{"$f":"LEN(PUC[[#This Row],[AUXILIAR]])","v":6},290510,"GARANTIA ESPECIFICA "]
[{"$f":"LEN(PUC[[#This Row],[AUXILIAR]])","v":4},2910,"BONOS OBLIGATORIAMENTE CONVERTIBLES EN ACCIONES "]
[{"$f":"LEN(PUC[[#This Row],[AUXILIAR]])","v":4},2915,"PAPELES COMERCIALES "]
[{"$f":"LEN(PUC[[#This Row],[AUXILIAR]])","v":1},3,"PATRIMONIO "]
[{"$f":"LEN(PUC[[#This Row],[AUXILIAR]])","v":2},31,"CAPITAL SOCIAL "]
[{"$f":"LEN(PUC[[#This Row],[AUXILIAR]])","v":4},3105,"CAPITAL SUSCRITO Y PAGADO "]
[{"$f":"LEN(PUC[[#This Row],[AUXILIAR]])","v":6},310505,"CAPITAL AUTORIZADO "]
[{"$f":"LEN(PUC[[#This Row],[AUXILIAR]])","v":6},310510,"CAPITAL POR SUSCRIBIR (DB) "]
[{"$f":"LEN(PUC[[#This Row],[AUXILIAR]])","v":6},310515,"CAPITAL SUSCRITO POR COBRAR (DB) "]
[{"$f":"LEN(PUC[[#This Row],[AUXILIAR]])","v":4},3110,"ACCIONES, CUOTAS O PARTES DE INTERES SOCIAL PROPIAS READQUIRIDAS (DB) "]
[{"$f":"LEN(PUC[[#This Row],[AUXILIAR]])","v":6},311005,"ACCIONES PROPIAS READQUIRIDAS (DB) "]
[{"$f":"LEN(PUC[[#This Row],[AUXILIAR]])","v":6},311010,"CUOTAS O PARTES DE INTERES SOCIAL PROPIAS READQUIRIDAS (DB) "]
[{"$f":"LEN(PUC[[#This Row],[AUXILIAR]])","v":4},3115,"APORTES SOCIALES "]
[{"$f":"LEN(PUC[[#This Row],[AUXILIAR]])","v":6},311505,"CUOTAS O PARTES DE INTERES SOCIAL "]
[{"$f":"LEN(PUC[[#This Row],[AUXILIAR]])","v":6},311510,"APORTES DE SOCIOS - FONDO MUTUO DE INVERSION "]
[{"$f":"LEN(PUC[[#This Row],[AUXILIAR]])","v":6},311515,"CONTRIBUCION DE LA EMPRESA - FONDO MUTUO DE INVERSION "]
[{"$f":"LEN(PUC[[#This Row],[AUXILIAR]])","v":6},311520,"SUSCRIPCIONES DEL PUBLICO "]
[{"$f":"LEN(PUC[[#This Row],[AUXILIAR]])","v":4},3120,"CAPITAL ASIGNADO "]
[{"$f":"LEN(PUC[[#This Row],[AUXILIAR]])","v":4},3125,"INVERSION SUPLEMENTARIA AL CAPITAL ASIGNADO "]
[{"$f":"LEN(PUC[[#This Row],[AUXILIAR]])","v":4},3130,"CAPITAL DE PERSONAS NATURALES "]
[{"$f":"LEN(PUC[[#This Row],[AUXILIAR]])","v":4},3135,"APORTES DEL ESTADO "]
[{"$f":"LEN(PUC[[#This Row],[AUXILIAR]])","v":4},3140,"FONDO SOCIAL "]
[{"$f":"LEN(PUC[[#This Row],[AUXILIAR]])","v":2},32,"SUPERAVIT DE CAPITAL "]
[{"$f":"LEN(PUC[[#This Row],[AUXILIAR]])","v":4},3205,"PRIMA EN COLOCACION DE ACCIONES, CUOTAS O PARTES DE INTERES SOCIAL "]
[{"$f":"LEN(PUC[[#This Row],[AUXILIAR]])","v":6},320505,"PRIMA EN COLOCACION DE ACCIONES "]
[{"$f":"LEN(PUC[[#This Row],[AUXILIAR]])","v":6},320510,"PRIMA EN COLOCACION DE ACCIONES POR COBRAR (DB) "]
[{"$f":"LEN(PUC[[#This Row],[AUXILIAR]])","v":6},320515,"PRIMA EN COLOCACION DE CUOTAS O PARTES DE INTERES SOCIAL "]
[{"$f":"LEN(PUC[[#This Row],[AUXILIAR]])","v":4},3210,"DONACIONES "]
[{"$f":"LEN(PUC[[#This Row],[AUXILIAR]])","v":6},321005,"EN DINERO "]
[{"$f":"LEN(PUC[[#This Row],[AUXILIAR]])","v":6},321010,"EN VALORES MOBILIARIOS "]
[{"$f":"LEN(PUC[[#This Row],[AUXILIAR]])","v":6},321015,"EN BIENES MUEBLES "]
[{"$f":"LEN(PUC[[#This Row],[AUXILIAR]])","v":6},321020,"EN BIENES INMUEBLES "]
[{"$f":"LEN(PUC[[#This Row],[AUXILIAR]])","v":6},321025,"EN INTANGIBLES "]
[{"$f":"LEN(PUC[[#This Row],[AUXILIAR]])","v":4},3215,"CREDITO MERCANTIL "]
[{"$f":"LEN(PUC[[#This Row],[AUXILIAR]])","v":2},33,"RESERVAS "]
[{"$f":"LEN(PUC[[#This Row],[AUXILIAR]])","v":4},3305,"RESERVAS OBLIGATORIAS "]
[{"$f":"LEN(PUC[[#This Row],[AUXILIAR]])","v":6},330505,"RESERVA LEGAL "]
[{"$f":"LEN(PUC[[#This Row],[AUXILIAR]])","v":6},330510,"RESERVAS POR DISPOSICIONES FISCALES "]
[{"$f":"LEN(PUC[[#This Row],[AUXILIAR]])","v":6},330515,"RESERVA PARA READQUISICION DE ACCIONES "]
[{"$f":"LEN(PUC[[#This Row],[AUXILIAR]])","v":6},330517,"RESERVA PARA READQUISICION DE CUOTAS O PARTES DE INTERES SOCIAL "]
[{"$f":"LEN(PUC[[#This Row],[AUXILIAR]])","v":6},330520,"RESERVA PARA EXTENSION AGROPECUARIA "]
[{"$f":"LEN(PUC[[#This Row],[AUXILIAR]])","v":6},330525,"RESERVA LEY 7a. DE 1990 "]
[{"$f":"LEN(PUC[[#This Row],[AUXILIAR]])","v":6},330530,"RESERVA PARA REPOSICION DE SEMOVIENTES "]
[{"$f":"LEN(PUC[[#This Row],[AUXILIAR]])","v":6},330535,"RESERVA LEY 4a DE 1980 "]
[{"$f":"LEN(PUC[[#This Row],[AUXILIAR]])","v":6},330595,"OTRAS "]
[{"$f":"LEN(PUC[[#This Row],[AUXILIAR]])","v":4},3310,"RESERVAS ESTATUTARIAS "]
[{"$f":"LEN(PUC[[#This Row],[AUXILIAR]])","v":6},331005,"PARA FUTURAS CAPITALIZACIONES "]
[{"$f":"LEN(PUC[[#This Row],[AUXILIAR]])","v":6},331010,"PARA REPOSICION DE ACTIVOS "]
[{"$f":"LEN(PUC[[#This Row],[AUXILIAR]])","v":6},331015,"PARA FUTUROS ENSANCHES "]
[{"$f":"LEN(PUC[[#This Row],[AUXILIAR]])","v":6},331095,"OTRAS "]
[{"$f":"LEN(PUC[[#This Row],[AUXILIAR]])","v":4},3315,"RESERVAS OCASIONALES "]
[{"$f":"LEN(PUC[[#This Row],[AUXILIAR]])","v":6},331505,"PARA BENEFICENCIA Y CIVISMO "]
[{"$f":"LEN(PUC[[#This Row],[AUXILIAR]])","v":6},331510,"PARA FUTURAS CAPITALIZACIONES "]
[{"$f":"LEN(PUC[[#This Row],[AUXILIAR]])","v":6},331515,"PARA FUTUROS ENSANCHES "]
[{"$f":"LEN(PUC[[#This Row],[AUXILIAR]])","v":6},331520,"PARA ADQUISICION O REPOSICION DE PROPIEDADES PLANTA Y EQUIPO "]
[{"$f":"LEN(PUC[[#This Row],[AUXILIAR]])","v":6},331525,"PARA INVESTIGACIONES Y DESARROLLO "]
[{"$f":"LEN(PUC[[#This Row],[AUXILIAR]])","v":6},331530,"PARA FOMENTO ECONOMICO "]
[{"$f":"LEN(PUC[[#This Row],[AUXILIAR]])","v":6},331535,"PARA CAPITAL DE TRABAJO "]
[{"$f":"LEN(PUC[[#This Row],[AUXILIAR]])","v":6},331540,"PARA ESTABILIZACION DE RENDIMIENTOS "]
[{"$f":"LEN(PUC[[#This Row],[AUXILIAR]])","v":6},331545,"A DISPOSICION DEL MAXIMO ORGANO SOCIAL "]
[{"$f":"LEN(PUC[[#This Row],[AUXILIAR]])","v":6},331595,"OTRAS "]
[{"$f":"LEN(PUC[[#This Row],[AUXILIAR]])","v":2},34,"REVALORIZACION DEL PATRIMONIO "]
[{"$f":"LEN(PUC[[#This Row],[AUXILIAR]])","v":4},3405,"AJUSTES POR INFLACION "]
[{"$f":"LEN(PUC[[#This Row],[AUXILIAR]])","v":6},340505,"DE CAPITAL SOCIAL "]
[{"$f":"LEN(PUC[[#This Row],[AUXILIAR]])","v":6},340510,"DE SUPERAVIT DE CAPITAL "]
[{"$f":"LEN(PUC[[#This Row],[AUXILIAR]])","v":6},340515,"DE RESERVAS "]
[{"$f":"LEN(PUC[[#This Row],[AUXILIAR]])","v":6},340520,"DE RESULTADOS DE EJERCICIOS ANTERIORES "]
[{"$f":"LEN(PUC[[#This Row],[AUXILIAR]])","v":6},340525,"DE ACTIVOS EN PERIODO IMPRODUCTIVO "]
[{"$f":"LEN(PUC[[#This Row],[AUXILIAR]])","v":4},3410,"SANEAMIENTO FISCAL "]
[{"$f":"LEN(PUC[[#This Row],[AUXILIAR]])","v":4},3415,"AJUSTES POR INFLACION DECRETO 3019 DE 1989 "]
[{"$f":"LEN(PUC[[#This Row],[AUXILIAR]])","v":2},35,"DIVIDENDOS O PARTICIPACIONES DECRETADOS EN ACCIONES, CUOTAS O PARTES DE INTERES SOCIAL "]
[{"$f":"LEN(PUC[[#This Row],[AUXILIAR]])","v":4},3505,"DIVIDENDOS DECRETADOS EN ACCIONES "]
[{"$f":"LEN(PUC[[#This Row],[AUXILIAR]])","v":4},3510,"PARTICIPACIONES DECRETADAS EN CUOTAS O PARTES DE INTERES SOCIAL "]
[{"$f":"LEN(PUC[[#This Row],[AUXILIAR]])","v":2},36,"RESULTADOS DEL EJERCICIO "]
[{"$f":"LEN(PUC[[#This Row],[AUXILIAR]])","v":4},3605,"UTILIDAD DEL EJERCICIO "]
[{"$f":"LEN(PUC[[#This Row],[AUXILIAR]])","v":6},360505,"UTILIDAD DEL EJERCICIO "]
[{"$f":"LEN(PUC[[#This Row],[AUXILIAR]])","v":6},360510,"UTILIDAD POR EXPOSICION A LA INFLACION "]
[{"$f":"LEN(PUC[[#This Row],[AUXILIAR]])","v":4},3610,"PERDIDA DEL EJERCICIO "]
[{"$f":"LEN(PUC[[#This Row],[AUXILIAR]])","v":6},361005,"PERDIDA DEL EJERCICIO "]
[{"$f":"LEN(PUC[[#This Row],[AUXILIAR]])","v":6},361010,"PERDIDA POR EXPOSICION A LA INFLACION "]
[{"$f":"LEN(PUC[[#This Row],[AUXILIAR]])","v":2},37,"RESULTADOS DE EJERCICIOS ANTERIORES "]
[{"$f":"LEN(PUC[[#This Row],[AUXILIAR]])","v":4},3705,"UTILIDADES O EXCEDENTES ACUMULADOS "]
[{"$f":"LEN(PUC[[#This Row],[AUXILIAR]])","v":4},3710,"PERDIDAS ACUMULADAS "]
[{"$f":"LEN(PUC[[#This Row],[AUXILIAR]])","v":2},38,"SUPERAVIT POR VALORIZACIONES "]
[{"$f":"LEN(PUC[[#This Row],[AUXILIAR]])","v":4},3805,"DE INVERSIONES "]
[{"$f":"LEN(PUC[[#This Row],[AUXILIAR]])","v":6},380505,"ACCIONES "]
[{"$f":"LEN(PUC[[#This Row],[AUXILIAR]])","v":6},380510,"CUOTAS O PARTES DE INTERES SOCIAL "]
[{"$f":"LEN(PUC[[#This Row],[AUXILIAR]])","v":6},380515,"DERECHOS FIDUCIARIOS "]
[{"$f":"LEN(PUC[[#This Row],[AUXILIAR]])","v":4},3810,"DE PROPIEDADES PLANTA Y EQUIPO "]
[{"$f":"LEN(PUC[[#This Row],[AUXILIAR]])","v":6},381004,"TERRENOS "]
[{"$f":"LEN(PUC[[#This Row],[AUXILIAR]])","v":6},381006,"MATERIALES PROYECTOS PETROLEROS "]
[{"$f":"LEN(PUC[[#This Row],[AUXILIAR]])","v":6},381008,"CONSTRUCCIONES Y EDIFICACIONES "]
[{"$f":"LEN(PUC[[#This Row],[AUXILIAR]])","v":6},381012,"MAQUINARIA Y EQUIPO "]
[{"$f":"LEN(PUC[[#This Row],[AUXILIAR]])","v":6},381016,"EQUIPO DE OFICINA "]
[{"$f":"LEN(PUC[[#This Row],[AUXILIAR]])","v":6},381020,"EQUIPO DE COMPUTACION Y COMUNICACION "]
[{"$f":"LEN(PUC[[#This Row],[AUXILIAR]])","v":6},381024,"EQUIPO MEDICO CIENTIFICO "]
[{"$f":"LEN(PUC[[#This Row],[AUXILIAR]])","v":6},381028,"EQUIPO DE HOTELES Y RESTAURANTES "]
[{"$f":"LEN(PUC[[#This Row],[AUXILIAR]])","v":6},381032,"FLOTA Y EQUIPO DE TRANSPORTE "]
[{"$f":"LEN(PUC[[#This Row],[AUXILIAR]])","v":6},381036,"FLOTA Y EQUIPO FLUVIAL Y/O MARITIMO "]
[{"$f":"LEN(PUC[[#This Row],[AUXILIAR]])","v":6},381040,"FLOTA Y EQUIPO AEREO "]
[{"$f":"LEN(PUC[[#This Row],[AUXILIAR]])","v":6},381044,"FLOTA Y EQUIPO FERREO "]
[{"$f":"LEN(PUC[[#This Row],[AUXILIAR]])","v":6},381048,"ACUEDUCTOS PLANTAS Y REDES "]
[{"$f":"LEN(PUC[[#This Row],[AUXILIAR]])","v":6},381052,"ARMAMENTO DE VIGILANCIA "]
[{"$f":"LEN(PUC[[#This Row],[AUXILIAR]])","v":6},381056,"ENVASES Y EMPAQUES "]
[{"$f":"LEN(PUC[[#This Row],[AUXILIAR]])","v":6},381060,"PLANTACIONES AGRICOLAS Y FORESTALES "]
[{"$f":"LEN(PUC[[#This Row],[AUXILIAR]])","v":6},381064,"VIAS DE COMUNICACION "]
[{"$f":"LEN(PUC[[#This Row],[AUXILIAR]])","v":6},381068,"MINAS Y CANTERAS "]
[{"$f":"LEN(PUC[[#This Row],[AUXILIAR]])","v":6},381072,"POZOS ARTESIANOS "]
[{"$f":"LEN(PUC[[#This Row],[AUXILIAR]])","v":6},381076,"YACIMIENTOS "]
[{"$f":"LEN(PUC[[#This Row],[AUXILIAR]])","v":6},381080,"SEMOVIENTES "]
[{"$f":"LEN(PUC[[#This Row],[AUXILIAR]])","v":4},3895,"DE OTROS ACTIVOS "]
[{"$f":"LEN(PUC[[#This Row],[AUXILIAR]])","v":6},389505,"BIENES DE ARTE Y CULTURA "]
[{"$f":"LEN(PUC[[#This Row],[AUXILIAR]])","v":6},389510,"BIENES ENTREGADOS EN COMODATO "]
[{"$f":"LEN(PUC[[#This Row],[AUXILIAR]])","v":6},389515,"BIENES RECIBIDOS EN PAGO "]
[{"$f":"LEN(PUC[[#This Row],[AUXILIAR]])","v":6},389520,"INVENTARIO DE SEMOVIENTES "]
[{"$f":"LEN(PUC[[#This Row],[AUXILIAR]])","v":1},4,"INGRESOS "]
[{"$f":"LEN(PUC[[#This Row],[AUXILIAR]])","v":2},41,"OPERACIONALES "]
[{"$f":"LEN(PUC[[#This Row],[AUXILIAR]])","v":4},4105,"AGRICULTURA, GANADERIA, CAZA Y SILVICULTURA "]
[{"$f":"LEN(PUC[[#This Row],[AUXILIAR]])","v":6},410505,"CULTIVO DE CEREALES "]
[{"$f":"LEN(PUC[[#This Row],[AUXILIAR]])","v":6},410510,"CULTIVOS DE HORTALIZAS, LEGUMBRES Y PLANTAS ORNAMENTALES "]
[{"$f":"LEN(PUC[[#This Row],[AUXILIAR]])","v":6},410515,"CULTIVOS DE FRUTAS, NUECES Y PLANTAS AROMATICAS "]
[{"$f":"LEN(PUC[[#This Row],[AUXILIAR]])","v":6},410520,"CULTIVO DE CAFE "]
[{"$f":"LEN(PUC[[#This Row],[AUXILIAR]])","v":6},410525,"CULTIVO DE FLORES "]
[{"$f":"LEN(PUC[[#This Row],[AUXILIAR]])","v":6},410530,"CULTIVO DE CAÑA DE AZUCAR "]
[{"$f":"LEN(PUC[[#This Row],[AUXILIAR]])","v":6},410535,"CULTIVO DE ALGODON Y PLANTAS PARA MATERIAL TEXTIL "]
[{"$f":"LEN(PUC[[#This Row],[AUXILIAR]])","v":6},410540,"CULTIVO DE BANANO "]
[{"$f":"LEN(PUC[[#This Row],[AUXILIAR]])","v":6},410545,"OTROS CULTIVOS AGRICOLAS "]
[{"$f":"LEN(PUC[[#This Row],[AUXILIAR]])","v":6},410550,"CRIA DE OVEJAS, CABRAS, ASNOS, MULAS Y BURDEGANOS "]
[{"$f":"LEN(PUC[[#This Row],[AUXILIAR]])","v":6},410555,"CRIA DE GANADO CABALLAR Y VACUNO. "]
[{"$f":"LEN(PUC[[#This Row],[AUXILIAR]])","v":6},410560,"PRODUCCION AVICOLA "]
[{"$f":"LEN(PUC[[#This Row],[AUXILIAR]])","v":6},410565,"CRIA DE OTROS ANIMALES "]
[{"$f":"LEN(PUC[[#This Row],[AUXILIAR]])","v":6},410570,"SERVICIOS AGRICOLAS Y GANADEROS "]
[{"$f":"LEN(PUC[[#This Row],[AUXILIAR]])","v":6},410575,"ACTIVIDAD DE CAZA "]
[{"$f":"LEN(PUC[[#This Row],[AUXILIAR]])","v":6},410580,"ACTIVIDAD DE SILVICULTURA "]
[{"$f":"LEN(PUC[[#This Row],[AUXILIAR]])","v":6},410599,"AJUSTES POR INFLACION "]
[{"$f":"LEN(PUC[[#This Row],[AUXILIAR]])","v":4},4110,"PESCA "]
[{"$f":"LEN(PUC[[#This Row],[AUXILIAR]])","v":6},411005,"ACTIVIDAD DE PESCA "]
[{"$f":"LEN(PUC[[#This Row],[AUXILIAR]])","v":6},411010,"EXPLOTACION DE CRIADEROS DE PECES "]
[{"$f":"LEN(PUC[[#This Row],[AUXILIAR]])","v":6},411095,"ACTIVIDADES CONEXAS "]
[{"$f":"LEN(PUC[[#This Row],[AUXILIAR]])","v":6},411099,"AJUSTES POR INFLACION "]
[{"$f":"LEN(PUC[[#This Row],[AUXILIAR]])","v":4},4115,"EXPLOTACION DE MINAS Y CANTERAS "]
[{"$f":"LEN(PUC[[#This Row],[AUXILIAR]])","v":6},411505,"CARBON "]
[{"$f":"LEN(PUC[[#This Row],[AUXILIAR]])","v":6},411510,"PETROLEO CRUDO "]
[{"$f":"LEN(PUC[[#This Row],[AUXILIAR]])","v":6},411512,"GAS NATURAL "]
[{"$f":"LEN(PUC[[#This Row],[AUXILIAR]])","v":6},411514,"SERVICIOS RELACIONADOS CON EXTRACCION DE PETROLEO Y GAS "]
[{"$f":"LEN(PUC[[#This Row],[AUXILIAR]])","v":6},411515,"MINERALES DE HIERRO "]
[{"$f":"LEN(PUC[[#This Row],[AUXILIAR]])","v":6},411520,"MINERALES METALIFEROS NO FERROSOS "]
[{"$f":"LEN(PUC[[#This Row],[AUXILIAR]])","v":6},411525,"PIEDRA, ARENA Y ARCILLA "]
[{"$f":"LEN(PUC[[#This Row],[AUXILIAR]])","v":6},411527,"PIEDRAS PRECIOSAS "]
[{"$f":"LEN(PUC[[#This Row],[AUXILIAR]])","v":6},411528,"ORO "]
[{"$f":"LEN(PUC[[#This Row],[AUXILIAR]])","v":6},411530,"OTRAS MINAS Y CANTERAS "]
[{"$f":"LEN(PUC[[#This Row],[AUXILIAR]])","v":6},411532,"PRESTACION DE SERVICIOS SECTOR MINERO "]
[{"$f":"LEN(PUC[[#This Row],[AUXILIAR]])","v":6},411595,"ACTIVIDADES CONEXAS "]
[{"$f":"LEN(PUC[[#This Row],[AUXILIAR]])","v":6},411599,"AJUSTES POR INFLACION "]
[{"$f":"LEN(PUC[[#This Row],[AUXILIAR]])","v":4},4120,"INDUSTRIAS MANUFACTURERAS "]
[{"$f":"LEN(PUC[[#This Row],[AUXILIAR]])","v":6},412001,"PRODUCCION Y PROCESAMIENTO DE CARNES Y PRODUCTOS CARNICOS "]
[{"$f":"LEN(PUC[[#This Row],[AUXILIAR]])","v":6},412002,"PRODUCTOS DE PESCADO "]
[{"$f":"LEN(PUC[[#This Row],[AUXILIAR]])","v":6},412003,"PRODUCTOS DE FRUTAS, LEGUMBRES Y HORTALIZAS "]
[{"$f":"LEN(PUC[[#This Row],[AUXILIAR]])","v":6},412004,"ELABORACION DE ACEITES Y GRASAS "]
[{"$f":"LEN(PUC[[#This Row],[AUXILIAR]])","v":6},412005,"ELABORACION DE PRODUCTOS LACTEOS "]
[{"$f":"LEN(PUC[[#This Row],[AUXILIAR]])","v":6},412006,"ELABORACION DE PRODUCTOS DE MOLINERIA "]
[{"$f":"LEN(PUC[[#This Row],[AUXILIAR]])","v":6},412007,"ELABORACION DE ALMIDONES Y DERIVADOS "]
[{"$f":"LEN(PUC[[#This Row],[AUXILIAR]])","v":6},412008,"ELABORACION DE ALIMENTOS PARA ANIMALES "]
[{"$f":"LEN(PUC[[#This Row],[AUXILIAR]])","v":6},412009,"ELABORACION DE PRODUCTOS PARA PANADERIA "]
[{"$f":"LEN(PUC[[#This Row],[AUXILIAR]])","v":6},412010,"ELABORACION DE AZUCAR Y MELAZAS "]
[{"$f":"LEN(PUC[[#This Row],[AUXILIAR]])","v":6},412011,"ELABORACION DE CACAO, CHOCOLATE Y CONFITERIA "]
[{"$f":"LEN(PUC[[#This Row],[AUXILIAR]])","v":6},412012,"ELABORACION DE PASTAS Y PRODUCTOS FARINACEOS "]
[{"$f":"LEN(PUC[[#This Row],[AUXILIAR]])","v":6},412013,"ELABORACION DE PRODUCTOS DE CAFE "]
[{"$f":"LEN(PUC[[#This Row],[AUXILIAR]])","v":6},412014,"ELABORACION DE OTROS PRODUCTOS ALIMENTICIOS "]
[{"$f":"LEN(PUC[[#This Row],[AUXILIAR]])","v":6},412015,"ELABORACION DE BEBIDAS ALCOHOLICAS Y ALCOHOL ETILICO "]
[{"$f":"LEN(PUC[[#This Row],[AUXILIAR]])","v":6},412016,"ELABORACION DE VINOS "]
[{"$f":"LEN(PUC[[#This Row],[AUXILIAR]])","v":6},412017,"ELABORACION DE BEBIDAS MALTEADAS Y DE MALTA "]
[{"$f":"LEN(PUC[[#This Row],[AUXILIAR]])","v":6},412018,"ELABORACION DE BEBIDAS NO ALCOHOLICAS "]
[{"$f":"LEN(PUC[[#This Row],[AUXILIAR]])","v":6},412019,"ELABORACION DE PRODUCTOS DE TABACO "]
[{"$f":"LEN(PUC[[#This Row],[AUXILIAR]])","v":6},412020,"PREPARACION E HILATURA DE FIBRAS TEXTILES Y TEJEDURIA "]
[{"$f":"LEN(PUC[[#This Row],[AUXILIAR]])","v":6},412021,"ACABADO DE PRODUCTOS TEXTILES "]
[{"$f":"LEN(PUC[[#This Row],[AUXILIAR]])","v":6},412022,"ELABORACION DE ARTICULOS DE MATERIALES TEXTILES "]
[{"$f":"LEN(PUC[[#This Row],[AUXILIAR]])","v":6},412023,"ELABORACION DE TAPICES Y ALFOMBRAS "]
[{"$f":"LEN(PUC[[#This Row],[AUXILIAR]])","v":6},412024,"ELABORACION DE CUERDAS, CORDELES, BRAMANTES Y REDES "]
[{"$f":"LEN(PUC[[#This Row],[AUXILIAR]])","v":6},412025,"ELABORACION DE OTROS PRODUCTOS TEXTILES "]
[{"$f":"LEN(PUC[[#This Row],[AUXILIAR]])","v":6},412026,"ELABORACION DE TEJIDOS "]
[{"$f":"LEN(PUC[[#This Row],[AUXILIAR]])","v":6},412027,"ELABORACION DE PRENDAS DE VESTIR "]
[{"$f":"LEN(PUC[[#This Row],[AUXILIAR]])","v":6},412028,"PREPARACION, ADOBO Y TEÑIDO DE PIELES "]
[{"$f":"LEN(PUC[[#This Row],[AUXILIAR]])","v":6},412029,"CURTIDO, ADOBO O PREPARACION DE CUERO "]
[{"$f":"LEN(PUC[[#This Row],[AUXILIAR]])","v":6},412030,"ELABORACION DE MALETAS, BOLSOS Y SIMILARES "]
[{"$f":"LEN(PUC[[#This Row],[AUXILIAR]])","v":6},412031,"ELABORACION DE CALZADO "]
[{"$f":"LEN(PUC[[#This Row],[AUXILIAR]])","v":6},412032,"PRODUCCION DE MADERA, ARTICULOS DE MADERA Y CORCHO "]
[{"$f":"LEN(PUC[[#This Row],[AUXILIAR]])","v":6},412033,"ELABORACION DE PASTA Y PRODUCTOS DE MADERA, PAPEL Y CARTON "]
[{"$f":"LEN(PUC[[#This Row],[AUXILIAR]])","v":6},412034,"EDICIONES Y PUBLICACIONES "]
[{"$f":"LEN(PUC[[#This Row],[AUXILIAR]])","v":6},412035,"IMPRESION "]
[{"$f":"LEN(PUC[[#This Row],[AUXILIAR]])","v":6},412036,"SERVICIOS RELACIONADOS CON LA EDICION Y LA IMPRESION "]
[{"$f":"LEN(PUC[[#This Row],[AUXILIAR]])","v":6},412037,"REPRODUCCION DE GRABACIONES "]
[{"$f":"LEN(PUC[[#This Row],[AUXILIAR]])","v":6},412038,"ELABORACION DE PRODUCTOS DE HORNO DE COQUE "]
[{"$f":"LEN(PUC[[#This Row],[AUXILIAR]])","v":6},412039,"ELABORACION DE PRODUCTOS DE LA REFINACION DE PETROLEO "]
[{"$f":"LEN(PUC[[#This Row],[AUXILIAR]])","v":6},412040,"ELABORACION DE SUSTANCIAS QUIMICAS BASICAS "]
[{"$f":"LEN(PUC[[#This Row],[AUXILIAR]])","v":6},412041,"ELABORACION DE ABONOS Y COMPUESTOS DE NITROGENO "]
[{"$f":"LEN(PUC[[#This Row],[AUXILIAR]])","v":6},412042,"ELABORACION DE PLASTICO Y CAUCHO SINTETICO "]
[{"$f":"LEN(PUC[[#This Row],[AUXILIAR]])","v":6},412043,"ELABORACION DE PRODUCTOS QUIMICOS DE USO AGROPECUARIO "]
[{"$f":"LEN(PUC[[#This Row],[AUXILIAR]])","v":6},412044,"ELABORACION DE PINTURAS, TINTAS Y MASILLAS "]
[{"$f":"LEN(PUC[[#This Row],[AUXILIAR]])","v":6},412045,"ELABORACION DE PRODUCTOS FARMACEUTICOS Y BOTANICOS "]
[{"$f":"LEN(PUC[[#This Row],[AUXILIAR]])","v":6},412046,"ELABORACION DE JABONES, DETERGENTES Y PREPARADOS DE TOCADOR "]
[{"$f":"LEN(PUC[[#This Row],[AUXILIAR]])","v":6},412047,"ELABORACION DE OTROS PRODUCTOS QUIMICOS "]
[{"$f":"LEN(PUC[[#This Row],[AUXILIAR]])","v":6},412048,"ELABORACION DE FIBRAS "]
[{"$f":"LEN(PUC[[#This Row],[AUXILIAR]])","v":6},412049,"ELABORACION DE OTROS PRODUCTOS DE CAUCHO "]
[{"$f":"LEN(PUC[[#This Row],[AUXILIAR]])","v":6},412050,"ELABORACION DE PRODUCTOS DE PLASTICO "]
[{"$f":"LEN(PUC[[#This Row],[AUXILIAR]])","v":6},412051,"ELABORACION DE VIDRIO Y PRODUCTOS DE VIDRIO "]
[{"$f":"LEN(PUC[[#This Row],[AUXILIAR]])","v":6},412052,"ELABORACION DE PRODUCTOS DE CERAMICA, LOZA, PIEDRA, ARCILLA Y PORCELANA "]
[{"$f":"LEN(PUC[[#This Row],[AUXILIAR]])","v":6},412053,"ELABORACION DE CEMENTO, CAL Y YESO "]
[{"$f":"LEN(PUC[[#This Row],[AUXILIAR]])","v":6},412054,"ELABORACION DE ARTICULOS DE HORMIGON, CEMENTO Y YESO "]
[{"$f":"LEN(PUC[[#This Row],[AUXILIAR]])","v":6},412055,"CORTE, TALLADO Y ACABADO DE LA PIEDRA "]
[{"$f":"LEN(PUC[[#This Row],[AUXILIAR]])","v":6},412056,"ELABORACION DE OTROS PRODUCTOS MINERALES NO METALICOS "]
[{"$f":"LEN(PUC[[#This Row],[AUXILIAR]])","v":6},412057,"INDUSTRIAS BASICAS Y FUNDICION DE HIERRO Y ACERO "]
[{"$f":"LEN(PUC[[#This Row],[AUXILIAR]])","v":6},412058,"PRODUCTOS PRIMARIOS DE METALES PRECIOSOS Y DE METALES NO FERROSOS "]
[{"$f":"LEN(PUC[[#This Row],[AUXILIAR]])","v":6},412059,"FUNDICION DE METALES NO FERROSOS "]
[{"$f":"LEN(PUC[[#This Row],[AUXILIAR]])","v":6},412060,"FABRICACION DE PRODUCTOS METALICOS PARA USO ESTRUCTURAL "]
[{"$f":"LEN(PUC[[#This Row],[AUXILIAR]])","v":6},412061,"FORJA, PRENSADO, ESTAMPADO, LAMINADO DE METAL Y PULVIMETALURGIA "]
[{"$f":"LEN(PUC[[#This Row],[AUXILIAR]])","v":6},412062,"REVESTIMIENTO DE METALES Y OBRAS DE INGENIERIA MECANICA "]
[{"$f":"LEN(PUC[[#This Row],[AUXILIAR]])","v":6},412063,"FABRICACION DE ARTICULOS DE FERRETERIA "]
[{"$f":"LEN(PUC[[#This Row],[AUXILIAR]])","v":6},412064,"ELABORACION DE OTROS PRODUCTOS DE METAL "]
[{"$f":"LEN(PUC[[#This Row],[AUXILIAR]])","v":6},412065,"FABRICACION DE MAQUINARIA Y EQUIPO "]
[{"$f":"LEN(PUC[[#This Row],[AUXILIAR]])","v":6},412066,"FABRICACION DE EQUIPOS DE ELEVACION Y MANIPULACION "]
[{"$f":"LEN(PUC[[#This Row],[AUXILIAR]])","v":6},412067,"ELABORACION DE APARATOS DE USO DOMESTICO "]
[{"$f":"LEN(PUC[[#This Row],[AUXILIAR]])","v":6},412068,"ELABORACION DE EQUIPO DE OFICINA "]
[{"$f":"LEN(PUC[[#This Row],[AUXILIAR]])","v":6},412069,"ELABORACION DE PILAS Y BATERIAS PRIMARIAS "]
[{"$f":"LEN(PUC[[#This Row],[AUXILIAR]])","v":6},412070,"ELABORACION DE EQUIPO DE ILUMINACION "]
[{"$f":"LEN(PUC[[#This Row],[AUXILIAR]])","v":6},412071,"ELABORACION DE OTROS TIPOS DE EQUIPO ELECTRICO "]
[{"$f":"LEN(PUC[[#This Row],[AUXILIAR]])","v":6},412072,"FABRICACION DE EQUIPOS DE RADIO, TELEVISION Y COMUNICACIONES "]
[{"$f":"LEN(PUC[[#This Row],[AUXILIAR]])","v":6},412073,"FABRICACION DE APARATOS E INSTRUMENTOS MEDICOS "]
[{"$f":"LEN(PUC[[#This Row],[AUXILIAR]])","v":6},412074,"FABRICACION DE INSTRUMENTOS DE MEDICION Y CONTROL "]
[{"$f":"LEN(PUC[[#This Row],[AUXILIAR]])","v":6},412075,"FABRICACION DE INSTRUMENTOS DE OPTICA Y EQUIPO FOTOGRAFICO "]
[{"$f":"LEN(PUC[[#This Row],[AUXILIAR]])","v":6},412076,"FABRICACION DE RELOJES "]
[{"$f":"LEN(PUC[[#This Row],[AUXILIAR]])","v":6},412077,"FABRICACION DE VEHICULOS AUTOMOTORES "]
[{"$f":"LEN(PUC[[#This Row],[AUXILIAR]])","v":6},412078,"FABRICACION DE CARROCERIAS PARA AUTOMOTORES "]
[{"$f":"LEN(PUC[[#This Row],[AUXILIAR]])","v":6},412079,"FABRICACION DE PARTES PIEZAS Y ACCESORIOS PARA AUTOMOTORES "]
[{"$f":"LEN(PUC[[#This Row],[AUXILIAR]])","v":6},412080,"FABRICACION Y REPARACION DE BUQUES Y OTRAS EMBARCACIONES "]
[{"$f":"LEN(PUC[[#This Row],[AUXILIAR]])","v":6},412081,"FABRICACION DE LOCOMOTORAS Y MATERIAL RODANTE PARA FERROCARRILES "]
[{"$f":"LEN(PUC[[#This Row],[AUXILIAR]])","v":6},412082,"FABRICACION DE AERONAVES "]
[{"$f":"LEN(PUC[[#This Row],[AUXILIAR]])","v":6},412083,"FABRICACION DE MOTOCICLETAS "]
[{"$f":"LEN(PUC[[#This Row],[AUXILIAR]])","v":6},412084,"FABRICACION DE BICICLETAS Y SILLAS DE RUEDAS "]
[{"$f":"LEN(PUC[[#This Row],[AUXILIAR]])","v":6},412085,"FABRICACION DE OTROS TIPOS DE TRANSPORTE "]
[{"$f":"LEN(PUC[[#This Row],[AUXILIAR]])","v":6},412086,"FABRICACION DE MUEBLES "]
[{"$f":"LEN(PUC[[#This Row],[AUXILIAR]])","v":6},412087,"FABRICACION DE JOYAS Y ARTICULOS CONEXOS "]
[{"$f":"LEN(PUC[[#This Row],[AUXILIAR]])","v":6},412088,"FABRICACION DE INSTRUMENTOS DE MUSICA "]
[{"$f":"LEN(PUC[[#This Row],[AUXILIAR]])","v":6},412089,"FABRICACION DE ARTICULOS Y EQUIPO PARA DEPORTE "]
[{"$f":"LEN(PUC[[#This Row],[AUXILIAR]])","v":6},412090,"FABRICACION DE JUEGOS Y JUGUETES "]
[{"$f":"LEN(PUC[[#This Row],[AUXILIAR]])","v":6},412091,"RECICLAMIENTO DE DESPERDICIOS "]
[{"$f":"LEN(PUC[[#This Row],[AUXILIAR]])","v":6},412095,"PRODUCTOS DE OTRAS INDUSTRIAS MANUFACTURERAS "]
[{"$f":"LEN(PUC[[#This Row],[AUXILIAR]])","v":6},412099,"AJUSTES POR INFLACION "]
[{"$f":"LEN(PUC[[#This Row],[AUXILIAR]])","v":4},4125,"SUMINISTRO DE ELECTRICIDAD, GAS Y AGUA "]
[{"$f":"LEN(PUC[[#This Row],[AUXILIAR]])","v":6},412505,"GENERACION, CAPTACION Y DISTRIBUCION DE ENERGIA ELECTRICA "]
[{"$f":"LEN(PUC[[#This Row],[AUXILIAR]])","v":6},412510,"FABRICACION DE GAS Y DISTRIBUCION DE COMBUSTIBLES GASEOSOS "]
[{"$f":"LEN(PUC[[#This Row],[AUXILIAR]])","v":6},412515,"CAPTACION, DEPURACION Y DISTRIBUCION DE AGUA "]
[{"$f":"LEN(PUC[[#This Row],[AUXILIAR]])","v":6},412595,"ACTIVIDADES CONEXAS "]
[{"$f":"LEN(PUC[[#This Row],[AUXILIAR]])","v":6},412599,"AJUSTES POR INFLACION "]
[{"$f":"LEN(PUC[[#This Row],[AUXILIAR]])","v":4},4130,"CONSTRUCCION "]
[{"$f":"LEN(PUC[[#This Row],[AUXILIAR]])","v":6},413005,"PREPARACION DE TERRENOS "]
[{"$f":"LEN(PUC[[#This Row],[AUXILIAR]])","v":6},413010,"CONSTRUCCION DE EDIFICIOS Y OBRAS DE INGENIERIA CIVIL "]
[{"$f":"LEN(PUC[[#This Row],[AUXILIAR]])","v":6},413015,"ACONDICIONAMIENTO DE EDIFICIOS "]
[{"$f":"LEN(PUC[[#This Row],[AUXILIAR]])","v":6},413020,"TERMINACION DE EDIFICACIONES "]
[{"$f":"LEN(PUC[[#This Row],[AUXILIAR]])","v":6},413025,"ALQUILER DE EQUIPO CON OPERARIOS "]
[{"$f":"LEN(PUC[[#This Row],[AUXILIAR]])","v":6},413095,"ACTIVIDADES CONEXAS "]
[{"$f":"LEN(PUC[[#This Row],[AUXILIAR]])","v":6},413099,"AJUSTES POR INFLACION "]
[{"$f":"LEN(PUC[[#This Row],[AUXILIAR]])","v":4},4135,"COMERCIO AL POR MAYOR Y AL POR MENOR "]
[{"$f":"LEN(PUC[[#This Row],[AUXILIAR]])","v":6},413502,"VENTA DE VEHICULOS AUTOMOTORES "]
[{"$f":"LEN(PUC[[#This Row],[AUXILIAR]])","v":6},413504,"MANTENIMIENTO, REPARACION Y LAVADO DE VEHICULOS AUTOMOTORES "]
[{"$f":"LEN(PUC[[#This Row],[AUXILIAR]])","v":6},413506,"VENTA DE PARTES, PIEZAS Y ACCESORIOS DE VEHICULOS AUTOMOTORES "]
[{"$f":"LEN(PUC[[#This Row],[AUXILIAR]])","v":6},413508,"VENTA DE COMBUSTIBLES SOLIDOS, LIQUIDOS, GASEOSOS "]
[{"$f":"LEN(PUC[[#This Row],[AUXILIAR]])","v":6},413510,"VENTA DE LUBRICANTES, ADITIVOS, LLANTAS Y LUJOS PARA AUTOMOTORES "]
[{"$f":"LEN(PUC[[#This Row],[AUXILIAR]])","v":6},413512,"VENTA A CAMBIO DE RETRIBUCION O POR CONTRATA "]
[{"$f":"LEN(PUC[[#This Row],[AUXILIAR]])","v":6},413514,"VENTA DE INSUMOS, MATERIAS PRIMAS AGROPECUARIAS Y FLORES "]
[{"$f":"LEN(PUC[[#This Row],[AUXILIAR]])","v":6},413516,"VENTA DE OTROS INSUMOS Y MATERIAS PRIMAS NO AGROPECUARIAS "]
[{"$f":"LEN(PUC[[#This Row],[AUXILIAR]])","v":6},413518,"VENTA DE ANIMALES VIVOS Y CUEROS "]
[{"$f":"LEN(PUC[[#This Row],[AUXILIAR]])","v":6},413520,"VENTA DE PRODUCTOS EN ALMACENES NO ESPECIALIZADOS "]
[{"$f":"LEN(PUC[[#This Row],[AUXILIAR]])","v":6},413522,"VENTA DE PRODUCTOS AGROPECUARIOS "]
[{"$f":"LEN(PUC[[#This Row],[AUXILIAR]])","v":6},413524,"VENTA DE PRODUCTOS TEXTILES, DE VESTIR, DE CUERO Y CALZADO "]
[{"$f":"LEN(PUC[[#This Row],[AUXILIAR]])","v":6},413526,"VENTA DE PAPEL Y CARTON "]
[{"$f":"LEN(PUC[[#This Row],[AUXILIAR]])","v":6},413528,"VENTA DE LIBROS, REVISTAS, ELEMENTOS DE PAPELERIA, UTILES Y TEXTOS ESCOLARES "]
[{"$f":"LEN(PUC[[#This Row],[AUXILIAR]])","v":6},413530,"VENTA DE JUEGOS, JUGUETES Y ARTICULOS DEPORTIVOS "]
[{"$f":"LEN(PUC[[#This Row],[AUXILIAR]])","v":6},413532,"VENTA DE INSTRUMENTOS QUIRURGICOS Y ORTOPEDICOS "]
[{"$f":"LEN(PUC[[#This Row],[AUXILIAR]])","v":6},413534,"VENTA DE ARTICULOS EN RELOJERIAS Y JOYERIAS "]
[{"$f":"LEN(PUC[[#This Row],[AUXILIAR]])","v":6},413536,"VENTA DE ELECTRODOMESTICOS Y MUEBLES "]
[{"$f":"LEN(PUC[[#This Row],[AUXILIAR]])","v":6},413538,"VENTA DE PRODUCTOS DE ASEO, FARMACEUTICOS, MEDICINALES, Y ARTICULOS DE TOCADOR "]
[{"$f":"LEN(PUC[[#This Row],[AUXILIAR]])","v":6},413540,"VENTA DE CUBIERTOS, VAJILLAS, CRISTALERIA, PORCELANAS, CERAMICAS Y OTROS ARTICULOS DE USO DOMESTICO "]
[{"$f":"LEN(PUC[[#This Row],[AUXILIAR]])","v":6},413542,"VENTA DE MATERIALES DE CONSTRUCCION, FONTANERIA Y CALEFACCION "]
[{"$f":"LEN(PUC[[#This Row],[AUXILIAR]])","v":6},413544,"VENTA DE PINTURAS Y LACAS "]
[{"$f":"LEN(PUC[[#This Row],[AUXILIAR]])","v":6},413546,"VENTA DE PRODUCTOS DE VIDRIOS Y MARQUETERIA "]
[{"$f":"LEN(PUC[[#This Row],[AUXILIAR]])","v":6},413548,"VENTA DE HERRAMIENTAS Y ARTICULOS DE FERRETERIA "]
[{"$f":"LEN(PUC[[#This Row],[AUXILIAR]])","v":6},413550,"VENTA DE QUIMICOS "]
[{"$f":"LEN(PUC[[#This Row],[AUXILIAR]])","v":6},413552,"VENTA DE PRODUCTOS INTERMEDIOS, DESPERDICIOS Y DESECHOS "]
[{"$f":"LEN(PUC[[#This Row],[AUXILIAR]])","v":6},413554,"VENTA DE MAQUINARIA, EQUIPO DE OFICINA Y PROGRAMAS DE COMPUTADOR "]
[{"$f":"LEN(PUC[[#This Row],[AUXILIAR]])","v":6},413556,"VENTA DE ARTICULOS EN CACHARRERIAS Y MISCELANEAS "]
[{"$f":"LEN(PUC[[#This Row],[AUXILIAR]])","v":6},413558,"VENTA DE INSTRUMENTOS MUSICALES "]
[{"$f":"LEN(PUC[[#This Row],[AUXILIAR]])","v":6},413560,"VENTA DE ARTICULOS EN CASAS DE EMPEÑO Y PRENDERIAS "]
[{"$f":"LEN(PUC[[#This Row],[AUXILIAR]])","v":6},413562,"VENTA DE EQUIPO FOTOGRAFICO "]
[{"$f":"LEN(PUC[[#This Row],[AUXILIAR]])","v":6},413564,"VENTA DE EQUIPO OPTICO Y DE PRECISION "]
[{"$f":"LEN(PUC[[#This Row],[AUXILIAR]])","v":6},413566,"VENTA DE EMPAQUES "]
[{"$f":"LEN(PUC[[#This Row],[AUXILIAR]])","v":6},413568,"VENTA DE EQUIPO PROFESIONAL Y CIENTIFICO "]
[{"$f":"LEN(PUC[[#This Row],[AUXILIAR]])","v":6},413570,"VENTA DE LOTERIAS, RIFAS, CHANCE, APUESTAS Y SIMILARES "]
[{"$f":"LEN(PUC[[#This Row],[AUXILIAR]])","v":6},413572,"REPARACION DE EFECTOS PERSONALES Y ELECTRODOMESTICOS "]
[{"$f":"LEN(PUC[[#This Row],[AUXILIAR]])","v":6},413595,"VENTA DE OTROS PRODUCTOS "]
[{"$f":"LEN(PUC[[#This Row],[AUXILIAR]])","v":6},413599,"AJUSTES POR INFLACION "]
[{"$f":"LEN(PUC[[#This Row],[AUXILIAR]])","v":4},4140,"HOTELES Y RESTAURANTES "]
[{"$f":"LEN(PUC[[#This Row],[AUXILIAR]])","v":6},414005,"HOTELERIA "]
[{"$f":"LEN(PUC[[#This Row],[AUXILIAR]])","v":6},414010,"CAMPAMENTO Y OTROS TIPOS DE HOSPEDAJE "]
[{"$f":"LEN(PUC[[#This Row],[AUXILIAR]])","v":6},414015,"RESTAURANTES "]
[{"$f":"LEN(PUC[[#This Row],[AUXILIAR]])","v":6},414020,"BARES Y CANTINAS "]
[{"$f":"LEN(PUC[[#This Row],[AUXILIAR]])","v":6},414095,"ACTIVIDADES CONEXAS "]
[{"$f":"LEN(PUC[[#This Row],[AUXILIAR]])","v":6},414099,"AJUSTES POR INFLACION "]
[{"$f":"LEN(PUC[[#This Row],[AUXILIAR]])","v":4},4145,"TRANSPORTE, ALMACENAMIENTO Y COMUNICACIONES "]
[{"$f":"LEN(PUC[[#This Row],[AUXILIAR]])","v":6},414505,"SERVICIO DE TRANSPORTE POR CARRETERA "]
[{"$f":"LEN(PUC[[#This Row],[AUXILIAR]])","v":6},414510,"SERVICIO DE TRANSPORTE POR VIA FERREA "]
[{"$f":"LEN(PUC[[#This Row],[AUXILIAR]])","v":6},414515,"SERVICIO DE TRANSPORTE POR VIA ACUATICA "]
[{"$f":"LEN(PUC[[#This Row],[AUXILIAR]])","v":6},414520,"SERVICIO DE TRANSPORTE POR VIA AEREA "]
[{"$f":"LEN(PUC[[#This Row],[AUXILIAR]])","v":6},414525,"SERVICIO DE TRANSPORTE POR TUBERIAS "]
[{"$f":"LEN(PUC[[#This Row],[AUXILIAR]])","v":6},414530,"MANIPULACION DE CARGA "]
[{"$f":"LEN(PUC[[#This Row],[AUXILIAR]])","v":6},414535,"ALMACENAMIENTO Y DEPOSITO "]
[{"$f":"LEN(PUC[[#This Row],[AUXILIAR]])","v":6},414540,"SERVICIOS COMPLEMENTARIOS PARA EL TRANSPORTE "]
[{"$f":"LEN(PUC[[#This Row],[AUXILIAR]])","v":6},414545,"AGENCIAS DE VIAJE "]
[{"$f":"LEN(PUC[[#This Row],[AUXILIAR]])","v":6},414550,"OTRAS AGENCIAS DE TRANSPORTE "]
[{"$f":"LEN(PUC[[#This Row],[AUXILIAR]])","v":6},414555,"SERVICIO POSTAL Y DE CORREO "]
[{"$f":"LEN(PUC[[#This Row],[AUXILIAR]])","v":6},414560,"SERVICIO TELEFONICO "]
[{"$f":"LEN(PUC[[#This Row],[AUXILIAR]])","v":6},414565,"SERVICIO DE TELEGRAFO "]
[{"$f":"LEN(PUC[[#This Row],[AUXILIAR]])","v":6},414570,"SERVICIO DE TRANSMISION DE DATOS "]
[{"$f":"LEN(PUC[[#This Row],[AUXILIAR]])","v":6},414575,"SERVICIO DE RADIO Y TELEVISION POR CABLE "]
[{"$f":"LEN(PUC[[#This Row],[AUXILIAR]])","v":6},414580,"TRANSMISION DE SONIDO E IMAGENES POR CONTRATO "]
[{"$f":"LEN(PUC[[#This Row],[AUXILIAR]])","v":6},414595,"ACTIVIDADES CONEXAS "]
[{"$f":"LEN(PUC[[#This Row],[AUXILIAR]])","v":6},414599,"AJUSTES POR INFLACION "]
[{"$f":"LEN(PUC[[#This Row],[AUXILIAR]])","v":4},4150,"ACTIVIDAD FINANCIERA "]
[{"$f":"LEN(PUC[[#This Row],[AUXILIAR]])","v":6},415005,"VENTA DE INVERSIONES "]
[{"$f":"LEN(PUC[[#This Row],[AUXILIAR]])","v":6},415010,"DIVIDENDOS DE SOCIEDADES ANONIMAS Y/O ASIMILADAS "]
[{"$f":"LEN(PUC[[#This Row],[AUXILIAR]])","v":6},415015,"PARTICIPACIONES DE SOCIEDADES LIMITADAS Y/O ASIMILADAS "]
[{"$f":"LEN(PUC[[#This Row],[AUXILIAR]])","v":6},415020,"INTERESES "]
[{"$f":"LEN(PUC[[#This Row],[AUXILIAR]])","v":6},415025,"REAJUSTE MONETARIO - UPAC "]
[{"$f":"LEN(PUC[[#This Row],[AUXILIAR]])","v":6},415030,"COMISIONES "]
[{"$f":"LEN(PUC[[#This Row],[AUXILIAR]])","v":6},415035,"OPERACIONES DE DESCUENTO "]
[{"$f":"LEN(PUC[[#This Row],[AUXILIAR]])","v":6},415040,"CUOTAS DE INSCRIPCION - CONSORCIOS "]
[{"$f":"LEN(PUC[[#This Row],[AUXILIAR]])","v":6},415045,"CUOTAS DE ADMINISTRACION - CONSORCIOS "]
[{"$f":"LEN(PUC[[#This Row],[AUXILIAR]])","v":6},415050,"REAJUSTE DEL SISTEMA - CONSORCIOS "]
[{"$f":"LEN(PUC[[#This Row],[AUXILIAR]])","v":6},415055,"ELIMINACION DE SUSCRIPTORES - CONSORCIOS "]
[{"$f":"LEN(PUC[[#This Row],[AUXILIAR]])","v":6},415060,"CUOTAS DE INGRESO O RETIRO - SOCIEDAD ADMINISTRADORA "]
[{"$f":"LEN(PUC[[#This Row],[AUXILIAR]])","v":6},415065,"SERVICIOS A COMISIONISTAS "]
[{"$f":"LEN(PUC[[#This Row],[AUXILIAR]])","v":6},415070,"INSCRIPCIONES Y CUOTAS "]
[{"$f":"LEN(PUC[[#This Row],[AUXILIAR]])","v":6},415075,"RECUPERACION DE GARANTIAS "]
[{"$f":"LEN(PUC[[#This Row],[AUXILIAR]])","v":6},415095,"ACTIVIDADES CONEXAS "]
[{"$f":"LEN(PUC[[#This Row],[AUXILIAR]])","v":6},415099,"AJUSTES POR INFLACION "]
[{"$f":"LEN(PUC[[#This Row],[AUXILIAR]])","v":4},4155,"ACTIVIDADES INMOBILIARIAS, EMPRESARIALES Y DE ALQUILER "]
[{"$f":"LEN(PUC[[#This Row],[AUXILIAR]])","v":6},415505,"ARRENDAMIENTOS DE BIENES INMUEBLES "]
[{"$f":"LEN(PUC[[#This Row],[AUXILIAR]])","v":6},415510,"INMOBILIARIAS POR RETRIBUCION O CONTRATA "]
[{"$f":"LEN(PUC[[#This Row],[AUXILIAR]])","v":6},415515,"ALQUILER EQUIPO DE TRANSPORTE "]
[{"$f":"LEN(PUC[[#This Row],[AUXILIAR]])","v":6},415520,"ALQUILER MAQUINARIA Y EQUIPO "]
[{"$f":"LEN(PUC[[#This Row],[AUXILIAR]])","v":6},415525,"ALQUILER DE EFECTOS PERSONALES Y ENSERES DOMESTICOS "]
[{"$f":"LEN(PUC[[#This Row],[AUXILIAR]])","v":6},415530,"CONSULTORIA EN EQUIPO Y PROGRAMAS DE INFORMATICA "]
[{"$f":"LEN(PUC[[#This Row],[AUXILIAR]])","v":6},415535,"PROCESAMIENTO DE DATOS "]
[{"$f":"LEN(PUC[[#This Row],[AUXILIAR]])","v":6},415540,"MANTENIMIENTO Y REPARACION DE MAQUINARIA DE OFICINA "]
[{"$f":"LEN(PUC[[#This Row],[AUXILIAR]])","v":6},415545,"INVESTIGACIONES CIENTIFICAS Y DE DESARROLLO "]
[{"$f":"LEN(PUC[[#This Row],[AUXILIAR]])","v":6},415550,"ACTIVIDADES EMPRESARIALES DE CONSULTORIA "]
[{"$f":"LEN(PUC[[#This Row],[AUXILIAR]])","v":6},415555,"PUBLICIDAD "]
[{"$f":"LEN(PUC[[#This Row],[AUXILIAR]])","v":6},415560,"DOTACION DE PERSONAL "]
[{"$f":"LEN(PUC[[#This Row],[AUXILIAR]])","v":6},415565,"INVESTIGACION Y SEGURIDAD "]
[{"$f":"LEN(PUC[[#This Row],[AUXILIAR]])","v":6},415570,"LIMPIEZA DE INMUEBLES "]
[{"$f":"LEN(PUC[[#This Row],[AUXILIAR]])","v":6},415575,"FOTOGRAFIA "]
[{"$f":"LEN(PUC[[#This Row],[AUXILIAR]])","v":6},415580,"ENVASE Y EMPAQUE "]
[{"$f":"LEN(PUC[[#This Row],[AUXILIAR]])","v":6},415585,"FOTOCOPIADO "]
[{"$f":"LEN(PUC[[#This Row],[AUXILIAR]])","v":6},415590,"MANTENIMIENTO Y REPARACION DE MAQUINARIA Y EQUIPO "]
[{"$f":"LEN(PUC[[#This Row],[AUXILIAR]])","v":6},415595,"ACTIVIDADES CONEXAS "]
[{"$f":"LEN(PUC[[#This Row],[AUXILIAR]])","v":6},415599,"AJUSTES POR INFLACION "]
[{"$f":"LEN(PUC[[#This Row],[AUXILIAR]])","v":4},4160,"ENSEÑANZA "]
[{"$f":"LEN(PUC[[#This Row],[AUXILIAR]])","v":6},416005,"ACTIVIDADES RELACIONADAS CON LA EDUCACION "]
[{"$f":"LEN(PUC[[#This Row],[AUXILIAR]])","v":6},416095,"ACTIVIDADES CONEXAS "]
[{"$f":"LEN(PUC[[#This Row],[AUXILIAR]])","v":6},416099,"AJUSTES POR INFLACION "]
[{"$f":"LEN(PUC[[#This Row],[AUXILIAR]])","v":4},4165,"SERVICIOS SOCIALES Y DE SALUD "]
[{"$f":"LEN(PUC[[#This Row],[AUXILIAR]])","v":6},416505,"SERVICIO HOSPITALARIO "]
[{"$f":"LEN(PUC[[#This Row],[AUXILIAR]])","v":6},416510,"SERVICIO MEDICO "]
[{"$f":"LEN(PUC[[#This Row],[AUXILIAR]])","v":6},416515,"SERVICIO ODONTOLOGICO "]
[{"$f":"LEN(PUC[[#This Row],[AUXILIAR]])","v":6},416520,"SERVICIO DE LABORATORIO "]
[{"$f":"LEN(PUC[[#This Row],[AUXILIAR]])","v":6},416525,"ACTIVIDADES VETERINARIAS "]
[{"$f":"LEN(PUC[[#This Row],[AUXILIAR]])","v":6},416530,"ACTIVIDADES DE SERVICIOS SOCIALES "]
[{"$f":"LEN(PUC[[#This Row],[AUXILIAR]])","v":6},416595,"ACTIVIDADES CONEXAS "]
[{"$f":"LEN(PUC[[#This Row],[AUXILIAR]])","v":6},416599,"AJUSTES POR INFLACION "]
[{"$f":"LEN(PUC[[#This Row],[AUXILIAR]])","v":4},4170,"OTRAS ACTIVIDADES DE SERVICIOS COMUNITARIOS, SOCIALES Y PERSONALES "]
[{"$f":"LEN(PUC[[#This Row],[AUXILIAR]])","v":6},417005,"ELIMINACION DE DESPERDICIOS Y AGUAS RESIDUALES "]
[{"$f":"LEN(PUC[[#This Row],[AUXILIAR]])","v":6},417010,"ACTIVIDADES DE ASOCIACION "]
[{"$f":"LEN(PUC[[#This Row],[AUXILIAR]])","v":6},417015,"PRODUCCION Y DISTRIBUCION DE FILMES Y VIDEOCINTAS "]
[{"$f":"LEN(PUC[[#This Row],[AUXILIAR]])","v":6},417020,"EXHIBICION DE FILMES Y VIDEOCINTAS "]
[{"$f":"LEN(PUC[[#This Row],[AUXILIAR]])","v":6},417025,"ACTIVIDAD DE RADIO Y TELEVISION "]
[{"$f":"LEN(PUC[[#This Row],[AUXILIAR]])","v":6},417030,"ACTIVIDAD TEATRAL, MUSICAL Y ARTISTICA "]
[{"$f":"LEN(PUC[[#This Row],[AUXILIAR]])","v":6},417035,"GRABACION Y PRODUCCION DE DISCOS "]
[{"$f":"LEN(PUC[[#This Row],[AUXILIAR]])","v":6},417040,"ENTRETENIMIENTO Y ESPARCIMIENTO "]
[{"$f":"LEN(PUC[[#This Row],[AUXILIAR]])","v":6},417045,"AGENCIAS DE NOTICIAS "]
[{"$f":"LEN(PUC[[#This Row],[AUXILIAR]])","v":6},417050,"LAVANDERIAS Y SIMILARES "]
[{"$f":"LEN(PUC[[#This Row],[AUXILIAR]])","v":6},417055,"PELUQUERIAS Y SIMILARES "]
[{"$f":"LEN(PUC[[#This Row],[AUXILIAR]])","v":6},417060,"SERVICIOS FUNERARIOS "]
[{"$f":"LEN(PUC[[#This Row],[AUXILIAR]])","v":6},417065,"ZONAS FRANCAS "]
[{"$f":"LEN(PUC[[#This Row],[AUXILIAR]])","v":6},417095,"ACTIVIDADES CONEXAS "]
[{"$f":"LEN(PUC[[#This Row],[AUXILIAR]])","v":6},417099,"AJUSTES POR INFLACION "]
[{"$f":"LEN(PUC[[#This Row],[AUXILIAR]])","v":4},4175,"DEVOLUCIONES, REBAJAS Y DESCUENTOS EN VENTAS (DB) "]
[{"$f":"LEN(PUC[[#This Row],[AUXILIAR]])","v":6},417599,"AJUSTES POR INFLACION "]
[{"$f":"LEN(PUC[[#This Row],[AUXILIAR]])","v":2},42,"NO OPERACIONALES "]
[{"$f":"LEN(PUC[[#This Row],[AUXILIAR]])","v":4},4205,"OTRAS VENTAS "]
[{"$f":"LEN(PUC[[#This Row],[AUXILIAR]])","v":6},420505,"MATERIA PRIMA "]
[{"$f":"LEN(PUC[[#This Row],[AUXILIAR]])","v":6},420510,"MATERIAL DE DESECHO "]
[{"$f":"LEN(PUC[[#This Row],[AUXILIAR]])","v":6},420515,"MATERIALES VARIOS "]
[{"$f":"LEN(PUC[[#This Row],[AUXILIAR]])","v":6},420520,"PRODUCTOS DE DIVERSIFICACION "]
[{"$f":"LEN(PUC[[#This Row],[AUXILIAR]])","v":6},420525,"EXCEDENTES DE EXPORTACION "]
[{"$f":"LEN(PUC[[#This Row],[AUXILIAR]])","v":6},420530,"ENVASES Y EMPAQUES "]
[{"$f":"LEN(PUC[[#This Row],[AUXILIAR]])","v":6},420535,"PRODUCTOS AGRICOLAS "]
[{"$f":"LEN(PUC[[#This Row],[AUXILIAR]])","v":6},420540,"DE PROPAGANDA "]
[{"$f":"LEN(PUC[[#This Row],[AUXILIAR]])","v":6},420545,"PRODUCTOS EN REMATE "]
[{"$f":"LEN(PUC[[#This Row],[AUXILIAR]])","v":6},420550,"COMBUSTIBLES Y LUBRICANTES "]
[{"$f":"LEN(PUC[[#This Row],[AUXILIAR]])","v":6},420599,"AJUSTES POR INFLACION "]
[{"$f":"LEN(PUC[[#This Row],[AUXILIAR]])","v":4},4210,"FINANCIEROS "]
[{"$f":"LEN(PUC[[#This Row],[AUXILIAR]])","v":6},421005,"INTERESES "]
[{"$f":"LEN(PUC[[#This Row],[AUXILIAR]])","v":6},421010,"REAJUSTE MONETARIO - UPAC "]
[{"$f":"LEN(PUC[[#This Row],[AUXILIAR]])","v":6},421015,"DESCUENTOS AMORTIZADOS "]
[{"$f":"LEN(PUC[[#This Row],[AUXILIAR]])","v":6},421020,"DIFERENCIA EN CAMBIO "]
[{"$f":"LEN(PUC[[#This Row],[AUXILIAR]])","v":6},421025,"FINANCIACION VEHICULOS "]
[{"$f":"LEN(PUC[[#This Row],[AUXILIAR]])","v":6},421030,"FINANCIACION SISTEMAS DE VIAJES "]
[{"$f":"LEN(PUC[[#This Row],[AUXILIAR]])","v":6},421035,"ACEPTACIONES BANCARIAS "]
[{"$f":"LEN(PUC[[#This Row],[AUXILIAR]])","v":6},421040,"DESCUENTOS COMERCIALES CONDICIONADOS "]
[{"$f":"LEN(PUC[[#This Row],[AUXILIAR]])","v":6},421045,"DESCUENTOS BANCARIOS "]
[{"$f":"LEN(PUC[[#This Row],[AUXILIAR]])","v":6},421050,"COMISIONES CHEQUES DE OTRAS PLAZAS "]
[{"$f":"LEN(PUC[[#This Row],[AUXILIAR]])","v":6},421055,"MULTAS Y RECARGOS "]
[{"$f":"LEN(PUC[[#This Row],[AUXILIAR]])","v":6},421060,"SANCIONES CHEQUES DEVUELTOS "]
[{"$f":"LEN(PUC[[#This Row],[AUXILIAR]])","v":6},421095,"OTROS "]
[{"$f":"LEN(PUC[[#This Row],[AUXILIAR]])","v":6},421099,"AJUSTES POR INFLACION "]
[{"$f":"LEN(PUC[[#This Row],[AUXILIAR]])","v":4},4215,"DIVIDENDOS Y PARTICIPACIONES "]
[{"$f":"LEN(PUC[[#This Row],[AUXILIAR]])","v":6},421505,"DE SOCIEDADES ANONIMAS Y/O ASIMILADAS "]
[{"$f":"LEN(PUC[[#This Row],[AUXILIAR]])","v":6},421510,"DE SOCIEDADES LIMITADAS Y/O ASIMILADAS "]
[{"$f":"LEN(PUC[[#This Row],[AUXILIAR]])","v":6},421599,"AJUSTES POR INFLACION "]
[{"$f":"LEN(PUC[[#This Row],[AUXILIAR]])","v":4},4220,"ARRENDAMIENTOS "]
[{"$f":"LEN(PUC[[#This Row],[AUXILIAR]])","v":6},422005,"TERRENOS "]
[{"$f":"LEN(PUC[[#This Row],[AUXILIAR]])","v":6},422010,"CONSTRUCCIONES Y EDIFICIOS "]
[{"$f":"LEN(PUC[[#This Row],[AUXILIAR]])","v":6},422015,"MAQUINARIA Y EQUIPO "]
[{"$f":"LEN(PUC[[#This Row],[AUXILIAR]])","v":6},422020,"EQUIPO DE OFICINA "]
[{"$f":"LEN(PUC[[#This Row],[AUXILIAR]])","v":6},422025,"EQUIPO DE COMPUTACION Y COMUNICACION "]
[{"$f":"LEN(PUC[[#This Row],[AUXILIAR]])","v":6},422030,"EQUIPO MEDICO - CIENTIFICO "]
[{"$f":"LEN(PUC[[#This Row],[AUXILIAR]])","v":6},422035,"EQUIPO DE HOTELES Y RESTAURANTES "]
[{"$f":"LEN(PUC[[#This Row],[AUXILIAR]])","v":6},422040,"FLOTA Y EQUIPO DE TRANSPORTE "]
[{"$f":"LEN(PUC[[#This Row],[AUXILIAR]])","v":6},422045,"FLOTA Y EQUIPO FLUVIAL Y/O MARITIMO "]
[{"$f":"LEN(PUC[[#This Row],[AUXILIAR]])","v":6},422050,"FLOTA Y EQUIPO AEREO "]
[{"$f":"LEN(PUC[[#This Row],[AUXILIAR]])","v":6},422055,"FLOTA Y EQUIPO FERREO "]
[{"$f":"LEN(PUC[[#This Row],[AUXILIAR]])","v":6},422060,"ACUEDUCTOS PLANTAS Y REDES "]
[{"$f":"LEN(PUC[[#This Row],[AUXILIAR]])","v":6},422062,"ENVASES Y EMPAQUES "]
[{"$f":"LEN(PUC[[#This Row],[AUXILIAR]])","v":6},422065,"PLANTACIONES AGRICOLAS Y FORESTALES "]
[{"$f":"LEN(PUC[[#This Row],[AUXILIAR]])","v":6},422070,"AERODROMOS "]
[{"$f":"LEN(PUC[[#This Row],[AUXILIAR]])","v":6},422075,"SEMOVIENTES "]
[{"$f":"LEN(PUC[[#This Row],[AUXILIAR]])","v":6},422099,"AJUSTES POR INFLACION "]
[{"$f":"LEN(PUC[[#This Row],[AUXILIAR]])","v":4},4225,"COMISIONES "]
[{"$f":"LEN(PUC[[#This Row],[AUXILIAR]])","v":6},422505,"SOBRE INVERSIONES "]
[{"$f":"LEN(PUC[[#This Row],[AUXILIAR]])","v":6},422510,"DE CONCESIONARIOS "]
[{"$f":"LEN(PUC[[#This Row],[AUXILIAR]])","v":6},422515,"DE ACTIVIDADES FINANCIERAS "]
[{"$f":"LEN(PUC[[#This Row],[AUXILIAR]])","v":6},422520,"POR VENTA DE SERVICIOS DE TALLER "]
[{"$f":"LEN(PUC[[#This Row],[AUXILIAR]])","v":6},422525,"POR VENTA DE SEGUROS "]
[{"$f":"LEN(PUC[[#This Row],[AUXILIAR]])","v":6},422530,"POR INGRESOS PARA TERCEROS "]
[{"$f":"LEN(PUC[[#This Row],[AUXILIAR]])","v":6},422535,"POR DISTRIBUCION DE PELICULAS "]
[{"$f":"LEN(PUC[[#This Row],[AUXILIAR]])","v":6},422540,"DERECHOS DE AUTOR "]
[{"$f":"LEN(PUC[[#This Row],[AUXILIAR]])","v":6},422545,"DERECHOS DE PROGRAMACION "]
[{"$f":"LEN(PUC[[#This Row],[AUXILIAR]])","v":6},422599,"AJUSTES POR INFLACION "]
[{"$f":"LEN(PUC[[#This Row],[AUXILIAR]])","v":4},4230,"HONORARIOS "]
[{"$f":"LEN(PUC[[#This Row],[AUXILIAR]])","v":6},423005,"ASESORIAS "]
[{"$f":"LEN(PUC[[#This Row],[AUXILIAR]])","v":6},423010,"ASISTENCIA TECNICA "]
[{"$f":"LEN(PUC[[#This Row],[AUXILIAR]])","v":6},423015,"ADMINISTRACION DE VINCULADAS "]
[{"$f":"LEN(PUC[[#This Row],[AUXILIAR]])","v":6},423099,"AJUSTES POR INFLACION "]
[{"$f":"LEN(PUC[[#This Row],[AUXILIAR]])","v":4},4235,"SERVICIOS "]
[{"$f":"LEN(PUC[[#This Row],[AUXILIAR]])","v":6},423505,"DE BASCULA "]
[{"$f":"LEN(PUC[[#This Row],[AUXILIAR]])","v":6},423510,"DE TRANSPORTE "]
[{"$f":"LEN(PUC[[#This Row],[AUXILIAR]])","v":6},423515,"DE PRENSA "]
[{"$f":"LEN(PUC[[#This Row],[AUXILIAR]])","v":6},423520,"ADMINISTRATIVOS "]
[{"$f":"LEN(PUC[[#This Row],[AUXILIAR]])","v":6},423525,"TECNICOS "]
[{"$f":"LEN(PUC[[#This Row],[AUXILIAR]])","v":6},423530,"DE COMPUTACION "]
[{"$f":"LEN(PUC[[#This Row],[AUXILIAR]])","v":6},423535,"DE TELEFAX "]
[{"$f":"LEN(PUC[[#This Row],[AUXILIAR]])","v":6},423540,"TALLER DE VEHICULOS "]
[{"$f":"LEN(PUC[[#This Row],[AUXILIAR]])","v":6},423545,"DE RECEPCION DE AERONAVES "]
[{"$f":"LEN(PUC[[#This Row],[AUXILIAR]])","v":6},423550,"DE TRANSPORTE PROGRAMA GAS NATURAL "]
[{"$f":"LEN(PUC[[#This Row],[AUXILIAR]])","v":6},423555,"POR CONTRATOS "]
[{"$f":"LEN(PUC[[#This Row],[AUXILIAR]])","v":6},423560,"DE TRILLLA "]
[{"$f":"LEN(PUC[[#This Row],[AUXILIAR]])","v":6},423565,"DE MANTENIMIENTO "]
[{"$f":"LEN(PUC[[#This Row],[AUXILIAR]])","v":6},423570,"AL PERSONAL "]
[{"$f":"LEN(PUC[[#This Row],[AUXILIAR]])","v":6},423575,"DE CASINO "]
[{"$f":"LEN(PUC[[#This Row],[AUXILIAR]])","v":6},423580,"FLETES "]
[{"$f":"LEN(PUC[[#This Row],[AUXILIAR]])","v":6},423585,"ENTRE COMPAÑIAS "]
[{"$f":"LEN(PUC[[#This Row],[AUXILIAR]])","v":6},423595,"OTROS "]
[{"$f":"LEN(PUC[[#This Row],[AUXILIAR]])","v":6},423599,"AJUSTES POR INFLACION "]
[{"$f":"LEN(PUC[[#This Row],[AUXILIAR]])","v":4},4240,"UTILIDAD EN VENTA DE INVERSIONES "]
[{"$f":"LEN(PUC[[#This Row],[AUXILIAR]])","v":6},424005,"ACCIONES "]
[{"$f":"LEN(PUC[[#This Row],[AUXILIAR]])","v":6},424010,"CUOTAS O PARTES DE INTERES SOCIAL "]
[{"$f":"LEN(PUC[[#This Row],[AUXILIAR]])","v":6},424015,"BONOS "]
[{"$f":"LEN(PUC[[#This Row],[AUXILIAR]])","v":6},424020,"CEDULAS "]
[{"$f":"LEN(PUC[[#This Row],[AUXILIAR]])","v":6},424025,"CERTIFICADOS "]
[{"$f":"LEN(PUC[[#This Row],[AUXILIAR]])","v":6},424030,"PAPELES COMERCIALES "]
[{"$f":"LEN(PUC[[#This Row],[AUXILIAR]])","v":6},424035,"TITULOS "]
[{"$f":"LEN(PUC[[#This Row],[AUXILIAR]])","v":6},424045,"DERECHOS FIDUCIARIOS "]
[{"$f":"LEN(PUC[[#This Row],[AUXILIAR]])","v":6},424050,"OBLIGATORIAS "]
[{"$f":"LEN(PUC[[#This Row],[AUXILIAR]])","v":6},424095,"OTRAS "]
[{"$f":"LEN(PUC[[#This Row],[AUXILIAR]])","v":6},424099,"AJUSTES POR INFLACION "]
[{"$f":"LEN(PUC[[#This Row],[AUXILIAR]])","v":4},4245,"UTILIDAD EN VENTA DE PROPIEDADES PLANTA Y EQUIPO "]
[{"$f":"LEN(PUC[[#This Row],[AUXILIAR]])","v":6},424504,"TERRENOS "]
[{"$f":"LEN(PUC[[#This Row],[AUXILIAR]])","v":6},424506,"MATERIALES INDUSTRIA PETROLERA "]
[{"$f":"LEN(PUC[[#This Row],[AUXILIAR]])","v":6},424508,"CONSTRUCCIONES EN CURSO "]
[{"$f":"LEN(PUC[[#This Row],[AUXILIAR]])","v":6},424512,"MAQUINARIA EN MONTAJE "]
[{"$f":"LEN(PUC[[#This Row],[AUXILIAR]])","v":6},424516,"CONSTRUCCIONES Y EDIFICACIONES "]
[{"$f":"LEN(PUC[[#This Row],[AUXILIAR]])","v":6},424520,"MAQUINARIA Y EQUIPO "]
[{"$f":"LEN(PUC[[#This Row],[AUXILIAR]])","v":6},424524,"EQUIPO DE OFICINA "]
[{"$f":"LEN(PUC[[#This Row],[AUXILIAR]])","v":6},424528,"EQUIPO DE COMPUTACION Y COMUNICACION "]
[{"$f":"LEN(PUC[[#This Row],[AUXILIAR]])","v":6},424532,"EQUIPO MEDICO - CIENTIFICO "]
[{"$f":"LEN(PUC[[#This Row],[AUXILIAR]])","v":6},424536,"EQUIPO DE HOTELES Y RESTAURANTES "]
[{"$f":"LEN(PUC[[#This Row],[AUXILIAR]])","v":6},424540,"FLOTA Y EQUIPO DE TRANSPORTE "]
[{"$f":"LEN(PUC[[#This Row],[AUXILIAR]])","v":6},424544,"FLOTA Y EQUIPO FLUVIAL Y/O MARITIMO "]
[{"$f":"LEN(PUC[[#This Row],[AUXILIAR]])","v":6},424548,"FLOTA Y EQUIPO AEREO "]
[{"$f":"LEN(PUC[[#This Row],[AUXILIAR]])","v":6},424552,"FLOTA Y EQUIPO FERREO "]
[{"$f":"LEN(PUC[[#This Row],[AUXILIAR]])","v":6},424556,"ACUEDUCTOS PLANTAS Y REDES "]
[{"$f":"LEN(PUC[[#This Row],[AUXILIAR]])","v":6},424560,"ARMAMENTO DE VIGILANCIA "]
[{"$f":"LEN(PUC[[#This Row],[AUXILIAR]])","v":6},424562,"ENVASES Y EMPAQUES "]
[{"$f":"LEN(PUC[[#This Row],[AUXILIAR]])","v":6},424564,"PLANTACIONES AGRICOLAS Y FORESTALES "]
[{"$f":"LEN(PUC[[#This Row],[AUXILIAR]])","v":6},424568,"VIAS DE COMUNICACION "]
[{"$f":"LEN(PUC[[#This Row],[AUXILIAR]])","v":6},424572,"MINAS Y CANTERAS "]
[{"$f":"LEN(PUC[[#This Row],[AUXILIAR]])","v":6},424580,"POZOS ARTESIANOS "]
[{"$f":"LEN(PUC[[#This Row],[AUXILIAR]])","v":6},424584,"YACIMIENTOS "]
[{"$f":"LEN(PUC[[#This Row],[AUXILIAR]])","v":6},424588,"SEMOVIENTES "]
[{"$f":"LEN(PUC[[#This Row],[AUXILIAR]])","v":6},424599,"AJUSTES POR INFLACION "]
[{"$f":"LEN(PUC[[#This Row],[AUXILIAR]])","v":4},4248,"UTILIDAD EN VENTA DE OTROS BIENES "]
[{"$f":"LEN(PUC[[#This Row],[AUXILIAR]])","v":6},424805,"INTANGIBLES "]
[{"$f":"LEN(PUC[[#This Row],[AUXILIAR]])","v":6},424810,"OTROS ACTIVOS "]
[{"$f":"LEN(PUC[[#This Row],[AUXILIAR]])","v":6},424899,"AJUSTES POR INFLACION "]
[{"$f":"LEN(PUC[[#This Row],[AUXILIAR]])","v":4},4250,"RECUPERACIONES "]
[{"$f":"LEN(PUC[[#This Row],[AUXILIAR]])","v":6},425005,"DEUDAS MALAS "]
[{"$f":"LEN(PUC[[#This Row],[AUXILIAR]])","v":6},425010,"SEGUROS "]
[{"$f":"LEN(PUC[[#This Row],[AUXILIAR]])","v":6},425015,"RECLAMOS "]
[{"$f":"LEN(PUC[[#This Row],[AUXILIAR]])","v":6},425020,"REINTEGRO POR PERSONAL EN COMISION "]
[{"$f":"LEN(PUC[[#This Row],[AUXILIAR]])","v":6},425025,"REINTEGRO GARANTIAS "]
[{"$f":"LEN(PUC[[#This Row],[AUXILIAR]])","v":6},425030,"DESCUENTOS CONCEDIDOS "]
[{"$f":"LEN(PUC[[#This Row],[AUXILIAR]])","v":6},425035,"REINTEGRO PROVISIONES "]
[{"$f":"LEN(PUC[[#This Row],[AUXILIAR]])","v":6},425040,"GASTOS BANCARIOS "]
[{"$f":"LEN(PUC[[#This Row],[AUXILIAR]])","v":6},425045,"DE DEPRECIACION "]
[{"$f":"LEN(PUC[[#This Row],[AUXILIAR]])","v":6},425050,"REINTEGRO DE OTROS COSTOS Y GASTOS "]
[{"$f":"LEN(PUC[[#This Row],[AUXILIAR]])","v":6},425099,"AJUSTES POR INFLACION "]
[{"$f":"LEN(PUC[[#This Row],[AUXILIAR]])","v":4},4255,"INDEMNIZACIONES "]
[{"$f":"LEN(PUC[[#This Row],[AUXILIAR]])","v":6},425505,"POR SINIESTRO "]
[{"$f":"LEN(PUC[[#This Row],[AUXILIAR]])","v":6},425510,"POR SUMINISTROS "]
[{"$f":"LEN(PUC[[#This Row],[AUXILIAR]])","v":6},425515,"LUCRO CESANTE COMPAÑIAS DE SEGUROS "]
[{"$f":"LEN(PUC[[#This Row],[AUXILIAR]])","v":6},425520,"DAÑO EMERGENTE COMPAÑIAS DE SEGUROS "]
[{"$f":"LEN(PUC[[#This Row],[AUXILIAR]])","v":6},425525,"POR PERDIDA DE MERCANCIA "]
[{"$f":"LEN(PUC[[#This Row],[AUXILIAR]])","v":6},425530,"POR INCUMPLIMIENTO DE CONTRATOS "]
[{"$f":"LEN(PUC[[#This Row],[AUXILIAR]])","v":6},425535,"DE TERCEROS "]
[{"$f":"LEN(PUC[[#This Row],[AUXILIAR]])","v":6},425540,"POR INCAPACIDADES I.S.S. "]
[{"$f":"LEN(PUC[[#This Row],[AUXILIAR]])","v":6},425595,"OTRAS "]
[{"$f":"LEN(PUC[[#This Row],[AUXILIAR]])","v":6},425599,"AJUSTES POR INFLACION "]
[{"$f":"LEN(PUC[[#This Row],[AUXILIAR]])","v":4},4260,"PARTICIPACIONES EN CONCESIONES "]
[{"$f":"LEN(PUC[[#This Row],[AUXILIAR]])","v":6},426099,"AJUSTES POR INFLACION "]
[{"$f":"LEN(PUC[[#This Row],[AUXILIAR]])","v":4},4265,"INGRESOS DE EJERCICIOS ANTERIORES "]
[{"$f":"LEN(PUC[[#This Row],[AUXILIAR]])","v":6},426599,"AJUSTES POR INFLACION "]
[{"$f":"LEN(PUC[[#This Row],[AUXILIAR]])","v":4},4275,"DEVOLUCIONES, REBAJAS Y DESCUENTOS EN OTRAS VENTAS (DB) "]
[{"$f":"LEN(PUC[[#This Row],[AUXILIAR]])","v":6},427599,"AJUSTES POR INFLACION "]
[{"$f":"LEN(PUC[[#This Row],[AUXILIAR]])","v":4},4295,"DIVERSOS "]
[{"$f":"LEN(PUC[[#This Row],[AUXILIAR]])","v":6},429503,"CERT "]
[{"$f":"LEN(PUC[[#This Row],[AUXILIAR]])","v":6},429505,"APROVECHAMIENTOS "]
[{"$f":"LEN(PUC[[#This Row],[AUXILIAR]])","v":6},429507,"AUXILIOS "]
[{"$f":"LEN(PUC[[#This Row],[AUXILIAR]])","v":6},429509,"DONACIONES "]
[{"$f":"LEN(PUC[[#This Row],[AUXILIAR]])","v":6},429511,"INGRESOS POR INVESTIGACION Y DESARROLLO "]
[{"$f":"LEN(PUC[[#This Row],[AUXILIAR]])","v":6},429513,"POR TRABAJOS EJECUTADOS "]
[{"$f":"LEN(PUC[[#This Row],[AUXILIAR]])","v":6},429515,"REGALIAS "]
[{"$f":"LEN(PUC[[#This Row],[AUXILIAR]])","v":6},429517,"DERIVADOS DE LAS EXPORTACIONES "]
[{"$f":"LEN(PUC[[#This Row],[AUXILIAR]])","v":6},429519,"OTROS INGRESOS DE EXPLOTACION "]
[{"$f":"LEN(PUC[[#This Row],[AUXILIAR]])","v":6},429521,"DE LA ACTIVIDAD GANADERA "]
[{"$f":"LEN(PUC[[#This Row],[AUXILIAR]])","v":6},429525,"DERECHOS Y LICITACIONES "]
[{"$f":"LEN(PUC[[#This Row],[AUXILIAR]])","v":6},429530,"INGRESOS POR ELEMENTOS PERDIDOS "]
[{"$f":"LEN(PUC[[#This Row],[AUXILIAR]])","v":6},429533,"MULTAS Y RECARGOS "]
[{"$f":"LEN(PUC[[#This Row],[AUXILIAR]])","v":6},429535,"PREAVISOS DESCONTADOS "]
[{"$f":"LEN(PUC[[#This Row],[AUXILIAR]])","v":6},429537,"RECLAMOS "]
[{"$f":"LEN(PUC[[#This Row],[AUXILIAR]])","v":6},429540,"RECOBRO DE DAÑOS "]
[{"$f":"LEN(PUC[[#This Row],[AUXILIAR]])","v":6},429543,"PREMIOS "]
[{"$f":"LEN(PUC[[#This Row],[AUXILIAR]])","v":6},429545,"BONIFICACIONES "]
[{"$f":"LEN(PUC[[#This Row],[AUXILIAR]])","v":6},429547,"PRODUCTOS DESCONTADOS "]
[{"$f":"LEN(PUC[[#This Row],[AUXILIAR]])","v":6},429549,"RECONOCIMIENTOS I.S.S. "]
[{"$f":"LEN(PUC[[#This Row],[AUXILIAR]])","v":6},429551,"EXCEDENTES "]
[{"$f":"LEN(PUC[[#This Row],[AUXILIAR]])","v":6},429553,"SOBRANTES DE CAJA MENOR "]
[{"$f":"LEN(PUC[[#This Row],[AUXILIAR]])","v":6},429555,"SOBRANTES EN LIQUIDACION FLETES "]
[{"$f":"LEN(PUC[[#This Row],[AUXILIAR]])","v":6},429557,"SUBSIDIOS ESTATALES "]
[{"$f":"LEN(PUC[[#This Row],[AUXILIAR]])","v":6},429559,"CAPACITACION DISTRIBUIDORES "]
[{"$f":"LEN(PUC[[#This Row],[AUXILIAR]])","v":6},429561,"DE ESCRITURACION "]
[{"$f":"LEN(PUC[[#This Row],[AUXILIAR]])","v":6},429563,"REGISTRO PROMESAS DE VENTA "]
[{"$f":"LEN(PUC[[#This Row],[AUXILIAR]])","v":6},429567,"UTILES, PAPELERIA Y FOTOCOPIAS "]
[{"$f":"LEN(PUC[[#This Row],[AUXILIAR]])","v":6},429571,"RESULTADOS MATRICULAS Y TRASPASOS "]
[{"$f":"LEN(PUC[[#This Row],[AUXILIAR]])","v":6},429573,"DECORACIONES "]
[{"$f":"LEN(PUC[[#This Row],[AUXILIAR]])","v":6},429575,"MANEJO DE CARGA "]
[{"$f":"LEN(PUC[[#This Row],[AUXILIAR]])","v":6},429579,"HISTORIA CLINICA "]
[{"$f":"LEN(PUC[[#This Row],[AUXILIAR]])","v":6},429581,"AJUSTE AL PESO "]
[{"$f":"LEN(PUC[[#This Row],[AUXILIAR]])","v":6},429583,"LLAMADAS TELEFONICAS "]
[{"$f":"LEN(PUC[[#This Row],[AUXILIAR]])","v":6},429599,"AJUSTES POR INFLACION "]
[{"$f":"LEN(PUC[[#This Row],[AUXILIAR]])","v":2},47,"AJUSTES POR INFLACION "]
[{"$f":"LEN(PUC[[#This Row],[AUXILIAR]])","v":4},4705,"CORRECCION MONETARIA "]
[{"$f":"LEN(PUC[[#This Row],[AUXILIAR]])","v":6},470505,"INVERSIONES (CR) "]
[{"$f":"LEN(PUC[[#This Row],[AUXILIAR]])","v":6},470510,"INVENTARIOS (CR) "]
[{"$f":"LEN(PUC[[#This Row],[AUXILIAR]])","v":6},470515,"PROPIEDADES, PLANTA Y EQUIPO (CR) "]
[{"$f":"LEN(PUC[[#This Row],[AUXILIAR]])","v":6},470520,"INTANGIBLES (CR) "]
[{"$f":"LEN(PUC[[#This Row],[AUXILIAR]])","v":6},470525,"ACTIVOS DIFERIDOS "]
[{"$f":"LEN(PUC[[#This Row],[AUXILIAR]])","v":6},470530,"OTROS ACTIVOS (CR) "]
[{"$f":"LEN(PUC[[#This Row],[AUXILIAR]])","v":6},470535,"PASIVOS SUJETOS DE AJUSTE "]
[{"$f":"LEN(PUC[[#This Row],[AUXILIAR]])","v":6},470540,"PATRIMONIO "]
[{"$f":"LEN(PUC[[#This Row],[AUXILIAR]])","v":6},470545,"DEPRECIACION ACUMULADA (DB) "]
[{"$f":"LEN(PUC[[#This Row],[AUXILIAR]])","v":6},470550,"DEPRECIACION DIFERIDA (CR) "]
[{"$f":"LEN(PUC[[#This Row],[AUXILIAR]])","v":6},470555,"AGOTAMIENTO ACUMULADO (DB) "]
[{"$f":"LEN(PUC[[#This Row],[AUXILIAR]])","v":6},470560,"AMORTIZACION ACUMULADA (DB) "]
[{"$f":"LEN(PUC[[#This Row],[AUXILIAR]])","v":6},470565,"INGRESOS OPERACIONALES (DB) "]
[{"$f":"LEN(PUC[[#This Row],[AUXILIAR]])","v":6},470570,"INGRESOS NO OPERACIONALES (DB) "]
[{"$f":"LEN(PUC[[#This Row],[AUXILIAR]])","v":6},470575,"GASTOS OPERACIONALES DE ADMINISTRACION (CR) "]
[{"$f":"LEN(PUC[[#This Row],[AUXILIAR]])","v":6},470580,"GASTOS OPERACIONALES DE VENTAS (CR) "]
[{"$f":"LEN(PUC[[#This Row],[AUXILIAR]])","v":6},470585,"GASTOS NO OPERACIONALES (CR) "]
[{"$f":"LEN(PUC[[#This Row],[AUXILIAR]])","v":6},470590,"COMPRAS (CR) "]
[{"$f":"LEN(PUC[[#This Row],[AUXILIAR]])","v":6},470592,"COSTO DE VENTAS (CR) "]
[{"$f":"LEN(PUC[[#This Row],[AUXILIAR]])","v":6},470594,"COSTOS DE PRODUCCION O DE OPERACION (DB) "]
[{"$f":"LEN(PUC[[#This Row],[AUXILIAR]])","v":1},5,"GASTOS "]
[{"$f":"LEN(PUC[[#This Row],[AUXILIAR]])","v":2},51,"OPERACIONALES DE ADMINISTRACION "]
[{"$f":"LEN(PUC[[#This Row],[AUXILIAR]])","v":4},5105,"GASTOS DE PERSONAL "]
[{"$f":"LEN(PUC[[#This Row],[AUXILIAR]])","v":6},510503,"SALARIO INTEGRAL "]
[{"$f":"LEN(PUC[[#This Row],[AUXILIAR]])","v":6},510506,"SUELDOS "]
[{"$f":"LEN(PUC[[#This Row],[AUXILIAR]])","v":6},510512,"JORNALES "]
[{"$f":"LEN(PUC[[#This Row],[AUXILIAR]])","v":6},510515,"HORAS EXTRAS Y RECARGOS "]
[{"$f":"LEN(PUC[[#This Row],[AUXILIAR]])","v":6},510518,"COMISIONES "]
[{"$f":"LEN(PUC[[#This Row],[AUXILIAR]])","v":6},510521,"VIATICOS "]
[{"$f":"LEN(PUC[[#This Row],[AUXILIAR]])","v":6},510524,"INCAPACIDADES "]
[{"$f":"LEN(PUC[[#This Row],[AUXILIAR]])","v":6},510527,"AUXILIO DE TRANSPORTE "]
[{"$f":"LEN(PUC[[#This Row],[AUXILIAR]])","v":6},510530,"CESANTIAS "]
[{"$f":"LEN(PUC[[#This Row],[AUXILIAR]])","v":6},510533,"INTERESES SOBRE CESANTIAS "]
[{"$f":"LEN(PUC[[#This Row],[AUXILIAR]])","v":6},510536,"PRIMA DE SERVICIOS "]
[{"$f":"LEN(PUC[[#This Row],[AUXILIAR]])","v":6},510539,"VACACIONES "]
[{"$f":"LEN(PUC[[#This Row],[AUXILIAR]])","v":6},510542,"PRIMAS EXTRALEGALES "]
[{"$f":"LEN(PUC[[#This Row],[AUXILIAR]])","v":6},510545,"AUXILIOS "]
[{"$f":"LEN(PUC[[#This Row],[AUXILIAR]])","v":6},510548,"BONIFICACIONES "]
[{"$f":"LEN(PUC[[#This Row],[AUXILIAR]])","v":6},510551,"DOTACION Y SUMINISTRO A TRABAJADORES "]
[{"$f":"LEN(PUC[[#This Row],[AUXILIAR]])","v":6},510554,"SEGUROS "]
[{"$f":"LEN(PUC[[#This Row],[AUXILIAR]])","v":6},510557,"CUOTAS PARTES PENSIONES DE JUBILACION "]
[{"$f":"LEN(PUC[[#This Row],[AUXILIAR]])","v":6},510558,"AMORTIZACION CALCULO ACTUARIAL PENSIONES DE JUBILACION "]
[{"$f":"LEN(PUC[[#This Row],[AUXILIAR]])","v":6},510559,"PENSIONES DE JUBILACION "]
[{"$f":"LEN(PUC[[#This Row],[AUXILIAR]])","v":6},510560,"INDEMNIZACIONES LABORALES "]
[{"$f":"LEN(PUC[[#This Row],[AUXILIAR]])","v":6},510563,"CAPACITACION AL PERSONAL "]
[{"$f":"LEN(PUC[[#This Row],[AUXILIAR]])","v":6},510566,"GASTOS DEPORTIVOS Y DE RECREACION "]
[{"$f":"LEN(PUC[[#This Row],[AUXILIAR]])","v":6},510569,"APORTES AL I.S.S "]
[{"$f":"LEN(PUC[[#This Row],[AUXILIAR]])","v":6},510572,"APORTES CAJAS DE COMPENSACION FAMILIAR "]
[{"$f":"LEN(PUC[[#This Row],[AUXILIAR]])","v":6},510575,"APORTES I.C.B.F. "]
[{"$f":"LEN(PUC[[#This Row],[AUXILIAR]])","v":6},510578,"SENA "]
[{"$f":"LEN(PUC[[#This Row],[AUXILIAR]])","v":6},510581,"APORTES SINDICALES "]
[{"$f":"LEN(PUC[[#This Row],[AUXILIAR]])","v":6},510584,"GASTOS MEDICOS Y DROGAS "]
[{"$f":"LEN(PUC[[#This Row],[AUXILIAR]])","v":6},510595,"OTROS "]
[{"$f":"LEN(PUC[[#This Row],[AUXILIAR]])","v":6},510599,"AJUSTES POR INFLACION "]
[{"$f":"LEN(PUC[[#This Row],[AUXILIAR]])","v":4},5110,"HONORARIOS "]
[{"$f":"LEN(PUC[[#This Row],[AUXILIAR]])","v":6},511005,"JUNTA DIRECTIVA "]
[{"$f":"LEN(PUC[[#This Row],[AUXILIAR]])","v":6},511010,"REVISORÍA FISCAL "]
[{"$f":"LEN(PUC[[#This Row],[AUXILIAR]])","v":6},511015,"AUDITORIA EXTERNA "]
[{"$f":"LEN(PUC[[#This Row],[AUXILIAR]])","v":6},511020,"AVALUOS "]
[{"$f":"LEN(PUC[[#This Row],[AUXILIAR]])","v":6},511025,"ASESORIA JURIDICA "]
[{"$f":"LEN(PUC[[#This Row],[AUXILIAR]])","v":6},511030,"ASESORIA FINANCIERA "]
[{"$f":"LEN(PUC[[#This Row],[AUXILIAR]])","v":6},511035,"ASESORIA TECNICA "]
[{"$f":"LEN(PUC[[#This Row],[AUXILIAR]])","v":6},511095,"OTROS "]
[{"$f":"LEN(PUC[[#This Row],[AUXILIAR]])","v":6},511099,"AJUSTES POR INFLACION "]
[{"$f":"LEN(PUC[[#This Row],[AUXILIAR]])","v":4},5115,"IMPUESTOS "]
[{"$f":"LEN(PUC[[#This Row],[AUXILIAR]])","v":6},511505,"INDUSTRIA Y COMERCIO "]
[{"$f":"LEN(PUC[[#This Row],[AUXILIAR]])","v":6},511510,"DE TIMBRES "]
[{"$f":"LEN(PUC[[#This Row],[AUXILIAR]])","v":6},511515,"A LA PROPIEDAD RAIZ "]
[{"$f":"LEN(PUC[[#This Row],[AUXILIAR]])","v":6},511520,"DERECHOS SOBRE INSTRUMENTOS PUBLICOS "]
[{"$f":"LEN(PUC[[#This Row],[AUXILIAR]])","v":6},511525,"DE VALORIZACION "]
[{"$f":"LEN(PUC[[#This Row],[AUXILIAR]])","v":6},511530,"DE TURISMO "]
[{"$f":"LEN(PUC[[#This Row],[AUXILIAR]])","v":6},511535,"TASA POR UTILIZACION DE PUERTOS "]
[{"$f":"LEN(PUC[[#This Row],[AUXILIAR]])","v":6},511540,"DE VEHICULOS "]
[{"$f":"LEN(PUC[[#This Row],[AUXILIAR]])","v":6},511545,"DE ESPECTACULOS PUBLICOS "]
[{"$f":"LEN(PUC[[#This Row],[AUXILIAR]])","v":6},511550,"CUOTAS DE FOMENTO "]
[{"$f":"LEN(PUC[[#This Row],[AUXILIAR]])","v":6},511570,"IVA DESCONTABLE "]
[{"$f":"LEN(PUC[[#This Row],[AUXILIAR]])","v":6},511595,"OTROS "]
[{"$f":"LEN(PUC[[#This Row],[AUXILIAR]])","v":6},511599,"AJUSTES POR INFLACION "]
[{"$f":"LEN(PUC[[#This Row],[AUXILIAR]])","v":4},5120,"ARRENDAMIENTOS "]
[{"$f":"LEN(PUC[[#This Row],[AUXILIAR]])","v":6},512005,"TERRENOS "]
[{"$f":"LEN(PUC[[#This Row],[AUXILIAR]])","v":6},512010,"CONSTRUCCIONES Y EDIFICACIONES "]
[{"$f":"LEN(PUC[[#This Row],[AUXILIAR]])","v":6},512015,"MAQUINARIA Y EQUIPO "]
[{"$f":"LEN(PUC[[#This Row],[AUXILIAR]])","v":6},512020,"EQUIPO DE OFICINA "]
[{"$f":"LEN(PUC[[#This Row],[AUXILIAR]])","v":6},512025,"EQUIPO DE COMPUTACION Y COMUNICACION "]
[{"$f":"LEN(PUC[[#This Row],[AUXILIAR]])","v":6},512030,"EQUIPO MEDICO - CIENTIFICO "]
[{"$f":"LEN(PUC[[#This Row],[AUXILIAR]])","v":6},512035,"EQUIPO DE HOTELES Y RESTAURANTES "]
[{"$f":"LEN(PUC[[#This Row],[AUXILIAR]])","v":6},512040,"FLOTA Y EQUIPO DE TRANSPORTE "]
[{"$f":"LEN(PUC[[#This Row],[AUXILIAR]])","v":6},512045,"FLOTA Y EQUIPO FLUVIAL Y/O MARITIMO "]
[{"$f":"LEN(PUC[[#This Row],[AUXILIAR]])","v":6},512050,"FLOTA Y EQUIPO AEREO "]
[{"$f":"LEN(PUC[[#This Row],[AUXILIAR]])","v":6},512055,"FLOTA Y EQUIPO FERREO "]
[{"$f":"LEN(PUC[[#This Row],[AUXILIAR]])","v":6},512060,"ACUEDUCTOS PLANTAS Y REDES "]
[{"$f":"LEN(PUC[[#This Row],[AUXILIAR]])","v":6},512065,"AERODROMOS "]
[{"$f":"LEN(PUC[[#This Row],[AUXILIAR]])","v":6},512070,"SEMOVIENTES "]
[{"$f":"LEN(PUC[[#This Row],[AUXILIAR]])","v":6},512095,"OTROS "]
[{"$f":"LEN(PUC[[#This Row],[AUXILIAR]])","v":6},512099,"AJUSTES POR INFLACION "]
[{"$f":"LEN(PUC[[#This Row],[AUXILIAR]])","v":4},5125,"CONTRIBUCIONES Y AFILIACIONES "]
[{"$f":"LEN(PUC[[#This Row],[AUXILIAR]])","v":6},512505,"CONTRIBUCIONES "]
[{"$f":"LEN(PUC[[#This Row],[AUXILIAR]])","v":6},512510,"AFILIACIONES Y SOSTENIMIENTO "]
[{"$f":"LEN(PUC[[#This Row],[AUXILIAR]])","v":6},512599,"AJUSTES POR INFLACION "]
[{"$f":"LEN(PUC[[#This Row],[AUXILIAR]])","v":4},5130,"SEGUROS "]
[{"$f":"LEN(PUC[[#This Row],[AUXILIAR]])","v":6},513005,"MANEJO "]
[{"$f":"LEN(PUC[[#This Row],[AUXILIAR]])","v":6},513010,"CUMPLIMIENTO "]
[{"$f":"LEN(PUC[[#This Row],[AUXILIAR]])","v":6},513020,"VIDA COLECTIVA "]
[{"$f":"LEN(PUC[[#This Row],[AUXILIAR]])","v":6},513025,"INCENDIO "]
[{"$f":"LEN(PUC[[#This Row],[AUXILIAR]])","v":6},513030,"TERREMOTO "]
[{"$f":"LEN(PUC[[#This Row],[AUXILIAR]])","v":6},513035,"SUSTRACCION Y HURTO "]
[{"$f":"LEN(PUC[[#This Row],[AUXILIAR]])","v":6},513040,"FLOTA Y EQUIPO DE TRANSPORTE "]
[{"$f":"LEN(PUC[[#This Row],[AUXILIAR]])","v":6},513045,"FLOTA Y EQUIPO FLUVIAL Y/O MARITIMO "]
[{"$f":"LEN(PUC[[#This Row],[AUXILIAR]])","v":6},513050,"FLOTA Y EQUIPO AEREO "]
[{"$f":"LEN(PUC[[#This Row],[AUXILIAR]])","v":6},513055,"FLOTA Y EQUIPO FERREO "]
[{"$f":"LEN(PUC[[#This Row],[AUXILIAR]])","v":6},513060,"RESPONSABILIDAD CIVIL Y EXTRACONTRACTUAL "]
[{"$f":"LEN(PUC[[#This Row],[AUXILIAR]])","v":6},513065,"VUELO "]
[{"$f":"LEN(PUC[[#This Row],[AUXILIAR]])","v":6},513070,"ROTURA DE MAQUINARIA "]
[{"$f":"LEN(PUC[[#This Row],[AUXILIAR]])","v":6},513075,"OBLIGATORIO ACCIDENTE DE TRANSITO "]
[{"$f":"LEN(PUC[[#This Row],[AUXILIAR]])","v":6},513080,"LUCRO CESANTE "]
[{"$f":"LEN(PUC[[#This Row],[AUXILIAR]])","v":6},513095,"OTROS "]
[{"$f":"LEN(PUC[[#This Row],[AUXILIAR]])","v":6},513099,"AJUSTES POR INFLACION "]
[{"$f":"LEN(PUC[[#This Row],[AUXILIAR]])","v":4},5135,"SERVICIOS "]
[{"$f":"LEN(PUC[[#This Row],[AUXILIAR]])","v":6},513505,"ASEO Y VIGILANCIA "]
[{"$f":"LEN(PUC[[#This Row],[AUXILIAR]])","v":6},513510,"TEMPORALES "]
[{"$f":"LEN(PUC[[#This Row],[AUXILIAR]])","v":6},513515,"ASISTENCIA TECNICA "]
[{"$f":"LEN(PUC[[#This Row],[AUXILIAR]])","v":6},513520,"PROCESAMIENTO ELECTRONICO DE DATOS "]
[{"$f":"LEN(PUC[[#This Row],[AUXILIAR]])","v":6},513525,"ACUEDUCTO Y ALCANTARILLADO "]
[{"$f":"LEN(PUC[[#This Row],[AUXILIAR]])","v":6},513530,"ENERGIA ELECTRICA "]
[{"$f":"LEN(PUC[[#This Row],[AUXILIAR]])","v":6},513535,"TELEFONO "]
[{"$f":"LEN(PUC[[#This Row],[AUXILIAR]])","v":6},513540,"CORREO, PORTES Y TELEGRAMAS "]
[{"$f":"LEN(PUC[[#This Row],[AUXILIAR]])","v":6},513545,"FAX Y TELEX "]
[{"$f":"LEN(PUC[[#This Row],[AUXILIAR]])","v":6},513550,"TRANSPORTE, FLETES Y ACARREOS "]
[{"$f":"LEN(PUC[[#This Row],[AUXILIAR]])","v":6},513555,"GAS "]
[{"$f":"LEN(PUC[[#This Row],[AUXILIAR]])","v":6},513595,"IMPLEMENTACION SSGT"]
[{"$f":"LEN(PUC[[#This Row],[AUXILIAR]])","v":6},513599,"AJUSTES POR INFLACION "]
[{"$f":"LEN(PUC[[#This Row],[AUXILIAR]])","v":4},5140,"GASTOS LEGALES "]
[{"$f":"LEN(PUC[[#This Row],[AUXILIAR]])","v":6},514005,"NOTARIALES "]
[{"$f":"LEN(PUC[[#This Row],[AUXILIAR]])","v":6},514010,"REGISTRO MERCANTIL "]
[{"$f":"LEN(PUC[[#This Row],[AUXILIAR]])","v":6},514015,"TRAMITES Y LICENCIAS "]
[{"$f":"LEN(PUC[[#This Row],[AUXILIAR]])","v":6},514020,"ADUANEROS "]
[{"$f":"LEN(PUC[[#This Row],[AUXILIAR]])","v":6},514025,"CONSULARES "]
[{"$f":"LEN(PUC[[#This Row],[AUXILIAR]])","v":6},514095,"OTROS "]
[{"$f":"LEN(PUC[[#This Row],[AUXILIAR]])","v":6},514099,"AJUSTES POR INFLACION "]
[{"$f":"LEN(PUC[[#This Row],[AUXILIAR]])","v":4},5145,"MANTENIMIENTO Y REPARACIONES "]
[{"$f":"LEN(PUC[[#This Row],[AUXILIAR]])","v":6},514505,"TERRENOS "]
[{"$f":"LEN(PUC[[#This Row],[AUXILIAR]])","v":6},514510,"CONSTRUCCIONES Y EDIFICACIONES "]
[{"$f":"LEN(PUC[[#This Row],[AUXILIAR]])","v":6},514515,"MANTENIMIENTO MAQUINARIA Y EQUIPO "]
[{"$f":"LEN(PUC[[#This Row],[AUXILIAR]])","v":6},514520,"EQUIPO DE OFICINA "]
[{"$f":"LEN(PUC[[#This Row],[AUXILIAR]])","v":6},514525,"EQUIPO DE COMPUTACION Y COMUNICACION "]
[{"$f":"LEN(PUC[[#This Row],[AUXILIAR]])","v":6},514530,"EQUIPO MEDICO-CIENTIFICO "]
[{"$f":"LEN(PUC[[#This Row],[AUXILIAR]])","v":6},514535,"EQUIPO DE HOTELES Y RESTAURANTES "]
[{"$f":"LEN(PUC[[#This Row],[AUXILIAR]])","v":6},514540,"FLOTA Y EQUIPO DE TRANSPORTE "]
[{"$f":"LEN(PUC[[#This Row],[AUXILIAR]])","v":6},514545,"FLOTA Y EQUIPO FLUVIAL Y/O MARITIMO "]
[{"$f":"LEN(PUC[[#This Row],[AUXILIAR]])","v":6},514550,"FLOTA Y EQUIPO AEREO "]
[{"$f":"LEN(PUC[[#This Row],[AUXILIAR]])","v":6},514555,"FLOTA Y EQUIPO FERREO "]
[{"$f":"LEN(PUC[[#This Row],[AUXILIAR]])","v":6},514560,"ACUEDUCTOS PLANTAS Y REDES "]
[{"$f":"LEN(PUC[[#This Row],[AUXILIAR]])","v":6},514565,"ARMAMENTO DE VIGILANCIA "]
[{"$f":"LEN(PUC[[#This Row],[AUXILIAR]])","v":6},514570,"VIAS DE COMUNICACION "]
[{"$f":"LEN(PUC[[#This Row],[AUXILIAR]])","v":6},514599,"AJUSTES POR INFLACION "]
[{"$f":"LEN(PUC[[#This Row],[AUXILIAR]])","v":4},5150,"ADECUACION E INSTALACION "]
[{"$f":"LEN(PUC[[#This Row],[AUXILIAR]])","v":6},515005,"INSTALACIONES ELECTRICAS "]
[{"$f":"LEN(PUC[[#This Row],[AUXILIAR]])","v":6},515010,"ARREGLOS ORNAMENTALES "]
[{"$f":"LEN(PUC[[#This Row],[AUXILIAR]])","v":6},515015,"REPARACIONES LOCATIVAS "]
[{"$f":"LEN(PUC[[#This Row],[AUXILIAR]])","v":6},515095,"OTROS "]
[{"$f":"LEN(PUC[[#This Row],[AUXILIAR]])","v":6},515099,"AJUSTES POR INFLACION "]
[{"$f":"LEN(PUC[[#This Row],[AUXILIAR]])","v":4},5155,"GASTOS DE VIAJE "]
[{"$f":"LEN(PUC[[#This Row],[AUXILIAR]])","v":6},515505,"ALOJAMIENTO Y MANUTENCION "]
[{"$f":"LEN(PUC[[#This Row],[AUXILIAR]])","v":6},515510,"PASAJES FLUVIALES Y/O MARITIMOS "]
[{"$f":"LEN(PUC[[#This Row],[AUXILIAR]])","v":6},515515,"PASAJES AEREOS "]
[{"$f":"LEN(PUC[[#This Row],[AUXILIAR]])","v":6},515520,"PASAJES TERRESTRES "]
[{"$f":"LEN(PUC[[#This Row],[AUXILIAR]])","v":6},515525,"PASAJES FERREOS "]
[{"$f":"LEN(PUC[[#This Row],[AUXILIAR]])","v":6},515595,"OTROS "]
[{"$f":"LEN(PUC[[#This Row],[AUXILIAR]])","v":6},515599,"AJUSTES POR INFLACION "]
[{"$f":"LEN(PUC[[#This Row],[AUXILIAR]])","v":4},5160,"DEPRECIACIONES "]
[{"$f":"LEN(PUC[[#This Row],[AUXILIAR]])","v":6},516005,"CONSTRUCCIONES Y EDIFICACIONES "]
[{"$f":"LEN(PUC[[#This Row],[AUXILIAR]])","v":6},516010,"MAQUINARIA Y EQUIPO "]
[{"$f":"LEN(PUC[[#This Row],[AUXILIAR]])","v":6},516015,"EQUIPO DE OFICINA "]
[{"$f":"LEN(PUC[[#This Row],[AUXILIAR]])","v":6},516020,"EQUIPO DE COMPUTACION Y COMUNICACION "]
[{"$f":"LEN(PUC[[#This Row],[AUXILIAR]])","v":6},516025,"EQUIPO MEDICO - CIENTIFICO "]
[{"$f":"LEN(PUC[[#This Row],[AUXILIAR]])","v":6},516030,"EQUIPO DE HOTELES Y RESTAURANTES "]
[{"$f":"LEN(PUC[[#This Row],[AUXILIAR]])","v":6},516035,"FLOTA Y EQUIPO DE TRANSPORTE "]
[{"$f":"LEN(PUC[[#This Row],[AUXILIAR]])","v":6},516040,"FLOTA Y EQUIPO FLUVIAL Y/O MARITIMO "]
[{"$f":"LEN(PUC[[#This Row],[AUXILIAR]])","v":6},516045,"FLOTA Y EQUIPO AEREO "]
[{"$f":"LEN(PUC[[#This Row],[AUXILIAR]])","v":6},516050,"FLOTA Y EQUIPO FERREO "]
[{"$f":"LEN(PUC[[#This Row],[AUXILIAR]])","v":6},516055,"ACUEDUCTOS, PLANTAS Y REDES "]
[{"$f":"LEN(PUC[[#This Row],[AUXILIAR]])","v":6},516060,"ARMAMENTO DE VIGILANCIA "]
[{"$f":"LEN(PUC[[#This Row],[AUXILIAR]])","v":6},516099,"AJUSTES POR INFLACION "]
[{"$f":"LEN(PUC[[#This Row],[AUXILIAR]])","v":4},5165,"AMORTIZACIONES "]
[{"$f":"LEN(PUC[[#This Row],[AUXILIAR]])","v":6},516505,"VIAS DE COMUNICACION "]
[{"$f":"LEN(PUC[[#This Row],[AUXILIAR]])","v":6},516510,"INTANGIBLES "]
[{"$f":"LEN(PUC[[#This Row],[AUXILIAR]])","v":6},516515,"CARGOS DIFERIDOS "]
[{"$f":"LEN(PUC[[#This Row],[AUXILIAR]])","v":6},516595,"OTRAS "]
[{"$f":"LEN(PUC[[#This Row],[AUXILIAR]])","v":6},516599,"AJUSTES POR INFLACION "]
[{"$f":"LEN(PUC[[#This Row],[AUXILIAR]])","v":4},5195,"DIVERSOS "]
[{"$f":"LEN(PUC[[#This Row],[AUXILIAR]])","v":6},519505,"COMISIONES "]
[{"$f":"LEN(PUC[[#This Row],[AUXILIAR]])","v":6},519510,"LIBROS, SUSCRIPCIONES, PERIODICOS Y REVISTAS "]
[{"$f":"LEN(PUC[[#This Row],[AUXILIAR]])","v":6},519515,"MUSICA AMBIENTAL "]
[{"$f":"LEN(PUC[[#This Row],[AUXILIAR]])","v":6},519520,"GASTOS DE REPRESENTACION Y RELACIONES PUBLICAS "]
[{"$f":"LEN(PUC[[#This Row],[AUXILIAR]])","v":6},519525,"ELEMENTOS DE ASEO Y CAFETERIA "]
[{"$f":"LEN(PUC[[#This Row],[AUXILIAR]])","v":6},519530,"UTILES, PAPELERIA Y FOTOCOPIAS "]
[{"$f":"LEN(PUC[[#This Row],[AUXILIAR]])","v":6},519535,"COMBUSTIBLES Y LUBRICANTES "]
[{"$f":"LEN(PUC[[#This Row],[AUXILIAR]])","v":6},519540,"ENVASES Y EMPAQUES "]
[{"$f":"LEN(PUC[[#This Row],[AUXILIAR]])","v":6},519545,"TAXIS Y BUSES "]
[{"$f":"LEN(PUC[[#This Row],[AUXILIAR]])","v":6},519550,"ESTAMPILLAS "]
[{"$f":"LEN(PUC[[#This Row],[AUXILIAR]])","v":6},519555,"MICROFILMACION "]
[{"$f":"LEN(PUC[[#This Row],[AUXILIAR]])","v":6},519560,"CASINO Y RESTAURANTE "]
[{"$f":"LEN(PUC[[#This Row],[AUXILIAR]])","v":6},519565,"PARQUEADEROS "]
[{"$f":"LEN(PUC[[#This Row],[AUXILIAR]])","v":6},519570,"INDEMNIZACION POR DAÑOS A TERCEROS "]
[{"$f":"LEN(PUC[[#This Row],[AUXILIAR]])","v":6},519575,"POLVORA Y SIMILARES "]
[{"$f":"LEN(PUC[[#This Row],[AUXILIAR]])","v":6},519595,"OTROS "]
[{"$f":"LEN(PUC[[#This Row],[AUXILIAR]])","v":6},519599,"AJUSTES POR INFLACION "]
[{"$f":"LEN(PUC[[#This Row],[AUXILIAR]])","v":4},5199,"PROVISIONES "]
[{"$f":"LEN(PUC[[#This Row],[AUXILIAR]])","v":6},519905,"INVERSIONES "]
[{"$f":"LEN(PUC[[#This Row],[AUXILIAR]])","v":6},519910,"DEUDORES "]
[{"$f":"LEN(PUC[[#This Row],[AUXILIAR]])","v":6},519915,"PROPIEDADES, PLANTA Y EQUIPO "]
[{"$f":"LEN(PUC[[#This Row],[AUXILIAR]])","v":6},519995,"OTROS ACTIVOS "]
[{"$f":"LEN(PUC[[#This Row],[AUXILIAR]])","v":6},519999,"AJUSTES POR INFLACION "]
[{"$f":"LEN(PUC[[#This Row],[AUXILIAR]])","v":2},52,"OPERACIONALES DE VENTAS "]
[{"$f":"LEN(PUC[[#This Row],[AUXILIAR]])","v":4},5205,"GASTOS DE PERSONAL "]
[{"$f":"LEN(PUC[[#This Row],[AUXILIAR]])","v":6},520503,"SALARIO INTEGRAL "]
[{"$f":"LEN(PUC[[#This Row],[AUXILIAR]])","v":6},520506,"SUELDOS "]
[{"$f":"LEN(PUC[[#This Row],[AUXILIAR]])","v":6},520512,"JORNALES "]
[{"$f":"LEN(PUC[[#This Row],[AUXILIAR]])","v":6},520515,"HORAS EXTRAS Y RECARGOS "]
[{"$f":"LEN(PUC[[#This Row],[AUXILIAR]])","v":6},520518,"COMISIONES "]
[{"$f":"LEN(PUC[[#This Row],[AUXILIAR]])","v":6},520521,"VIATICOS "]
[{"$f":"LEN(PUC[[#This Row],[AUXILIAR]])","v":6},520524,"INCAPACIDADES "]
[{"$f":"LEN(PUC[[#This Row],[AUXILIAR]])","v":6},520527,"AUXILIO DE TRANSPORTE "]
[{"$f":"LEN(PUC[[#This Row],[AUXILIAR]])","v":6},520530,"CESANTIAS "]
[{"$f":"LEN(PUC[[#This Row],[AUXILIAR]])","v":6},520533,"INTERESES SOBRE CESANTIAS "]
[{"$f":"LEN(PUC[[#This Row],[AUXILIAR]])","v":6},520536,"PRIMA DE SERVICIOS "]
[{"$f":"LEN(PUC[[#This Row],[AUXILIAR]])","v":6},520539,"VACACIONES "]
[{"$f":"LEN(PUC[[#This Row],[AUXILIAR]])","v":6},520542,"PRIMAS EXTRALEGALES "]
[{"$f":"LEN(PUC[[#This Row],[AUXILIAR]])","v":6},520545,"AUXILIOS "]
[{"$f":"LEN(PUC[[#This Row],[AUXILIAR]])","v":6},520548,"BONIFICACIONES "]
[{"$f":"LEN(PUC[[#This Row],[AUXILIAR]])","v":6},520551,"DOTACION Y SUMINISTRO A TRABAJADORES "]
[{"$f":"LEN(PUC[[#This Row],[AUXILIAR]])","v":6},520554,"SEGUROS "]
[{"$f":"LEN(PUC[[#This Row],[AUXILIAR]])","v":6},520557,"CUOTAS PARTES PENSIONES DE JUBILACION "]
[{"$f":"LEN(PUC[[#This Row],[AUXILIAR]])","v":6},520558,"AMORTIZACION CALCULO ACTUARIAL PENSIONES DE JUBILACION "]
[{"$f":"LEN(PUC[[#This Row],[AUXILIAR]])","v":6},520559,"PENSIONES DE JUBILACION "]
[{"$f":"LEN(PUC[[#This Row],[AUXILIAR]])","v":6},520560,"INDEMNIZACIONES LABORALES "]
[{"$f":"LEN(PUC[[#This Row],[AUXILIAR]])","v":6},520563,"CAPACITACION AL PERSONAL "]
[{"$f":"LEN(PUC[[#This Row],[AUXILIAR]])","v":6},520566,"GASTOS DEPORTIVOS Y DE RECREACION "]
[{"$f":"LEN(PUC[[#This Row],[AUXILIAR]])","v":6},520569,"APORTES AL I.S.S "]
[{"$f":"LEN(PUC[[#This Row],[AUXILIAR]])","v":6},520572,"APORTES CAJAS DE COMPENSACION FAMILIAR "]
[{"$f":"LEN(PUC[[#This Row],[AUXILIAR]])","v":6},520575,"APORTES I.C.B.F. "]
[{"$f":"LEN(PUC[[#This Row],[AUXILIAR]])","v":6},520578,"SENA "]
[{"$f":"LEN(PUC[[#This Row],[AUXILIAR]])","v":6},520581,"APORTES SINDICALES "]
[{"$f":"LEN(PUC[[#This Row],[AUXILIAR]])","v":6},520584,"GASTOS MEDICOS Y DROGAS "]
[{"$f":"LEN(PUC[[#This Row],[AUXILIAR]])","v":6},520595,"OTROS "]
[{"$f":"LEN(PUC[[#This Row],[AUXILIAR]])","v":6},520599,"AJUSTES POR INFLACION "]
[{"$f":"LEN(PUC[[#This Row],[AUXILIAR]])","v":4},5210,"HONORARIOS "]
[{"$f":"LEN(PUC[[#This Row],[AUXILIAR]])","v":6},521005,"JUNTA DIRECTIVA "]
[{"$f":"LEN(PUC[[#This Row],[AUXILIAR]])","v":6},521010,"REVISORIA FISCAL "]
[{"$f":"LEN(PUC[[#This Row],[AUXILIAR]])","v":6},521015,"AUDITORIA EXTERNA "]
[{"$f":"LEN(PUC[[#This Row],[AUXILIAR]])","v":6},521020,"AVALUOS "]
[{"$f":"LEN(PUC[[#This Row],[AUXILIAR]])","v":6},521025,"ASESORIA JURIDICA "]
[{"$f":"LEN(PUC[[#This Row],[AUXILIAR]])","v":6},521030,"ASESORIA FINANCIERA "]
[{"$f":"LEN(PUC[[#This Row],[AUXILIAR]])","v":6},521035,"ASESORIA TECNICA "]
[{"$f":"LEN(PUC[[#This Row],[AUXILIAR]])","v":6},521095,"OTROS "]
[{"$f":"LEN(PUC[[#This Row],[AUXILIAR]])","v":6},521099,"AJUSTES POR INFLACION "]
[{"$f":"LEN(PUC[[#This Row],[AUXILIAR]])","v":4},5215,"IMPUESTOS "]
[{"$f":"LEN(PUC[[#This Row],[AUXILIAR]])","v":6},521505,"INDUSTRIA Y COMERCIO "]
[{"$f":"LEN(PUC[[#This Row],[AUXILIAR]])","v":6},521510,"DE TIMBRES "]
[{"$f":"LEN(PUC[[#This Row],[AUXILIAR]])","v":6},521515,"A LA PROPIEDAD RAIZ "]
[{"$f":"LEN(PUC[[#This Row],[AUXILIAR]])","v":6},521520,"DERECHOS SOBRE INSTRUMENTOS PUBLICOS "]
[{"$f":"LEN(PUC[[#This Row],[AUXILIAR]])","v":6},521525,"DE VALORIZACION "]
[{"$f":"LEN(PUC[[#This Row],[AUXILIAR]])","v":6},521530,"DE TURISMO "]
[{"$f":"LEN(PUC[[#This Row],[AUXILIAR]])","v":6},521535,"TASA POR UTILIZACION DE PUERTOS "]
[{"$f":"LEN(PUC[[#This Row],[AUXILIAR]])","v":6},521540,"DE VEHICULOS "]
[{"$f":"LEN(PUC[[#This Row],[AUXILIAR]])","v":6},521545,"DE ESPECTACULOS PUBLICOS "]
[{"$f":"LEN(PUC[[#This Row],[AUXILIAR]])","v":6},521550,"CUOTAS DE FOMENTO "]
[{"$f":"LEN(PUC[[#This Row],[AUXILIAR]])","v":6},521555,"LICORES "]
[{"$f":"LEN(PUC[[#This Row],[AUXILIAR]])","v":6},521560,"CERVEZAS "]
[{"$f":"LEN(PUC[[#This Row],[AUXILIAR]])","v":6},521565,"CIGARRILLOS "]
[{"$f":"LEN(PUC[[#This Row],[AUXILIAR]])","v":6},521570,"IVA DESCONTABLE "]
[{"$f":"LEN(PUC[[#This Row],[AUXILIAR]])","v":6},521595,"OTROS "]
[{"$f":"LEN(PUC[[#This Row],[AUXILIAR]])","v":6},521599,"AJUSTES POR INFLACION "]
[{"$f":"LEN(PUC[[#This Row],[AUXILIAR]])","v":4},5220,"ARRENDAMIENTOS "]
[{"$f":"LEN(PUC[[#This Row],[AUXILIAR]])","v":6},522005,"TERRENOS "]
[{"$f":"LEN(PUC[[#This Row],[AUXILIAR]])","v":6},522010,"CONSTRUCCIONES Y EDIFICACIONES "]
[{"$f":"LEN(PUC[[#This Row],[AUXILIAR]])","v":6},522015,"MAQUINARIA Y EQUIPO "]
[{"$f":"LEN(PUC[[#This Row],[AUXILIAR]])","v":6},522020,"EQUIPO DE OFICINA "]
[{"$f":"LEN(PUC[[#This Row],[AUXILIAR]])","v":6},522025,"EQUIPO DE COMPUTACION Y COMUNICACION "]
[{"$f":"LEN(PUC[[#This Row],[AUXILIAR]])","v":6},522030,"EQUIPO MEDICO - CIENTIFICO "]
[{"$f":"LEN(PUC[[#This Row],[AUXILIAR]])","v":6},522035,"EQUIPO DE HOTELES Y RESTAURANTES "]
[{"$f":"LEN(PUC[[#This Row],[AUXILIAR]])","v":6},522040,"FLOTA Y EQUIPO DE TRANSPORTE "]
[{"$f":"LEN(PUC[[#This Row],[AUXILIAR]])","v":6},522045,"FLOTA Y EQUIPO FLUVIAL Y/O MARITIMO "]
[{"$f":"LEN(PUC[[#This Row],[AUXILIAR]])","v":6},522050,"FLOTA Y EQUIPO AEREO "]
[{"$f":"LEN(PUC[[#This Row],[AUXILIAR]])","v":6},522055,"FLOTA Y EQUIPO FERREO "]
[{"$f":"LEN(PUC[[#This Row],[AUXILIAR]])","v":6},522060,"ACUEDUCTOS PLANTAS Y REDES "]
[{"$f":"LEN(PUC[[#This Row],[AUXILIAR]])","v":6},522065,"AERODROMOS "]
[{"$f":"LEN(PUC[[#This Row],[AUXILIAR]])","v":6},522070,"SEMOVIENTES "]
[{"$f":"LEN(PUC[[#This Row],[AUXILIAR]])","v":6},522095,"OTROS "]
[{"$f":"LEN(PUC[[#This Row],[AUXILIAR]])","v":6},522099,"AJUSTES POR INFLACION "]
[{"$f":"LEN(PUC[[#This Row],[AUXILIAR]])","v":4},5225,"CONTRIBUCIONES Y AFILIACIONES "]
[{"$f":"LEN(PUC[[#This Row],[AUXILIAR]])","v":6},522505,"CONTRIBUCIONES "]
[{"$f":"LEN(PUC[[#This Row],[AUXILIAR]])","v":6},522510,"AFILIACIONES Y SOSTENIMIENTO "]
[{"$f":"LEN(PUC[[#This Row],[AUXILIAR]])","v":6},522599,"AJUSTES POR INFLACION "]
[{"$f":"LEN(PUC[[#This Row],[AUXILIAR]])","v":4},5230,"SEGUROS "]
[{"$f":"LEN(PUC[[#This Row],[AUXILIAR]])","v":6},523005,"MANEJO "]
[{"$f":"LEN(PUC[[#This Row],[AUXILIAR]])","v":6},523010,"CUMPLIMIENTO "]
[{"$f":"LEN(PUC[[#This Row],[AUXILIAR]])","v":6},523015,"CORRIENTE DEBIL "]
[{"$f":"LEN(PUC[[#This Row],[AUXILIAR]])","v":6},523020,"VIDA COLECTIVA "]
[{"$f":"LEN(PUC[[#This Row],[AUXILIAR]])","v":6},523025,"INCENDIO "]
[{"$f":"LEN(PUC[[#This Row],[AUXILIAR]])","v":6},523030,"TERREMOTO "]
[{"$f":"LEN(PUC[[#This Row],[AUXILIAR]])","v":6},523035,"SUSTRACCION Y HURTO "]
[{"$f":"LEN(PUC[[#This Row],[AUXILIAR]])","v":6},523040,"FLOTA Y EQUIPO DE TRANSPORTE "]
[{"$f":"LEN(PUC[[#This Row],[AUXILIAR]])","v":6},523045,"FLOTA Y EQUIPO FLUVIAL Y/O MARITIMO "]
[{"$f":"LEN(PUC[[#This Row],[AUXILIAR]])","v":6},523050,"FLOTA Y EQUIPO AEREO "]
[{"$f":"LEN(PUC[[#This Row],[AUXILIAR]])","v":6},523055,"FLOTA Y EQUIPO FERREO "]
[{"$f":"LEN(PUC[[#This Row],[AUXILIAR]])","v":6},523060,"RESPONSABILIDAD CIVIL Y EXTRACONTRACTUAL "]
[{"$f":"LEN(PUC[[#This Row],[AUXILIAR]])","v":6},523065,"VUELO "]
[{"$f":"LEN(PUC[[#This Row],[AUXILIAR]])","v":6},523070,"ROTURA DE MAQUINARIA "]
[{"$f":"LEN(PUC[[#This Row],[AUXILIAR]])","v":6},523075,"OBLIGATORIO ACCIDENTE DE TRANSITO "]
[{"$f":"LEN(PUC[[#This Row],[AUXILIAR]])","v":6},523080,"LUCRO CESANTE "]
[{"$f":"LEN(PUC[[#This Row],[AUXILIAR]])","v":6},523095,"OTROS "]
[{"$f":"LEN(PUC[[#This Row],[AUXILIAR]])","v":6},523099,"AJUSTES POR INFLACION "]
[{"$f":"LEN(PUC[[#This Row],[AUXILIAR]])","v":4},5235,"SERVICIOS "]
[{"$f":"LEN(PUC[[#This Row],[AUXILIAR]])","v":6},523505,"ASEO Y VIGILANCIA "]
[{"$f":"LEN(PUC[[#This Row],[AUXILIAR]])","v":6},523510,"TEMPORALES "]
[{"$f":"LEN(PUC[[#This Row],[AUXILIAR]])","v":6},523515,"ASISTENCIA TECNICA "]
[{"$f":"LEN(PUC[[#This Row],[AUXILIAR]])","v":6},523520,"PROCESAMIENTO ELECTRONICO DE DATOS "]
[{"$f":"LEN(PUC[[#This Row],[AUXILIAR]])","v":6},523525,"ACUEDUCTO Y ALCANTARILLADO "]
[{"$f":"LEN(PUC[[#This Row],[AUXILIAR]])","v":6},523530,"ENERGIA ELECTRICA "]
[{"$f":"LEN(PUC[[#This Row],[AUXILIAR]])","v":6},523535,"TELEFONO "]
[{"$f":"LEN(PUC[[#This Row],[AUXILIAR]])","v":6},523540,"CORREO, PORTES Y TELEGRAMAS "]
[{"$f":"LEN(PUC[[#This Row],[AUXILIAR]])","v":6},523545,"FAX Y TELEX "]
[{"$f":"LEN(PUC[[#This Row],[AUXILIAR]])","v":6},523550,"TRANSPORTE, FLETES Y ACARREOS "]
[{"$f":"LEN(PUC[[#This Row],[AUXILIAR]])","v":6},523555,"GAS "]
[{"$f":"LEN(PUC[[#This Row],[AUXILIAR]])","v":6},523560,"PROPAGANDA Y PUBLICIDAD "]
[{"$f":"LEN(PUC[[#This Row],[AUXILIAR]])","v":6},523595,"SERVICIOS DE COMERCIALIZACION"]
[{"$f":"LEN(PUC[[#This Row],[AUXILIAR]])","v":6},523599,"AJUSTES POR INFLACION "]
[{"$f":"LEN(PUC[[#This Row],[AUXILIAR]])","v":4},5240,"GASTOS LEGALES "]
[{"$f":"LEN(PUC[[#This Row],[AUXILIAR]])","v":6},524005,"NOTARIALES "]
[{"$f":"LEN(PUC[[#This Row],[AUXILIAR]])","v":6},524010,"REGISTRO MERCANTIL "]
[{"$f":"LEN(PUC[[#This Row],[AUXILIAR]])","v":6},524015,"TRAMITES Y LICENCIAS "]
[{"$f":"LEN(PUC[[#This Row],[AUXILIAR]])","v":6},524020,"ADUANEROS "]
[{"$f":"LEN(PUC[[#This Row],[AUXILIAR]])","v":6},524025,"CONSULARES "]
[{"$f":"LEN(PUC[[#This Row],[AUXILIAR]])","v":6},524095,"OTROS "]
[{"$f":"LEN(PUC[[#This Row],[AUXILIAR]])","v":6},524099,"AJUSTES POR INFLACION "]
[{"$f":"LEN(PUC[[#This Row],[AUXILIAR]])","v":4},5245,"MANTENIMIENTO Y REPARACIONES "]
[{"$f":"LEN(PUC[[#This Row],[AUXILIAR]])","v":6},524505,"TERRENOS "]
[{"$f":"LEN(PUC[[#This Row],[AUXILIAR]])","v":6},524510,"CONSTRUCCIONES Y EDIFICACIONES "]
[{"$f":"LEN(PUC[[#This Row],[AUXILIAR]])","v":6},524515,"MAQUINARIA Y EQUIPO "]
[{"$f":"LEN(PUC[[#This Row],[AUXILIAR]])","v":6},524520,"EQUIPO DE OFICINA "]
[{"$f":"LEN(PUC[[#This Row],[AUXILIAR]])","v":6},524525,"EQUIPO DE COMPUTACION Y COMUNICACION "]
[{"$f":"LEN(PUC[[#This Row],[AUXILIAR]])","v":6},524530,"EQUIPO MEDICO - CIENTIFICO "]
[{"$f":"LEN(PUC[[#This Row],[AUXILIAR]])","v":6},524535,"EQUIPO DE HOTELES Y RESTAURANTES "]
[{"$f":"LEN(PUC[[#This Row],[AUXILIAR]])","v":6},524540,"FLOTA Y EQUIPO DE TRANSPORTE "]
[{"$f":"LEN(PUC[[#This Row],[AUXILIAR]])","v":6},524545,"FLOTA Y EQUIPO FLUVIAL Y/O MARITIMO "]
[{"$f":"LEN(PUC[[#This Row],[AUXILIAR]])","v":6},524550,"FLOTA Y EQUIPO AEREO "]
[{"$f":"LEN(PUC[[#This Row],[AUXILIAR]])","v":6},524555,"FLOTA Y EQUIPO FERREO "]
[{"$f":"LEN(PUC[[#This Row],[AUXILIAR]])","v":6},524560,"ACUEDUCTOS PLANTAS Y REDES "]
[{"$f":"LEN(PUC[[#This Row],[AUXILIAR]])","v":6},524565,"ARMAMENTO DE VIGILANCIA "]
[{"$f":"LEN(PUC[[#This Row],[AUXILIAR]])","v":6},524570,"VIAS DE COMUNICACION "]
[{"$f":"LEN(PUC[[#This Row],[AUXILIAR]])","v":6},524599,"AJUSTES POR INFLACION "]
[{"$f":"LEN(PUC[[#This Row],[AUXILIAR]])","v":4},5250,"ADECUACION E INSTALACION "]
[{"$f":"LEN(PUC[[#This Row],[AUXILIAR]])","v":6},525005,"INSTALACIONES ELECTRICAS "]
[{"$f":"LEN(PUC[[#This Row],[AUXILIAR]])","v":6},525010,"ARREGLOS ORNAMENTALES "]
[{"$f":"LEN(PUC[[#This Row],[AUXILIAR]])","v":6},525015,"REPARACIONES LOCATIVAS "]
[{"$f":"LEN(PUC[[#This Row],[AUXILIAR]])","v":6},525095,"OTROS "]
[{"$f":"LEN(PUC[[#This Row],[AUXILIAR]])","v":6},525099,"AJUSTES POR INFLACION "]
[{"$f":"LEN(PUC[[#This Row],[AUXILIAR]])","v":4},5255,"GASTOS DE VIAJE "]
[{"$f":"LEN(PUC[[#This Row],[AUXILIAR]])","v":6},525505,"ALOJAMIENTO Y MANUTENCION "]
[{"$f":"LEN(PUC[[#This Row],[AUXILIAR]])","v":6},525510,"PASAJES FLUVIALES Y/O MARITIMOS "]
[{"$f":"LEN(PUC[[#This Row],[AUXILIAR]])","v":6},525515,"PASAJES AEREOS "]
[{"$f":"LEN(PUC[[#This Row],[AUXILIAR]])","v":6},525520,"PASAJES TERRESTRES "]
[{"$f":"LEN(PUC[[#This Row],[AUXILIAR]])","v":6},525525,"PASAJES FERREOS "]
[{"$f":"LEN(PUC[[#This Row],[AUXILIAR]])","v":6},525595,"OTROS "]
[{"$f":"LEN(PUC[[#This Row],[AUXILIAR]])","v":6},525599,"AJUSTES POR INFLACION "]
[{"$f":"LEN(PUC[[#This Row],[AUXILIAR]])","v":4},5260,"DEPRECIACIONES "]
[{"$f":"LEN(PUC[[#This Row],[AUXILIAR]])","v":6},526005,"CONSTRUCCIONES Y EDIFICACIONES "]
[{"$f":"LEN(PUC[[#This Row],[AUXILIAR]])","v":6},526010,"MAQUINARIA Y EQUIPO "]
[{"$f":"LEN(PUC[[#This Row],[AUXILIAR]])","v":6},526015,"EQUIPO DE OFICINA "]
[{"$f":"LEN(PUC[[#This Row],[AUXILIAR]])","v":6},526020,"EQUIPO DE COMPUTACION Y COMUNICACION "]
[{"$f":"LEN(PUC[[#This Row],[AUXILIAR]])","v":6},526025,"EQUIPO MEDICO - CIENTIFICO "]
[{"$f":"LEN(PUC[[#This Row],[AUXILIAR]])","v":6},526030,"EQUIPO DE HOTELES Y RESTAURANTES "]
[{"$f":"LEN(PUC[[#This Row],[AUXILIAR]])","v":6},526035,"FLOTA Y EQUIPO DE TRANSPORTE "]
[{"$f":"LEN(PUC[[#This Row],[AUXILIAR]])","v":6},526040,"FLOTA Y EQUIPO FLUVIAL Y/O MARITIMO "]
[{"$f":"LEN(PUC[[#This Row],[AUXILIAR]])","v":6},526045,"FLOTA Y EQUIPO AEREO "]
[{"$f":"LEN(PUC[[#This Row],[AUXILIAR]])","v":6},526050,"FLOTA Y EQUIPO FERREO "]
[{"$f":"LEN(PUC[[#This Row],[AUXILIAR]])","v":6},526055,"ACUEDUCTOS, PLANTAS Y REDES "]
[{"$f":"LEN(PUC[[#This Row],[AUXILIAR]])","v":6},526060,"ARMAMENTO DE VIGILANCIA "]
[{"$f":"LEN(PUC[[#This Row],[AUXILIAR]])","v":6},526065,"ENVASES Y EMPAQUES "]
[{"$f":"LEN(PUC[[#This Row],[AUXILIAR]])","v":6},526099,"AJUSTES POR INFLACION "]
[{"$f":"LEN(PUC[[#This Row],[AUXILIAR]])","v":4},5265,"AMORTIZACIONES "]
[{"$f":"LEN(PUC[[#This Row],[AUXILIAR]])","v":6},526505,"VIAS DE COMUNICACION "]
[{"$f":"LEN(PUC[[#This Row],[AUXILIAR]])","v":6},526510,"INTANGIBLES "]
[{"$f":"LEN(PUC[[#This Row],[AUXILIAR]])","v":6},526515,"CARGOS DIFERIDOS "]
[{"$f":"LEN(PUC[[#This Row],[AUXILIAR]])","v":6},526595,"OTRAS "]
[{"$f":"LEN(PUC[[#This Row],[AUXILIAR]])","v":6},526599,"AJUSTES POR INFLACION "]
[{"$f":"LEN(PUC[[#This Row],[AUXILIAR]])","v":4},5270,"FINANCIEROS - REAJUSTE DEL SISTEMA "]
[{"$f":"LEN(PUC[[#This Row],[AUXILIAR]])","v":6},527099,"AJUSTES POR INFLACION "]
[{"$f":"LEN(PUC[[#This Row],[AUXILIAR]])","v":4},5295,"DIVERSOS "]
[{"$f":"LEN(PUC[[#This Row],[AUXILIAR]])","v":6},529505,"COMISIONES "]
[{"$f":"LEN(PUC[[#This Row],[AUXILIAR]])","v":6},529510,"LIBROS, SUSCRIPCIONES, PERIODICOS Y REVISTAS "]
[{"$f":"LEN(PUC[[#This Row],[AUXILIAR]])","v":6},529515,"MUSICA AMBIENTAL "]
[{"$f":"LEN(PUC[[#This Row],[AUXILIAR]])","v":6},529520,"GASTOS DE REPRESENTACION Y RELACIONES PUBLICAS "]
[{"$f":"LEN(PUC[[#This Row],[AUXILIAR]])","v":6},529525,"ELEMENTOS DE ASEO Y CAFETERIA "]
[{"$f":"LEN(PUC[[#This Row],[AUXILIAR]])","v":6},529530,"UTILES, PAPELERIA Y FOTOCOPIAS "]
[{"$f":"LEN(PUC[[#This Row],[AUXILIAR]])","v":6},529535,"COMBUSTIBLES Y LUBRICANTES "]
[{"$f":"LEN(PUC[[#This Row],[AUXILIAR]])","v":6},529540,"ENVASES Y EMPAQUES "]
[{"$f":"LEN(PUC[[#This Row],[AUXILIAR]])","v":6},529545,"TAXIS Y BUSES "]
[{"$f":"LEN(PUC[[#This Row],[AUXILIAR]])","v":6},529550,"ESTAMPILLAS "]
[{"$f":"LEN(PUC[[#This Row],[AUXILIAR]])","v":6},529555,"MICROFILMACION "]
[{"$f":"LEN(PUC[[#This Row],[AUXILIAR]])","v":6},529560,"CASINO Y RESTAURANTE "]
[{"$f":"LEN(PUC[[#This Row],[AUXILIAR]])","v":6},529565,"PARQUEADEROS "]
[{"$f":"LEN(PUC[[#This Row],[AUXILIAR]])","v":6},529570,"INDEMNIZACION POR DAÑOS A TERCEROS "]
[{"$f":"LEN(PUC[[#This Row],[AUXILIAR]])","v":6},529575,"POLVORA Y SIMILARES "]
[{"$f":"LEN(PUC[[#This Row],[AUXILIAR]])","v":6},529595,"OTROS "]
[{"$f":"LEN(PUC[[#This Row],[AUXILIAR]])","v":6},529599,"AJUSTES POR INFLACION "]
[{"$f":"LEN(PUC[[#This Row],[AUXILIAR]])","v":4},5299,"PROVISIONES "]
[{"$f":"LEN(PUC[[#This Row],[AUXILIAR]])","v":6},529905,"INVERSIONES "]
[{"$f":"LEN(PUC[[#This Row],[AUXILIAR]])","v":6},529910,"DEUDORES "]
[{"$f":"LEN(PUC[[#This Row],[AUXILIAR]])","v":6},529915,"INVENTARIOS "]
[{"$f":"LEN(PUC[[#This Row],[AUXILIAR]])","v":6},529920,"PROPIEDADES, PLANTA Y EQUIPO "]
[{"$f":"LEN(PUC[[#This Row],[AUXILIAR]])","v":6},529995,"OTROS ACTIVOS "]
[{"$f":"LEN(PUC[[#This Row],[AUXILIAR]])","v":6},529999,"AJUSTES POR INFLACION "]
[{"$f":"LEN(PUC[[#This Row],[AUXILIAR]])","v":2},53,"NO OPERACIONALES "]
[{"$f":"LEN(PUC[[#This Row],[AUXILIAR]])","v":4},5305,"FINANCIEROS "]
[{"$f":"LEN(PUC[[#This Row],[AUXILIAR]])","v":6},530505,"GASTOS BANCARIOS "]
[{"$f":"LEN(PUC[[#This Row],[AUXILIAR]])","v":6},530510,"REAJUSTE MONETARIO - UPAC "]
[{"$f":"LEN(PUC[[#This Row],[AUXILIAR]])","v":6},530515,"COMISIONES "]
[{"$f":"LEN(PUC[[#This Row],[AUXILIAR]])","v":6},530520,"INTERESES "]
[{"$f":"LEN(PUC[[#This Row],[AUXILIAR]])","v":6},530525,"DIFERENCIA EN CAMBIO "]
[{"$f":"LEN(PUC[[#This Row],[AUXILIAR]])","v":6},530530,"GASTOS EN NEGOCIACION CERTIFICADOS DE CAMBIO "]
[{"$f":"LEN(PUC[[#This Row],[AUXILIAR]])","v":6},530535,"DESCUENTOS COMERCIALES CONDICIONADOS "]
[{"$f":"LEN(PUC[[#This Row],[AUXILIAR]])","v":6},530540,"GASTOS MANEJO Y EMISION DE BONOS "]
[{"$f":"LEN(PUC[[#This Row],[AUXILIAR]])","v":6},530545,"PRIMA AMORTIZADA "]
[{"$f":"LEN(PUC[[#This Row],[AUXILIAR]])","v":6},530595,"OTROS "]
[{"$f":"LEN(PUC[[#This Row],[AUXILIAR]])","v":6},530599,"AJUSTES POR INFLACION "]
[{"$f":"LEN(PUC[[#This Row],[AUXILIAR]])","v":4},5310,"PERDIDA EN VENTA Y RETIRO DE BIENES "]
[{"$f":"LEN(PUC[[#This Row],[AUXILIAR]])","v":6},531005,"VENTA DE INVERSIONES "]
[{"$f":"LEN(PUC[[#This Row],[AUXILIAR]])","v":6},531010,"VENTA DE CARTERA "]
[{"$f":"LEN(PUC[[#This Row],[AUXILIAR]])","v":6},531015,"VENTA DE PROPIEDADES PLANTA Y EQUIPO "]
[{"$f":"LEN(PUC[[#This Row],[AUXILIAR]])","v":6},531020,"VENTA DE INTANGIBLES "]
[{"$f":"LEN(PUC[[#This Row],[AUXILIAR]])","v":6},531025,"VENTA DE OTROS ACTIVOS "]
[{"$f":"LEN(PUC[[#This Row],[AUXILIAR]])","v":6},531030,"RETIRO DE PROPIEDADES PLANTA Y EQUIPO "]
[{"$f":"LEN(PUC[[#This Row],[AUXILIAR]])","v":6},531035,"RETIRO DE OTROS ACTIVOS "]
[{"$f":"LEN(PUC[[#This Row],[AUXILIAR]])","v":6},531040,"PERDIDAS POR SINIESTROS "]
[{"$f":"LEN(PUC[[#This Row],[AUXILIAR]])","v":6},531095,"OTROS "]
[{"$f":"LEN(PUC[[#This Row],[AUXILIAR]])","v":6},531099,"AJUSTES POR INFLACION "]
[{"$f":"LEN(PUC[[#This Row],[AUXILIAR]])","v":4},5315,"GASTOS EXTRAORDINARIOS "]
[{"$f":"LEN(PUC[[#This Row],[AUXILIAR]])","v":6},531505,"COSTAS Y PROCESOS JUDICIALES "]
[{"$f":"LEN(PUC[[#This Row],[AUXILIAR]])","v":6},531510,"ACTIVIDADES CULTURALES Y CIVICAS "]
[{"$f":"LEN(PUC[[#This Row],[AUXILIAR]])","v":6},531515,"COSTOS Y GASTOS DE EJERCICIOS ANTERIORES "]
[{"$f":"LEN(PUC[[#This Row],[AUXILIAR]])","v":6},531520,"IMPUESTOS ASUMIDOS "]
[{"$f":"LEN(PUC[[#This Row],[AUXILIAR]])","v":6},531595,"OTROS "]
[{"$f":"LEN(PUC[[#This Row],[AUXILIAR]])","v":6},531599,"AJUSTES POR INFLACION "]
[{"$f":"LEN(PUC[[#This Row],[AUXILIAR]])","v":4},5395,"GASTOS DIVERSOS "]
[{"$f":"LEN(PUC[[#This Row],[AUXILIAR]])","v":6},539505,"DEMANDAS LABORALES "]
[{"$f":"LEN(PUC[[#This Row],[AUXILIAR]])","v":6},539510,"DEMANDAS POR INCUMPLIMIENTO DE CONTRATOS "]
[{"$f":"LEN(PUC[[#This Row],[AUXILIAR]])","v":6},539515,"INDEMNIZACIONES "]
[{"$f":"LEN(PUC[[#This Row],[AUXILIAR]])","v":6},539520,"MULTAS, SANCIONES Y LITIGIOS "]
[{"$f":"LEN(PUC[[#This Row],[AUXILIAR]])","v":6},539525,"DONACIONES "]
[{"$f":"LEN(PUC[[#This Row],[AUXILIAR]])","v":6},539530,"CONSTITUCION DE GARANTIAS "]
[{"$f":"LEN(PUC[[#This Row],[AUXILIAR]])","v":6},539535,"AMORTIZACION DE BIENES ENTREGADOS EN COMODATO "]
[{"$f":"LEN(PUC[[#This Row],[AUXILIAR]])","v":6},539595,"OTROS "]
[{"$f":"LEN(PUC[[#This Row],[AUXILIAR]])","v":6},539599,"AJUSTES POR INFLACION "]
[{"$f":"LEN(PUC[[#This Row],[AUXILIAR]])","v":2},54,"IMPUESTO DE RENTA Y COMPLEMENTARIOS "]
[{"$f":"LEN(PUC[[#This Row],[AUXILIAR]])","v":4},5405,"IMPUESTO DE RENTA Y COMPLEMENTARIOS "]
[{"$f":"LEN(PUC[[#This Row],[AUXILIAR]])","v":6},540505,"IMPUESTO DE RENTA Y COMPLEMENTARIOS "]
[{"$f":"LEN(PUC[[#This Row],[AUXILIAR]])","v":2},59,"GANANCIAS Y PERDIDAS "]
[{"$f":"LEN(PUC[[#This Row],[AUXILIAR]])","v":4},5905,"GANANCIAS Y PERDIDAS "]
[{"$f":"LEN(PUC[[#This Row],[AUXILIAR]])","v":6},590505,"GANANCIAS Y PERDIDAS "]
[{"$f":"LEN(PUC[[#This Row],[AUXILIAR]])","v":1},6,"COSTOS DE VENTAS "]
[{"$f":"LEN(PUC[[#This Row],[AUXILIAR]])","v":2},61,"COSTO DE VENTAS Y DE PRESTACION DE SERVICIOS "]
[{"$f":"LEN(PUC[[#This Row],[AUXILIAR]])","v":4},6105,"AGRICULTURA, GANADERIA, CAZA Y SILVICULTURA "]
[{"$f":"LEN(PUC[[#This Row],[AUXILIAR]])","v":6},610505,"CULTIVO DE CEREALES "]
[{"$f":"LEN(PUC[[#This Row],[AUXILIAR]])","v":6},610510,"CULTIVOS DE HORTALIZAS, LEGUMBRES Y PLANTAS ORNAMENTALES "]
[{"$f":"LEN(PUC[[#This Row],[AUXILIAR]])","v":6},610515,"CULTIVOS DE FRUTAS, NUECES Y PLANTAS AROMATICAS "]
[{"$f":"LEN(PUC[[#This Row],[AUXILIAR]])","v":6},610520,"CULTIVO DE CAFE "]
[{"$f":"LEN(PUC[[#This Row],[AUXILIAR]])","v":6},610525,"CULTIVO DE FLORES "]
[{"$f":"LEN(PUC[[#This Row],[AUXILIAR]])","v":6},610530,"CULTIVO DE CAÑA DE AZUCAR "]
[{"$f":"LEN(PUC[[#This Row],[AUXILIAR]])","v":6},610535,"CULTIVO DE ALGODON Y PLANTAS PARA MATERIAL TEXTIL "]
[{"$f":"LEN(PUC[[#This Row],[AUXILIAR]])","v":6},610540,"CULTIVO DE BANANO "]
[{"$f":"LEN(PUC[[#This Row],[AUXILIAR]])","v":6},610545,"OTROS CULTIVOS AGRICOLAS "]
[{"$f":"LEN(PUC[[#This Row],[AUXILIAR]])","v":6},610550,"CRIA DE OVEJAS, CABRAS, ASNOS, MULAS Y BURDEGANOS "]
[{"$f":"LEN(PUC[[#This Row],[AUXILIAR]])","v":6},610555,"CRIA DE GANADO CABALLAR Y VACUNO. "]
[{"$f":"LEN(PUC[[#This Row],[AUXILIAR]])","v":6},610560,"PRODUCCION AVICOLA "]
[{"$f":"LEN(PUC[[#This Row],[AUXILIAR]])","v":6},610565,"CRIA DE OTROS ANIMALES "]
[{"$f":"LEN(PUC[[#This Row],[AUXILIAR]])","v":6},610570,"SERVICIOS AGRICOLAS Y GANADEROS "]
[{"$f":"LEN(PUC[[#This Row],[AUXILIAR]])","v":6},610575,"ACTIVIDAD DE CAZA "]
[{"$f":"LEN(PUC[[#This Row],[AUXILIAR]])","v":6},610580,"ACTIVIDAD DE SILVICULTURA "]
[{"$f":"LEN(PUC[[#This Row],[AUXILIAR]])","v":6},610599,"AJUSTES POR INFLACION "]
[{"$f":"LEN(PUC[[#This Row],[AUXILIAR]])","v":4},6110,"PESCA "]
[{"$f":"LEN(PUC[[#This Row],[AUXILIAR]])","v":6},611005,"ACTIVIDAD DE PESCA "]
[{"$f":"LEN(PUC[[#This Row],[AUXILIAR]])","v":6},611010,"EXPLOTACION DE CRIADEROS DE PECES "]
[{"$f":"LEN(PUC[[#This Row],[AUXILIAR]])","v":6},611095,"ACTIVIDADES CONEXAS "]
[{"$f":"LEN(PUC[[#This Row],[AUXILIAR]])","v":6},611099,"AJUSTES POR INFLACION "]
[{"$f":"LEN(PUC[[#This Row],[AUXILIAR]])","v":4},6115,"EXPLOTACION DE MINAS Y CANTERAS "]
[{"$f":"LEN(PUC[[#This Row],[AUXILIAR]])","v":6},611505,"CARBON "]
[{"$f":"LEN(PUC[[#This Row],[AUXILIAR]])","v":6},611510,"PETROLEO CRUDO "]
[{"$f":"LEN(PUC[[#This Row],[AUXILIAR]])","v":6},611512,"GAS NATURAL "]
[{"$f":"LEN(PUC[[#This Row],[AUXILIAR]])","v":6},611514,"SERVICIOS RELACIONADOS CON EXTRACCION DE PETROLEO Y GAS "]
[{"$f":"LEN(PUC[[#This Row],[AUXILIAR]])","v":6},611515,"MINERALES DE HIERRO "]
[{"$f":"LEN(PUC[[#This Row],[AUXILIAR]])","v":6},611520,"MINERALES METALIFEROS NO FERROSOS "]
[{"$f":"LEN(PUC[[#This Row],[AUXILIAR]])","v":6},611525,"PIEDRA, ARENA Y ARCILLA "]
[{"$f":"LEN(PUC[[#This Row],[AUXILIAR]])","v":6},611527,"PIEDRAS PRECIOSAS "]
[{"$f":"LEN(PUC[[#This Row],[AUXILIAR]])","v":6},611528,"ORO "]
[{"$f":"LEN(PUC[[#This Row],[AUXILIAR]])","v":6},611530,"OTRAS MINAS Y CANTERAS "]
[{"$f":"LEN(PUC[[#This Row],[AUXILIAR]])","v":6},611532,"PRESTACION DE SERVICIOS SECTOR MINERO "]
[{"$f":"LEN(PUC[[#This Row],[AUXILIAR]])","v":6},611595,"ACTIVIDADES CONEXAS "]
[{"$f":"LEN(PUC[[#This Row],[AUXILIAR]])","v":6},611599,"AJUSTES POR INFLACION "]
[{"$f":"LEN(PUC[[#This Row],[AUXILIAR]])","v":4},6120,"INDUSTRIAS MANUFACTURERAS "]
[{"$f":"LEN(PUC[[#This Row],[AUXILIAR]])","v":6},612001,"PRODUCCION Y PROCESAMIENTO DE CARNES Y PRODUCTOS CARNICOS "]
[{"$f":"LEN(PUC[[#This Row],[AUXILIAR]])","v":6},612002,"PRODUCTOS DE PESCADO "]
[{"$f":"LEN(PUC[[#This Row],[AUXILIAR]])","v":6},612003,"PRODUCTOS DE FRUTAS, LEGUMBRES Y HORTALIZAS "]
[{"$f":"LEN(PUC[[#This Row],[AUXILIAR]])","v":6},612004,"ELABORACION DE ACEITES Y GRASAS "]
[{"$f":"LEN(PUC[[#This Row],[AUXILIAR]])","v":6},612005,"ELABORACION DE PRODUCTOS LACTEOS "]
[{"$f":"LEN(PUC[[#This Row],[AUXILIAR]])","v":6},612006,"ELABORACION DE PRODUCTOS DE MOLINERIA "]
[{"$f":"LEN(PUC[[#This Row],[AUXILIAR]])","v":6},612007,"ELABORACION DE ALMIDONES Y DERIVADOS "]
[{"$f":"LEN(PUC[[#This Row],[AUXILIAR]])","v":6},612008,"ELABORACION DE ALIMENTOS PARA ANIMALES "]
[{"$f":"LEN(PUC[[#This Row],[AUXILIAR]])","v":6},612009,"ELABORACION DE PRODUCTOS PARA PANADERIA "]
[{"$f":"LEN(PUC[[#This Row],[AUXILIAR]])","v":6},612010,"ELABORACION DE AZUCAR Y MELAZAS "]
[{"$f":"LEN(PUC[[#This Row],[AUXILIAR]])","v":6},612011,"ELABORACION DE CACAO, CHOCOLATE Y CONFITERIA "]
[{"$f":"LEN(PUC[[#This Row],[AUXILIAR]])","v":6},612012,"ELABORACION DE PASTAS Y PRODUCTOS FARINACEOS "]
[{"$f":"LEN(PUC[[#This Row],[AUXILIAR]])","v":6},612013,"ELABORACION DE PRODUCTOS DE CAFE "]
[{"$f":"LEN(PUC[[#This Row],[AUXILIAR]])","v":6},612014,"ELABORACION DE OTROS PRODUCTOS ALIMENTICIOS "]
[{"$f":"LEN(PUC[[#This Row],[AUXILIAR]])","v":6},612015,"ELABORACION DE BEBIDAS ALCOHOLICAS Y ALCOHOL ETILICO "]
[{"$f":"LEN(PUC[[#This Row],[AUXILIAR]])","v":6},612016,"ELABORACION DE VINOS "]
[{"$f":"LEN(PUC[[#This Row],[AUXILIAR]])","v":6},612017,"ELABORACION DE BEBIDAS MALTEADAS Y DE MALTA "]
[{"$f":"LEN(PUC[[#This Row],[AUXILIAR]])","v":6},612018,"ELABORACION DE BEBIDAS NO ALCOHOLICAS "]
[{"$f":"LEN(PUC[[#This Row],[AUXILIAR]])","v":6},612019,"ELABORACION DE PRODUCTOS DE TABACO "]
[{"$f":"LEN(PUC[[#This Row],[AUXILIAR]])","v":6},612020,"PREPARACION E HILATURA DE FIBRAS TEXTILES Y TEJEDURIA "]
[{"$f":"LEN(PUC[[#This Row],[AUXILIAR]])","v":6},612021,"ACABADO DE PRODUCTOS TEXTILES "]
[{"$f":"LEN(PUC[[#This Row],[AUXILIAR]])","v":6},612022,"ELABORACION DE ARTICULOS DE MATERIALES TEXTILES "]
[{"$f":"LEN(PUC[[#This Row],[AUXILIAR]])","v":6},612023,"ELABORACION DE TAPICES Y ALFOMBRAS "]
[{"$f":"LEN(PUC[[#This Row],[AUXILIAR]])","v":6},612024,"ELABORACION DE CUERDAS, CORDELES, BRAMANTES Y REDES "]
[{"$f":"LEN(PUC[[#This Row],[AUXILIAR]])","v":6},612025,"ELABORACION DE OTROS PRODUCTOS TEXTILES "]
[{"$f":"LEN(PUC[[#This Row],[AUXILIAR]])","v":6},612026,"ELABORACION DE TEJIDOS "]
[{"$f":"LEN(PUC[[#This Row],[AUXILIAR]])","v":6},612027,"ELABORACION DE PRENDAS DE VESTIR "]
[{"$f":"LEN(PUC[[#This Row],[AUXILIAR]])","v":6},612028,"PREPARACION, ADOBO Y TEÑIDO DE PIELES "]
[{"$f":"LEN(PUC[[#This Row],[AUXILIAR]])","v":6},612029,"CURTIDO, ADOBO O PREPARACION DE CUERO "]
[{"$f":"LEN(PUC[[#This Row],[AUXILIAR]])","v":6},612030,"ELABORACION DE MALETAS, BOLSOS Y SIMILARES "]
[{"$f":"LEN(PUC[[#This Row],[AUXILIAR]])","v":6},612031,"ELABORACION DE CALZADO "]
[{"$f":"LEN(PUC[[#This Row],[AUXILIAR]])","v":6},612032,"PRODUCCION DE MADERA, ARTICULOS DE MADERA Y CORCHO "]
[{"$f":"LEN(PUC[[#This Row],[AUXILIAR]])","v":6},612033,"ELABORACION DE PASTA Y PRODUCTOS DE MADERA, PAPEL Y CARTON "]
[{"$f":"LEN(PUC[[#This Row],[AUXILIAR]])","v":6},612034,"EDICIONES Y PUBLICACIONES "]
[{"$f":"LEN(PUC[[#This Row],[AUXILIAR]])","v":6},612035,"IMPRESION "]
[{"$f":"LEN(PUC[[#This Row],[AUXILIAR]])","v":6},612036,"SERVICIOS RELACIONADOS CON LA EDICION Y LA IMPRESION "]
[{"$f":"LEN(PUC[[#This Row],[AUXILIAR]])","v":6},612037,"REPRODUCCION DE GRABACIONES "]
[{"$f":"LEN(PUC[[#This Row],[AUXILIAR]])","v":6},612038,"ELABORACION DE PRODUCTOS DE HORNO DE COQUE "]
[{"$f":"LEN(PUC[[#This Row],[AUXILIAR]])","v":6},612039,"ELABORACION DE PRODUCTOS DE LA REFINACION DE PETROLEO "]
[{"$f":"LEN(PUC[[#This Row],[AUXILIAR]])","v":6},612040,"ELABORACION DE SUSTANCIAS QUIMICAS BASICAS "]
[{"$f":"LEN(PUC[[#This Row],[AUXILIAR]])","v":6},612041,"ELABORACION DE ABONOS Y COMPUESTOS DE NITROGENO "]
[{"$f":"LEN(PUC[[#This Row],[AUXILIAR]])","v":6},612042,"ELABORACION DE PLASTICO Y CAUCHO SINTETICO "]
[{"$f":"LEN(PUC[[#This Row],[AUXILIAR]])","v":6},612043,"ELABORACION DE PRODUCTOS QUIMICOS DE USO AGROPECUARIO "]
[{"$f":"LEN(PUC[[#This Row],[AUXILIAR]])","v":6},612044,"ELABORACION DE PINTURAS, TINTAS Y MASILLAS "]
[{"$f":"LEN(PUC[[#This Row],[AUXILIAR]])","v":6},612045,"ELABORACION DE PRODUCTOS FARMACEUTICOS Y BOTANICOS "]
[{"$f":"LEN(PUC[[#This Row],[AUXILIAR]])","v":6},612046,"ELABORACION DE JABONES, DETERGENTES Y PREPARADOS DE TOCADOR "]
[{"$f":"LEN(PUC[[#This Row],[AUXILIAR]])","v":6},612047,"ELABORACION DE OTROS PRODUCTOS QUIMICOS "]
[{"$f":"LEN(PUC[[#This Row],[AUXILIAR]])","v":6},612048,"ELABORACION DE FIBRAS "]
[{"$f":"LEN(PUC[[#This Row],[AUXILIAR]])","v":6},612049,"ELABORACION DE OTROS PRODUCTOS DE CAUCHO "]
[{"$f":"LEN(PUC[[#This Row],[AUXILIAR]])","v":6},612050,"ELABORACION DE PRODUCTOS DE PLASTICO "]
[{"$f":"LEN(PUC[[#This Row],[AUXILIAR]])","v":6},612051,"ELABORACION DE VIDRIO Y PRODUCTOS DE VIDRIO "]
[{"$f":"LEN(PUC[[#This Row],[AUXILIAR]])","v":6},612052,"ELABORACION DE PRODUCTOS DE CERAMICA, LOZA, PIEDRA, ARCILLA Y PORCELANA "]
[{"$f":"LEN(PUC[[#This Row],[AUXILIAR]])","v":6},612053,"ELABORACION DE CEMENTO, CAL Y YESO "]
[{"$f":"LEN(PUC[[#This Row],[AUXILIAR]])","v":6},612054,"ELABORACION DE ARTICULOS DE HORMIGON, CEMENTO Y YESO "]
[{"$f":"LEN(PUC[[#This Row],[AUXILIAR]])","v":6},612055,"CORTE, TALLADO Y ACABADO DE LA PIEDRA "]
[{"$f":"LEN(PUC[[#This Row],[AUXILIAR]])","v":6},612056,"ELABORACION DE OTROS PRODUCTOS MINERALES NO METALICOS "]
[{"$f":"LEN(PUC[[#This Row],[AUXILIAR]])","v":6},612057,"INDUSTRIAS BASICAS Y FUNDICION DE HIERRO Y ACERO "]
[{"$f":"LEN(PUC[[#This Row],[AUXILIAR]])","v":6},612058,"PRODUCTOS PRIMARIOS DE METALES PRECIOSOS Y DE METALES NO FERROSOS "]
[{"$f":"LEN(PUC[[#This Row],[AUXILIAR]])","v":6},612059,"FUNDICION DE METALES NO FERROSOS "]
[{"$f":"LEN(PUC[[#This Row],[AUXILIAR]])","v":6},612060,"FABRICACION DE PRODUCTOS METALICOS PARA USO ESTRUCTURAL "]
[{"$f":"LEN(PUC[[#This Row],[AUXILIAR]])","v":6},612061,"FORJA, PRENSADO, ESTAMPADO, LAMINADO DE METAL Y "]
[{"$f":"LEN(PUC[[#This Row],[AUXILIAR]])","v":6},612062,"REVESTIMIENTO DE METALES Y OBRAS DE INGENIERIA MECANICA "]
[{"$f":"LEN(PUC[[#This Row],[AUXILIAR]])","v":6},612063,"FABRICACION DE ARTICULOS DE FERRETERIA "]
[{"$f":"LEN(PUC[[#This Row],[AUXILIAR]])","v":6},612064,"ELABORACION DE OTROS PRODUCTOS DE METAL "]
[{"$f":"LEN(PUC[[#This Row],[AUXILIAR]])","v":6},612065,"FABRICACION DE MAQUINARIA Y EQUIPO "]
[{"$f":"LEN(PUC[[#This Row],[AUXILIAR]])","v":6},612066,"FABRICACION DE EQUIPOS DE ELEVACION Y MANIPULACION "]
[{"$f":"LEN(PUC[[#This Row],[AUXILIAR]])","v":6},612067,"ELABORACION DE APARATOS DE USO DOMESTICO "]
[{"$f":"LEN(PUC[[#This Row],[AUXILIAR]])","v":6},612068,"ELABORACION DE EQUIPO DE OFICINA "]
[{"$f":"LEN(PUC[[#This Row],[AUXILIAR]])","v":6},612069,"ELABORACION DE PILAS Y BATERIAS PRIMARIAS "]
[{"$f":"LEN(PUC[[#This Row],[AUXILIAR]])","v":6},612070,"ELABORACION DE EQUIPO DE ILUMINACION "]
[{"$f":"LEN(PUC[[#This Row],[AUXILIAR]])","v":6},612071,"ELABORACION DE OTROS TIPOS DE EQUIPO ELECTRICO "]
[{"$f":"LEN(PUC[[#This Row],[AUXILIAR]])","v":6},612072,"FABRICACION DE EQUIPOS DE RADIO, TELEVISION Y COMUNICACIONES "]
[{"$f":"LEN(PUC[[#This Row],[AUXILIAR]])","v":6},612073,"FABRICACION DE APARATOS E INSTRUMENTOS MEDICOS "]
[{"$f":"LEN(PUC[[#This Row],[AUXILIAR]])","v":6},612074,"FABRICACION DE INSTRUMENTOS DE MEDICION Y CONTROL "]
[{"$f":"LEN(PUC[[#This Row],[AUXILIAR]])","v":6},612075,"FABRICACION DE INSTRUMENTOS DE OPTICA Y EQUIPO FOTOGRAFICO "]
[{"$f":"LEN(PUC[[#This Row],[AUXILIAR]])","v":6},612076,"FABRICACION DE RELOJES "]
[{"$f":"LEN(PUC[[#This Row],[AUXILIAR]])","v":6},612077,"FABRICACION DE VEHICULOS AUTOMOTORES "]
[{"$f":"LEN(PUC[[#This Row],[AUXILIAR]])","v":6},612078,"FABRICACION DE CARROCERIAS PARA AUTOMOTORES "]
[{"$f":"LEN(PUC[[#This Row],[AUXILIAR]])","v":6},612079,"FABRICACION DE PARTES PIEZAS Y ACCESORIOS PARA AUTOMOTORES "]
[{"$f":"LEN(PUC[[#This Row],[AUXILIAR]])","v":6},612080,"FABRICACION Y REPARACION DE BUQUES Y OTRAS EMBARCACIONES "]
[{"$f":"LEN(PUC[[#This Row],[AUXILIAR]])","v":6},612081,"FABRICACION DE LOCOMOTORAS Y MATERIAL RODANTE PARA FERROCARRILES "]
[{"$f":"LEN(PUC[[#This Row],[AUXILIAR]])","v":6},612082,"FABRICACION DE AERONAVES "]
[{"$f":"LEN(PUC[[#This Row],[AUXILIAR]])","v":6},612083,"FABRICACION DE MOTOCICLETAS "]
[{"$f":"LEN(PUC[[#This Row],[AUXILIAR]])","v":6},612084,"FABRICACION DE BICICLETAS Y SILLAS DE RUEDAS "]
[{"$f":"LEN(PUC[[#This Row],[AUXILIAR]])","v":6},612085,"FABRICACION DE OTROS TIPOS DE TRANSPORTE "]
[{"$f":"LEN(PUC[[#This Row],[AUXILIAR]])","v":6},612086,"FABRICACION DE MUEBLES "]
[{"$f":"LEN(PUC[[#This Row],[AUXILIAR]])","v":6},612087,"FABRICACION DE JOYAS Y ARTICULOS CONEXOS "]
[{"$f":"LEN(PUC[[#This Row],[AUXILIAR]])","v":6},612088,"FABRICACION DE INSTRUMENTOS DE MUSICA "]
[{"$f":"LEN(PUC[[#This Row],[AUXILIAR]])","v":6},612089,"FABRICACION DE ARTICULOS Y EQUIPO PARA DEPORTE "]
[{"$f":"LEN(PUC[[#This Row],[AUXILIAR]])","v":6},612090,"FABRICACION DE JUEGOS Y JUGUETES "]
[{"$f":"LEN(PUC[[#This Row],[AUXILIAR]])","v":6},612091,"RECICLAMIENTO DE DESPERDICIOS "]
[{"$f":"LEN(PUC[[#This Row],[AUXILIAR]])","v":6},612095,"PRODUCTOS DE OTRAS INDUSTRIAS MANUFACTURERAS "]
[{"$f":"LEN(PUC[[#This Row],[AUXILIAR]])","v":6},612099,"AJUSTES POR INFLACION "]
[{"$f":"LEN(PUC[[#This Row],[AUXILIAR]])","v":4},6125,"SUMINISTRO DE ELECTRICIDAD, GAS Y AGUA "]
[{"$f":"LEN(PUC[[#This Row],[AUXILIAR]])","v":6},612505,"GENERACION, CAPTACION Y DISTRIBUCION DE ENERGIA ELECTRICA "]
[{"$f":"LEN(PUC[[#This Row],[AUXILIAR]])","v":6},612510,"FABRICACION DE GAS Y DISTRIBUCION DE COMBUSTIBLES GASEOSOS "]
[{"$f":"LEN(PUC[[#This Row],[AUXILIAR]])","v":6},612515,"CAPTACION, DEPURACION Y DISTRIBUCION DE AGUA "]
[{"$f":"LEN(PUC[[#This Row],[AUXILIAR]])","v":6},612595,"ACTIVIDADES CONEXAS "]
[{"$f":"LEN(PUC[[#This Row],[AUXILIAR]])","v":6},612599,"AJUSTES POR INFLACION "]
[{"$f":"LEN(PUC[[#This Row],[AUXILIAR]])","v":4},6130,"CONSTRUCCION "]
[{"$f":"LEN(PUC[[#This Row],[AUXILIAR]])","v":6},613005,"PREPARACION DE TERRENOS "]
[{"$f":"LEN(PUC[[#This Row],[AUXILIAR]])","v":6},613010,"CONSTRUCCION DE EDIFICIOS Y OBRAS DE INGENIERIA CIVIL "]
[{"$f":"LEN(PUC[[#This Row],[AUXILIAR]])","v":6},613015,"ACONDICIONAMIENTO DE EDIFICIOS "]
[{"$f":"LEN(PUC[[#This Row],[AUXILIAR]])","v":6},613020,"TERMINACION DE EDIFICACIONES "]
[{"$f":"LEN(PUC[[#This Row],[AUXILIAR]])","v":6},613025,"ALQUILER DE EQUIPO CON OPERARIO "]
[{"$f":"LEN(PUC[[#This Row],[AUXILIAR]])","v":6},613095,"ACTIVIDADES CONEXAS "]
[{"$f":"LEN(PUC[[#This Row],[AUXILIAR]])","v":6},613099,"AJUSTES POR INFLACION "]
[{"$f":"LEN(PUC[[#This Row],[AUXILIAR]])","v":4},6135,"COMERCIO AL POR MAYOR Y AL POR MENOR "]
[{"$f":"LEN(PUC[[#This Row],[AUXILIAR]])","v":6},613502,"VENTA DE VEHICULOS AUTOMOTORES "]
[{"$f":"LEN(PUC[[#This Row],[AUXILIAR]])","v":6},613504,"MANTENIMIENTO, REPARACION Y LAVADO DE VEHICULOS AUTOMOTORES "]
[{"$f":"LEN(PUC[[#This Row],[AUXILIAR]])","v":6},613506,"VENTA DE PARTES, PIEZAS Y ACCESORIOS DE VEHICULOS AUTOMOTORES "]
[{"$f":"LEN(PUC[[#This Row],[AUXILIAR]])","v":6},613508,"VENTA DE COMBUSTIBLES SOLIDOS, LIQUIDOS, GASEOSOS "]
[{"$f":"LEN(PUC[[#This Row],[AUXILIAR]])","v":6},613510,"VENTA DE LUBRICANTES, ADITIVOS, LLANTAS Y LUJOS PARA AUTOMOTORES "]
[{"$f":"LEN(PUC[[#This Row],[AUXILIAR]])","v":6},613512,"VENTA A CAMBIO DE RETRIBUCION O POR CONTRATA "]
[{"$f":"LEN(PUC[[#This Row],[AUXILIAR]])","v":6},613514,"VENTA DE INSUMOS, MATERIAS PRIMAS AGROPECUARIAS Y FLORES "]
[{"$f":"LEN(PUC[[#This Row],[AUXILIAR]])","v":6},613516,"VENTA DE OTROS INSUMOS Y MATERIAS PRIMAS NO AGROPECUARIAS "]
[{"$f":"LEN(PUC[[#This Row],[AUXILIAR]])","v":6},613518,"VENTA DE ANIMALES VIVOS Y CUEROS "]
[{"$f":"LEN(PUC[[#This Row],[AUXILIAR]])","v":6},613520,"VENTA DE PRODUCTOS EN ALMACENES NO ESPECIALIZADOS "]
[{"$f":"LEN(PUC[[#This Row],[AUXILIAR]])","v":6},613522,"VENTA DE PRODUCTOS AGROPECUARIOS "]
[{"$f":"LEN(PUC[[#This Row],[AUXILIAR]])","v":6},613524,"VENTA DE PRODUCTOS TEXTILES, DE VESTIR, DE CUERO Y CALZADO "]
[{"$f":"LEN(PUC[[#This Row],[AUXILIAR]])","v":6},613526,"VENTA DE PAPEL Y CARTON "]
[{"$f":"LEN(PUC[[#This Row],[AUXILIAR]])","v":6},613528,"VENTA DE LIBROS, REVISTAS, ELEMENTOS DE PAPELERIA, UTILES Y TEXTOS ESCOLARES "]
[{"$f":"LEN(PUC[[#This Row],[AUXILIAR]])","v":6},613530,"VENTA DE JUEGOS, JUGUETES Y ARTICULOS DEPORTIVOS "]
[{"$f":"LEN(PUC[[#This Row],[AUXILIAR]])","v":6},613532,"VENTA DE INSTRUMENTOS QUIRURGICOS Y ORTOPEDICOS "]
[{"$f":"LEN(PUC[[#This Row],[AUXILIAR]])","v":6},613534,"VENTA DE ARTICULOS EN RELOJERIAS Y JOYERIAS "]
[{"$f":"LEN(PUC[[#This Row],[AUXILIAR]])","v":6},613536,"VENTA DE ELECTRODOMESTICOS Y MUEBLES "]
[{"$f":"LEN(PUC[[#This Row],[AUXILIAR]])","v":6},613538,"VENTA DE PRODUCTOS DE ASEO, FARMACEUTICOS, MEDICINALES, Y ARTICULOS DE TOCADOR "]
[{"$f":"LEN(PUC[[#This Row],[AUXILIAR]])","v":6},613540,"VENTA DE CUBIERTOS, VAJILLAS, CRISTALERIA, PORCELANAS, CERAMICAS Y OTROS ARTICULOS DE USO DOMESTICO "]
[{"$f":"LEN(PUC[[#This Row],[AUXILIAR]])","v":6},613542,"VENTA DE MATERIALES DE CONSTRUCCION, FONTANERIA Y CALEFACCION "]
[{"$f":"LEN(PUC[[#This Row],[AUXILIAR]])","v":6},613544,"VENTA DE PINTURAS Y LACAS "]
[{"$f":"LEN(PUC[[#This Row],[AUXILIAR]])","v":6},613546,"VENTA DE PRODUCTOS DE VIDRIOS Y MARQUETERIA "]
[{"$f":"LEN(PUC[[#This Row],[AUXILIAR]])","v":6},613548,"VENTA DE HERRAMIENTAS Y ARTICULOS DE FERRETERIA "]
[{"$f":"LEN(PUC[[#This Row],[AUXILIAR]])","v":6},613550,"VENTA DE QUIMICOS "]
[{"$f":"LEN(PUC[[#This Row],[AUXILIAR]])","v":6},613552,"VENTA DE PRODUCTOS INTERMEDIOS, DESPERDICIOS Y DESECHOS "]
[{"$f":"LEN(PUC[[#This Row],[AUXILIAR]])","v":6},613554,"VENTA DE MAQUINARIA, EQUIPO DE OFICINA Y PROGRAMAS DE COMPUTADOR "]
[{"$f":"LEN(PUC[[#This Row],[AUXILIAR]])","v":6},613556,"VENTA DE ARTICULOS EN CACHARRERIAS Y MISCELANEAS "]
[{"$f":"LEN(PUC[[#This Row],[AUXILIAR]])","v":6},613558,"VENTA DE INSTRUMENTOS MUSICALES "]
[{"$f":"LEN(PUC[[#This Row],[AUXILIAR]])","v":6},613560,"VENTA DE ARTICULOS EN CASAS DE EMPEÑO Y PRENDERIAS "]
[{"$f":"LEN(PUC[[#This Row],[AUXILIAR]])","v":6},613562,"VENTA DE EQUIPO FOTOGRAFICO "]
[{"$f":"LEN(PUC[[#This Row],[AUXILIAR]])","v":6},613564,"VENTA DE EQUIPO OPTICO Y DE PRECISION "]
[{"$f":"LEN(PUC[[#This Row],[AUXILIAR]])","v":6},613566,"VENTA DE EMPAQUES "]
[{"$f":"LEN(PUC[[#This Row],[AUXILIAR]])","v":6},613568,"VENTA DE EQUIPO PROFESIONAL Y CIENTIFICO "]
[{"$f":"LEN(PUC[[#This Row],[AUXILIAR]])","v":6},613570,"VENTA DE LOTERIAS, RIFAS, CHANCE, APUESTAS Y SIMILARES "]
[{"$f":"LEN(PUC[[#This Row],[AUXILIAR]])","v":6},613572,"REPARACION DE EFECTOS PERSONALES Y ELECTRODOMESTICOS "]
[{"$f":"LEN(PUC[[#This Row],[AUXILIAR]])","v":6},613595,"VENTA DE OTROS PRODUCTOS "]
[{"$f":"LEN(PUC[[#This Row],[AUXILIAR]])","v":6},613599,"AJUSTES POR INFLACION "]
[{"$f":"LEN(PUC[[#This Row],[AUXILIAR]])","v":4},6140,"HOTELES Y RESTAURANTES "]
[{"$f":"LEN(PUC[[#This Row],[AUXILIAR]])","v":6},614005,"HOTELERIA "]
[{"$f":"LEN(PUC[[#This Row],[AUXILIAR]])","v":6},614010,"CAMPAMENTO Y OTROS TIPOS DE HOSPEDAJE "]
[{"$f":"LEN(PUC[[#This Row],[AUXILIAR]])","v":6},614015,"RESTAURANTES "]
[{"$f":"LEN(PUC[[#This Row],[AUXILIAR]])","v":6},614020,"BARES Y CANTINAS "]
[{"$f":"LEN(PUC[[#This Row],[AUXILIAR]])","v":6},614095,"ACTIVIDADES CONEXAS "]
[{"$f":"LEN(PUC[[#This Row],[AUXILIAR]])","v":6},614099,"AJUSTES POR INFLACION "]
[{"$f":"LEN(PUC[[#This Row],[AUXILIAR]])","v":4},6145,"TRANSPORTE, ALMACENAMIENTO Y COMUNICACIONES "]
[{"$f":"LEN(PUC[[#This Row],[AUXILIAR]])","v":6},614505,"SERVICIO DE TRANSPORTE POR CARRETERA "]
[{"$f":"LEN(PUC[[#This Row],[AUXILIAR]])","v":6},614510,"SERVICIO DE TRANSPORTE POR VIA FERREA "]
[{"$f":"LEN(PUC[[#This Row],[AUXILIAR]])","v":6},614515,"SERVICIO DE TRANSPORTE POR VIA ACUATICA "]
[{"$f":"LEN(PUC[[#This Row],[AUXILIAR]])","v":6},614520,"SERVICIO DE TRANSPORTE POR VIA AEREA "]
[{"$f":"LEN(PUC[[#This Row],[AUXILIAR]])","v":6},614525,"SERVICIO DE TRANSPORTE POR TUBERIAS "]
[{"$f":"LEN(PUC[[#This Row],[AUXILIAR]])","v":6},614530,"MANIPULACION DE CARGA "]
[{"$f":"LEN(PUC[[#This Row],[AUXILIAR]])","v":6},614535,"ALMACENAMIENTO Y DEPOSITO "]
[{"$f":"LEN(PUC[[#This Row],[AUXILIAR]])","v":6},614540,"SERVICIOS COMPLEMENTARIOS PARA EL TRANSPORTE "]
[{"$f":"LEN(PUC[[#This Row],[AUXILIAR]])","v":6},614545,"AGENCIAS DE VIAJE "]
[{"$f":"LEN(PUC[[#This Row],[AUXILIAR]])","v":6},614550,"OTRAS AGENCIAS DE TRANSPORTE "]
[{"$f":"LEN(PUC[[#This Row],[AUXILIAR]])","v":6},614555,"SERVICIO POSTAL Y DE CORREO "]
[{"$f":"LEN(PUC[[#This Row],[AUXILIAR]])","v":6},614560,"SERVICIO TELEFONICO "]
[{"$f":"LEN(PUC[[#This Row],[AUXILIAR]])","v":6},614565,"SERVICIO DE TELEGRAFO "]
[{"$f":"LEN(PUC[[#This Row],[AUXILIAR]])","v":6},614570,"SERVICIO DE TRANSMISION DE DATOS "]
[{"$f":"LEN(PUC[[#This Row],[AUXILIAR]])","v":6},614575,"SERVICIO DE RADIO Y TELEVISION POR CABLE "]
[{"$f":"LEN(PUC[[#This Row],[AUXILIAR]])","v":6},614580,"TRANSMISION DE SONIDO E IMAGENES POR CONTRATO "]
[{"$f":"LEN(PUC[[#This Row],[AUXILIAR]])","v":6},614595,"ACTIVIDADES CONEXAS "]
[{"$f":"LEN(PUC[[#This Row],[AUXILIAR]])","v":6},614599,"AJUSTES POR INFLACION "]
[{"$f":"LEN(PUC[[#This Row],[AUXILIAR]])","v":4},6150,"ACTIVIDAD FINANCIERA "]
[{"$f":"LEN(PUC[[#This Row],[AUXILIAR]])","v":6},615005,"DE INVERSIONES "]
[{"$f":"LEN(PUC[[#This Row],[AUXILIAR]])","v":6},615010,"DE SERVICIO DE BOLSA "]
[{"$f":"LEN(PUC[[#This Row],[AUXILIAR]])","v":6},615099,"AJUSTES POR INFLACION "]
[{"$f":"LEN(PUC[[#This Row],[AUXILIAR]])","v":4},6155,"ACTIVIDADES INMOBILIARIAS, EMPRESARIALES Y DE ALQUILER "]
[{"$f":"LEN(PUC[[#This Row],[AUXILIAR]])","v":6},615505,"ARRENDAMIENTOS DE BIENES INMUEBLES "]
[{"$f":"LEN(PUC[[#This Row],[AUXILIAR]])","v":6},615510,"INMOBILIARIAS POR RETRIBUCION O CONTRATA "]
[{"$f":"LEN(PUC[[#This Row],[AUXILIAR]])","v":6},615515,"ALQUILER EQUIPO DE TRANSPORTE "]
[{"$f":"LEN(PUC[[#This Row],[AUXILIAR]])","v":6},615520,"ALQUILER MAQUINARIA Y EQUIPO "]
[{"$f":"LEN(PUC[[#This Row],[AUXILIAR]])","v":6},615525,"ALQUILER DE EFECTOS PERSONALES Y ENSERES DOMESTICOS "]
[{"$f":"LEN(PUC[[#This Row],[AUXILIAR]])","v":6},615530,"CONSULTORIA EN EQUIPO Y PROGRAMAS DE INFORMATICA "]
[{"$f":"LEN(PUC[[#This Row],[AUXILIAR]])","v":6},615535,"PROCESAMIENTO DE DATOS "]
[{"$f":"LEN(PUC[[#This Row],[AUXILIAR]])","v":6},615540,"MANTENIMIENTO Y REPARACION DE MAQUINARIA DE OFICINA "]
[{"$f":"LEN(PUC[[#This Row],[AUXILIAR]])","v":6},615545,"INVESTIGACIONES CIENTIFICAS Y DE DESARROLLO "]
[{"$f":"LEN(PUC[[#This Row],[AUXILIAR]])","v":6},615550,"ACTIVIDADES EMPRESARIALES DE CONSULTORIA "]
[{"$f":"LEN(PUC[[#This Row],[AUXILIAR]])","v":6},615555,"PUBLICIDAD "]
[{"$f":"LEN(PUC[[#This Row],[AUXILIAR]])","v":6},615560,"DOTACION DE PERSONAL "]
[{"$f":"LEN(PUC[[#This Row],[AUXILIAR]])","v":6},615565,"INVESTIGACION Y SEGURIDAD "]
[{"$f":"LEN(PUC[[#This Row],[AUXILIAR]])","v":6},615570,"LIMPIEZA DE INMUEBLES "]
[{"$f":"LEN(PUC[[#This Row],[AUXILIAR]])","v":6},615575,"FOTOGRAFIA "]
[{"$f":"LEN(PUC[[#This Row],[AUXILIAR]])","v":6},615580,"ENVASE Y EMPAQUE "]
[{"$f":"LEN(PUC[[#This Row],[AUXILIAR]])","v":6},615585,"FOTOCOPIADO "]
[{"$f":"LEN(PUC[[#This Row],[AUXILIAR]])","v":6},615590,"MANTENIMIENTO Y REPARACION DE MAQUINARIA Y EQUIPO "]
[{"$f":"LEN(PUC[[#This Row],[AUXILIAR]])","v":6},615595,"ACTIVIDADES CONEXAS "]
[{"$f":"LEN(PUC[[#This Row],[AUXILIAR]])","v":6},615599,"AJUSTES POR INFLACION "]
[{"$f":"LEN(PUC[[#This Row],[AUXILIAR]])","v":4},6160,"ENSEÑANZA "]
[{"$f":"LEN(PUC[[#This Row],[AUXILIAR]])","v":6},616005,"ACTIVIDADES RELACIONADAS CON LA EDUCACION "]
[{"$f":"LEN(PUC[[#This Row],[AUXILIAR]])","v":6},610595,"ACTIVIDADES CONEXAS "]
[{"$f":"LEN(PUC[[#This Row],[AUXILIAR]])","v":6},616099,"AJUSTES POR INFLACION "]
[{"$f":"LEN(PUC[[#This Row],[AUXILIAR]])","v":4},6165,"SERVICIOS SOCIALES Y DE SALUD "]
[{"$f":"LEN(PUC[[#This Row],[AUXILIAR]])","v":6},616505,"SERVICIO HOSPITALARIO "]
[{"$f":"LEN(PUC[[#This Row],[AUXILIAR]])","v":6},616510,"SERVICIO MEDICO "]
[{"$f":"LEN(PUC[[#This Row],[AUXILIAR]])","v":6},616515,"SERVICIO ODONTOLOGICO "]
[{"$f":"LEN(PUC[[#This Row],[AUXILIAR]])","v":6},616520,"SERVICIO DE LABORATORIO "]
[{"$f":"LEN(PUC[[#This Row],[AUXILIAR]])","v":6},616525,"ACTIVIDADES VETERINARIAS "]
[{"$f":"LEN(PUC[[#This Row],[AUXILIAR]])","v":6},616530,"ACTIVIDADES DE SERVICIOS SOCIALES "]
[{"$f":"LEN(PUC[[#This Row],[AUXILIAR]])","v":6},616595,"ACTIVIDADES CONEXAS "]
[{"$f":"LEN(PUC[[#This Row],[AUXILIAR]])","v":6},616599,"AJUSTES POR INFLACION "]
[{"$f":"LEN(PUC[[#This Row],[AUXILIAR]])","v":4},6170,"OTRAS ACTIVIDADES DE SERVICIOS COMUNITARIOS, SOCIALES Y PERSONALES "]
[{"$f":"LEN(PUC[[#This Row],[AUXILIAR]])","v":6},617005,"ELIMINACION DE DESPERDICIOS Y AGUAS RESIDUALES "]
[{"$f":"LEN(PUC[[#This Row],[AUXILIAR]])","v":6},617010,"ACTIVIDADES DE ASOCIACION "]
[{"$f":"LEN(PUC[[#This Row],[AUXILIAR]])","v":6},617015,"PRODUCCION Y DISTRIBUCION DE FILMES Y VIDEOCINTAS "]
[{"$f":"LEN(PUC[[#This Row],[AUXILIAR]])","v":6},617020,"EXHIBICION DE FILMES Y VIDEOCINTAS "]
[{"$f":"LEN(PUC[[#This Row],[AUXILIAR]])","v":6},617025,"ACTIVIDAD DE RADIO Y TELEVISION "]
[{"$f":"LEN(PUC[[#This Row],[AUXILIAR]])","v":6},617030,"ACTIVIDAD TEATRAL, MUSICAL Y ARTISTICA "]
[{"$f":"LEN(PUC[[#This Row],[AUXILIAR]])","v":6},617035,"GRABACION Y PRODUCCION DE DISCOS "]
[{"$f":"LEN(PUC[[#This Row],[AUXILIAR]])","v":6},617040,"ENTRETENIMIENTO Y ESPARCIMIENTO "]
[{"$f":"LEN(PUC[[#This Row],[AUXILIAR]])","v":6},617045,"AGENCIAS DE NOTICIAS "]
[{"$f":"LEN(PUC[[#This Row],[AUXILIAR]])","v":6},617050,"LAVANDERIAS Y SIMILARES "]
[{"$f":"LEN(PUC[[#This Row],[AUXILIAR]])","v":6},617055,"PELUQUERIAS Y SIMILARES "]
[{"$f":"LEN(PUC[[#This Row],[AUXILIAR]])","v":6},617060,"SERVICIOS FUNERARIOS "]
[{"$f":"LEN(PUC[[#This Row],[AUXILIAR]])","v":6},617065,"ZONAS FRANCAS "]
[{"$f":"LEN(PUC[[#This Row],[AUXILIAR]])","v":6},617095,"ACTIVIDADES CONEXAS "]
[{"$f":"LEN(PUC[[#This Row],[AUXILIAR]])","v":6},617099,"AJUSTES POR INFLACION "]
[{"$f":"LEN(PUC[[#This Row],[AUXILIAR]])","v":2},62,"COMPRAS "]
[{"$f":"LEN(PUC[[#This Row],[AUXILIAR]])","v":4},6205,"DE MERCANCIAS "]
[{"$f":"LEN(PUC[[#This Row],[AUXILIAR]])","v":6},620599,"AJUSTES POR INFLACION "]
[{"$f":"LEN(PUC[[#This Row],[AUXILIAR]])","v":4},6210,"DE MATERIAS PRIMAS "]
[{"$f":"LEN(PUC[[#This Row],[AUXILIAR]])","v":6},621099,"AJUSTES POR INFLACION "]
[{"$f":"LEN(PUC[[#This Row],[AUXILIAR]])","v":4},6215,"DE MATERIALES INDIRECTOS "]
[{"$f":"LEN(PUC[[#This Row],[AUXILIAR]])","v":6},621599,"AJUSTES POR INFLACION "]
[{"$f":"LEN(PUC[[#This Row],[AUXILIAR]])","v":4},6220,"COMPRA DE ENERGIA "]
[{"$f":"LEN(PUC[[#This Row],[AUXILIAR]])","v":6},622099,"AJUSTES POR INFLACION "]
[{"$f":"LEN(PUC[[#This Row],[AUXILIAR]])","v":4},6225,"DEVOLUCIONES REBAJAS Y DESCUENTOS EN COMPRAS (CR) "]
[{"$f":"LEN(PUC[[#This Row],[AUXILIAR]])","v":6},622599,"AJUSTES POR INFLACION "]
[{"$f":"LEN(PUC[[#This Row],[AUXILIAR]])","v":1},7,"COSTOS DE PRODUCCION O DE OPERACION "]
[{"$f":"LEN(PUC[[#This Row],[AUXILIAR]])","v":2},71,"MATERIA PRIMA "]
[{"$f":"LEN(PUC[[#This Row],[AUXILIAR]])","v":2},72,"MANO DE OBRA DIRECTA "]
[{"$f":"LEN(PUC[[#This Row],[AUXILIAR]])","v":2},73,"COSTOS INDIRECTOS "]
[{"$f":"LEN(PUC[[#This Row],[AUXILIAR]])","v":2},74,"CONTRATOS DE SERVICIOS "]
[{"$f":"LEN(PUC[[#This Row],[AUXILIAR]])","v":1},8,"CUENTAS DE ORDEN DEUDORAS "]
[{"$f":"LEN(PUC[[#This Row],[AUXILIAR]])","v":2},81,"DERECHOS CONTINGENTES "]
[{"$f":"LEN(PUC[[#This Row],[AUXILIAR]])","v":4},8105,"BIENES Y VALORES ENTREGADOS EN CUSTODIA "]
[{"$f":"LEN(PUC[[#This Row],[AUXILIAR]])","v":6},810505,"VALORES MOBILIARIOS "]
[{"$f":"LEN(PUC[[#This Row],[AUXILIAR]])","v":6},810510,"BIENES MUEBLES "]
[{"$f":"LEN(PUC[[#This Row],[AUXILIAR]])","v":6},810599,"AJUSTES POR INFLACION "]
[{"$f":"LEN(PUC[[#This Row],[AUXILIAR]])","v":4},8110,"BIENES Y VALORES ENTREGADOS EN GARANTIA "]
[{"$f":"LEN(PUC[[#This Row],[AUXILIAR]])","v":6},811005,"VALORES MOBILIARIOS "]
[{"$f":"LEN(PUC[[#This Row],[AUXILIAR]])","v":6},811010,"BIENES MUEBLES "]
[{"$f":"LEN(PUC[[#This Row],[AUXILIAR]])","v":6},811015,"BIENES INMUEBLES "]
[{"$f":"LEN(PUC[[#This Row],[AUXILIAR]])","v":6},811020,"CONTRATOS DE GANADO EN PARTICIPACION "]
[{"$f":"LEN(PUC[[#This Row],[AUXILIAR]])","v":6},811099,"AJUSTES POR INFLACION "]
[{"$f":"LEN(PUC[[#This Row],[AUXILIAR]])","v":4},8115,"BIENES Y VALORES EN PODER DE TERCEROS "]
[{"$f":"LEN(PUC[[#This Row],[AUXILIAR]])","v":6},811505,"EN ARRENDAMIENTO "]
[{"$f":"LEN(PUC[[#This Row],[AUXILIAR]])","v":6},811510,"EN PRESTAMO "]
[{"$f":"LEN(PUC[[#This Row],[AUXILIAR]])","v":6},811515,"EN DEPOSITO "]
[{"$f":"LEN(PUC[[#This Row],[AUXILIAR]])","v":6},811520,"EN CONSIGNACION "]
[{"$f":"LEN(PUC[[#This Row],[AUXILIAR]])","v":6},811599,"AJUSTES POR INFLACION "]
[{"$f":"LEN(PUC[[#This Row],[AUXILIAR]])","v":4},8120,"LITIGIOS Y/O DEMANDAS "]
[{"$f":"LEN(PUC[[#This Row],[AUXILIAR]])","v":6},812005,"EJECUTIVOS "]
[{"$f":"LEN(PUC[[#This Row],[AUXILIAR]])","v":6},812010,"INCUMPLIMIENTO DE CONTRATOS "]
[{"$f":"LEN(PUC[[#This Row],[AUXILIAR]])","v":4},8125,"PROMESAS DE COMPRAVENTA "]
[{"$f":"LEN(PUC[[#This Row],[AUXILIAR]])","v":4},8195,"DIVERSAS "]
[{"$f":"LEN(PUC[[#This Row],[AUXILIAR]])","v":6},819505,"VALORES ADQUIRIDOS POR RECIBIR "]
[{"$f":"LEN(PUC[[#This Row],[AUXILIAR]])","v":6},819595,"OTRAS "]
[{"$f":"LEN(PUC[[#This Row],[AUXILIAR]])","v":6},819599,"AJUSTES POR INFLACION. "]
[{"$f":"LEN(PUC[[#This Row],[AUXILIAR]])","v":2},82,"DEUDORAS FISCALES "]
[{"$f":"LEN(PUC[[#This Row],[AUXILIAR]])","v":2},83,"DEUDORAS DE CONTROL "]
[{"$f":"LEN(PUC[[#This Row],[AUXILIAR]])","v":4},8305,"BIENES RECIBIDOS EN ARRENDAMIENTO FINANCIERO "]
[{"$f":"LEN(PUC[[#This Row],[AUXILIAR]])","v":6},830505,"BIENES MUEBLES "]
[{"$f":"LEN(PUC[[#This Row],[AUXILIAR]])","v":6},830510,"BIENES INMUEBLES "]
[{"$f":"LEN(PUC[[#This Row],[AUXILIAR]])","v":6},830599,"AJUSTES POR INFLACION "]
[{"$f":"LEN(PUC[[#This Row],[AUXILIAR]])","v":4},8310,"TITULOS DE INVERSION NO COLOCADOS "]
[{"$f":"LEN(PUC[[#This Row],[AUXILIAR]])","v":6},831005,"ACCIONES "]
[{"$f":"LEN(PUC[[#This Row],[AUXILIAR]])","v":6},831010,"BONOS "]
[{"$f":"LEN(PUC[[#This Row],[AUXILIAR]])","v":6},831095,"OTROS "]
[{"$f":"LEN(PUC[[#This Row],[AUXILIAR]])","v":4},8315,"PROPIEDADES PLANTA Y EQUIPO TOTALMENTE DEPRECIADOS, AGOTADOS Y/O AMORTIZADOS "]
[{"$f":"LEN(PUC[[#This Row],[AUXILIAR]])","v":6},831506,"MATERIALES PROYECTOS PETROLEROS "]
[{"$f":"LEN(PUC[[#This Row],[AUXILIAR]])","v":6},831516,"CONSTRUCCIONES Y EDIFICACIONES "]
[{"$f":"LEN(PUC[[#This Row],[AUXILIAR]])","v":6},831520,"MAQUINARIA Y EQUIPO "]
[{"$f":"LEN(PUC[[#This Row],[AUXILIAR]])","v":6},831524,"EQUIPO DE OFICINA "]
[{"$f":"LEN(PUC[[#This Row],[AUXILIAR]])","v":6},831528,"EQUIPO DE COMPUTACION Y COMUNICACION "]
[{"$f":"LEN(PUC[[#This Row],[AUXILIAR]])","v":6},831532,"EQUIPO MEDICO - CIENTIFICO "]
[{"$f":"LEN(PUC[[#This Row],[AUXILIAR]])","v":6},831536,"EQUIPO DE HOTELES Y RESTAURANTES "]
[{"$f":"LEN(PUC[[#This Row],[AUXILIAR]])","v":6},831540,"FLOTA Y EQUIPO DE TRANSPORTE "]
[{"$f":"LEN(PUC[[#This Row],[AUXILIAR]])","v":6},831544,"FLOTA Y EQUIPO FLUVIAL Y/O MARITIMO "]
[{"$f":"LEN(PUC[[#This Row],[AUXILIAR]])","v":6},831548,"FLOTA Y EQUIPO AEREO "]
[{"$f":"LEN(PUC[[#This Row],[AUXILIAR]])","v":6},831552,"FLOTA Y EQUIPO FERREO "]
[{"$f":"LEN(PUC[[#This Row],[AUXILIAR]])","v":6},831556,"ACUEDUCTOS, PLANTAS Y REDES "]
[{"$f":"LEN(PUC[[#This Row],[AUXILIAR]])","v":6},831560,"ARMAMENTO DE VIGILANCIA "]
[{"$f":"LEN(PUC[[#This Row],[AUXILIAR]])","v":6},831562,"ENVASES Y EMPAQUES "]
[{"$f":"LEN(PUC[[#This Row],[AUXILIAR]])","v":6},831564,"PLANTACIONES AGRICOLAS Y FORESTALES "]
[{"$f":"LEN(PUC[[#This Row],[AUXILIAR]])","v":6},831568,"VIAS DE COMUNICACION "]
[{"$f":"LEN(PUC[[#This Row],[AUXILIAR]])","v":6},831572,"MINAS Y CANTERAS "]
[{"$f":"LEN(PUC[[#This Row],[AUXILIAR]])","v":6},831576,"POZOS ARTESIANOS "]
[{"$f":"LEN(PUC[[#This Row],[AUXILIAR]])","v":6},831580,"YACIMIENTOS "]
[{"$f":"LEN(PUC[[#This Row],[AUXILIAR]])","v":6},831584,"SEMOVIENTES "]
[{"$f":"LEN(PUC[[#This Row],[AUXILIAR]])","v":6},831599,"AJUSTES POR INFLACION "]
[{"$f":"LEN(PUC[[#This Row],[AUXILIAR]])","v":4},8320,"CREDITOS A FAVOR NO UTILIZADOS "]
[{"$f":"LEN(PUC[[#This Row],[AUXILIAR]])","v":6},832005,"PAIS "]
[{"$f":"LEN(PUC[[#This Row],[AUXILIAR]])","v":6},832010,"EXTERIOR "]
[{"$f":"LEN(PUC[[#This Row],[AUXILIAR]])","v":4},8325,"ACTIVOS CASTIGADOS "]
[{"$f":"LEN(PUC[[#This Row],[AUXILIAR]])","v":6},832505,"INVERSIONES "]
[{"$f":"LEN(PUC[[#This Row],[AUXILIAR]])","v":6},832510,"DEUDORES "]
[{"$f":"LEN(PUC[[#This Row],[AUXILIAR]])","v":6},832595,"OTROS ACTIVOS "]
[{"$f":"LEN(PUC[[#This Row],[AUXILIAR]])","v":4},8330,"TITULOS DE INVERSION AMORTIZADOS "]
[{"$f":"LEN(PUC[[#This Row],[AUXILIAR]])","v":6},833005,"BONOS "]
[{"$f":"LEN(PUC[[#This Row],[AUXILIAR]])","v":6},833095,"OTROS "]
[{"$f":"LEN(PUC[[#This Row],[AUXILIAR]])","v":4},8335,"CAPITALIZACION POR REVALORIZACION DE PATRIMONIO "]
[{"$f":"LEN(PUC[[#This Row],[AUXILIAR]])","v":4},8395,"OTRAS CUENTAS DEUDORAS DE CONTROL "]
[{"$f":"LEN(PUC[[#This Row],[AUXILIAR]])","v":6},839505,"CHEQUES POSTFECHADOS "]
[{"$f":"LEN(PUC[[#This Row],[AUXILIAR]])","v":6},839510,"CERTIFICADOS DE DEPOSITO A TERMINO "]
[{"$f":"LEN(PUC[[#This Row],[AUXILIAR]])","v":6},839515,"CHEQUES DEVUELTOS "]
[{"$f":"LEN(PUC[[#This Row],[AUXILIAR]])","v":6},839520,"BIENES Y VALORES EN FIDEICOMISO "]
[{"$f":"LEN(PUC[[#This Row],[AUXILIAR]])","v":6},839525,"INTERESES SOBRE DEUDAS VENCIDAS "]
[{"$f":"LEN(PUC[[#This Row],[AUXILIAR]])","v":6},839595,"DIVERSAS "]
[{"$f":"LEN(PUC[[#This Row],[AUXILIAR]])","v":6},839599,"AJUSTES POR INFLACION "]
[{"$f":"LEN(PUC[[#This Row],[AUXILIAR]])","v":4},8399,"AJUSTES POR INFLACION ACTIVOS "]
[{"$f":"LEN(PUC[[#This Row],[AUXILIAR]])","v":6},839905,"INVERSIONES "]
[{"$f":"LEN(PUC[[#This Row],[AUXILIAR]])","v":6},839910,"INVENTARIOS "]
[{"$f":"LEN(PUC[[#This Row],[AUXILIAR]])","v":6},839915,"PROPIEDADES PLANTA Y EQUIPO "]
[{"$f":"LEN(PUC[[#This Row],[AUXILIAR]])","v":6},839920,"INTANGIBLES "]
[{"$f":"LEN(PUC[[#This Row],[AUXILIAR]])","v":6},839925,"CARGOS DIFERIDOS "]
[{"$f":"LEN(PUC[[#This Row],[AUXILIAR]])","v":6},839995,"OTROS ACTIVOS "]
[{"$f":"LEN(PUC[[#This Row],[AUXILIAR]])","v":2},84,"DERECHOS CONTINGENTES POR CONTRA (CR) "]
[{"$f":"LEN(PUC[[#This Row],[AUXILIAR]])","v":2},85,"DEUDORAS FISCALES POR CONTRA (CR) "]
[{"$f":"LEN(PUC[[#This Row],[AUXILIAR]])","v":2},86,"DEUDORAS DE CONTROL POR CONTRA (CR) "]
[{"$f":"LEN(PUC[[#This Row],[AUXILIAR]])","v":1},9,"CUENTAS DE ORDEN ACREEDORAS "]
[{"$f":"LEN(PUC[[#This Row],[AUXILIAR]])","v":2},91,"RESPONSABILIDADES CONTINGENTES "]
[{"$f":"LEN(PUC[[#This Row],[AUXILIAR]])","v":4},9105,"BIENES Y VALORES RECIBIDOS EN CUSTODIA "]
[{"$f":"LEN(PUC[[#This Row],[AUXILIAR]])","v":6},910505,"VALORES MOBILIARIOS "]
[{"$f":"LEN(PUC[[#This Row],[AUXILIAR]])","v":6},910510,"BIENES MUEBLES "]
[{"$f":"LEN(PUC[[#This Row],[AUXILIAR]])","v":6},910599,"AJUSTES POR INFLACION "]
[{"$f":"LEN(PUC[[#This Row],[AUXILIAR]])","v":4},9110,"BIENES Y VALORES RECIBIDOS EN GARANTIA "]
[{"$f":"LEN(PUC[[#This Row],[AUXILIAR]])","v":6},911005,"VALORES MOBILIARIOS "]
[{"$f":"LEN(PUC[[#This Row],[AUXILIAR]])","v":6},911010,"BIENES MUEBLES "]
[{"$f":"LEN(PUC[[#This Row],[AUXILIAR]])","v":6},911015,"BIENES INMUEBLES "]
[{"$f":"LEN(PUC[[#This Row],[AUXILIAR]])","v":6},911020,"CONTRATOS DE GANADO EN PARTICIPACION "]
[{"$f":"LEN(PUC[[#This Row],[AUXILIAR]])","v":6},911099,"AJUSTES POR INFLACION "]
[{"$f":"LEN(PUC[[#This Row],[AUXILIAR]])","v":4},9115,"BIENES Y VALORES RECIBIDOS DE TERCEROS "]
[{"$f":"LEN(PUC[[#This Row],[AUXILIAR]])","v":6},911505,"EN ARRENDAMIENTO "]
[{"$f":"LEN(PUC[[#This Row],[AUXILIAR]])","v":6},911510,"EN PRESTAMO "]
[{"$f":"LEN(PUC[[#This Row],[AUXILIAR]])","v":6},911515,"EN DEPOSITO "]
[{"$f":"LEN(PUC[[#This Row],[AUXILIAR]])","v":6},911520,"EN CONSIGNACION "]
[{"$f":"LEN(PUC[[#This Row],[AUXILIAR]])","v":6},911525,"EN COMODATO "]
[{"$f":"LEN(PUC[[#This Row],[AUXILIAR]])","v":6},911599,"AJUSTES POR INFLACION "]
[{"$f":"LEN(PUC[[#This Row],[AUXILIAR]])","v":4},9120,"LITIGIOS Y/O DEMANDAS "]
[{"$f":"LEN(PUC[[#This Row],[AUXILIAR]])","v":6},912005,"LABORALES "]
[{"$f":"LEN(PUC[[#This Row],[AUXILIAR]])","v":6},912010,"CIVILES "]
[{"$f":"LEN(PUC[[#This Row],[AUXILIAR]])","v":6},912015,"ADMINISTRATIVOS O ARBITRALES "]
[{"$f":"LEN(PUC[[#This Row],[AUXILIAR]])","v":6},912020,"TRIBUTARIOS "]
[{"$f":"LEN(PUC[[#This Row],[AUXILIAR]])","v":4},9125,"PROMESAS DE COMPRAVENTA "]
[{"$f":"LEN(PUC[[#This Row],[AUXILIAR]])","v":4},9130,"CONTRATOS DE ADMINISTRACION DELEGADA "]
[{"$f":"LEN(PUC[[#This Row],[AUXILIAR]])","v":4},9135,"CUENTAS EN PARTICIPACION "]
[{"$f":"LEN(PUC[[#This Row],[AUXILIAR]])","v":4},9195,"OTRAS RESPONSABILIDADES CONTINGENTES "]
[{"$f":"LEN(PUC[[#This Row],[AUXILIAR]])","v":2},92,"ACREEDORAS FISCALES "]
[{"$f":"LEN(PUC[[#This Row],[AUXILIAR]])","v":2},93,"ACREEDORAS DE CONTROL "]
[{"$f":"LEN(PUC[[#This Row],[AUXILIAR]])","v":4},9305,"CONTRATOS DE ARRENDAMIENTO FINANCIERO "]
[{"$f":"LEN(PUC[[#This Row],[AUXILIAR]])","v":6},930505,"BIENES MUEBLES "]
[{"$f":"LEN(PUC[[#This Row],[AUXILIAR]])","v":6},930510,"BIENES INMUEBLES "]
[{"$f":"LEN(PUC[[#This Row],[AUXILIAR]])","v":1},5,"OTRAS CUENTAS DE ORDEN ACREEDORAS DE CONTROL "]
[{"$f":"LEN(PUC[[#This Row],[AUXILIAR]])","v":6},939505,"DOCUMENTOS POR COBRAR DESCONTADOS "]
[{"$f":"LEN(PUC[[#This Row],[AUXILIAR]])","v":6},939510,"CONVENIOS DE PAGO "]
[{"$f":"LEN(PUC[[#This Row],[AUXILIAR]])","v":6},939515,"CONTRATOS DE CONSTRUCCIONES E INSTALACIONES POR EJECUTAR "]
[{"$f":"LEN(PUC[[#This Row],[AUXILIAR]])","v":6},939520,"PEDIDOS COLOCADOS "]
[{"$f":"LEN(PUC[[#This Row],[AUXILIAR]])","v":6},939525,"ADJUDICACIONES PENDIENTES DE LEGALIZAR "]
[{"$f":"LEN(PUC[[#This Row],[AUXILIAR]])","v":6},939530,"RESERVA ARTICULO 3o. LEY 4/80 "]
[{"$f":"LEN(PUC[[#This Row],[AUXILIAR]])","v":6},939535,"RESERVA COSTO REPOSICION SEMOVIENTES "]
[{"$f":"LEN(PUC[[#This Row],[AUXILIAR]])","v":6},939599,"AJUSTES POR INFLACION "]
[{"$f":"LEN(PUC[[#This Row],[AUXILIAR]])","v":4},9399,"AJUSTES POR INFLACION PATRIMONIO "]
[{"$f":"LEN(PUC[[#This Row],[AUXILIAR]])","v":6},939905,"CAPITAL SOCIAL "]
[{"$f":"LEN(PUC[[#This Row],[AUXILIAR]])","v":6},939910,"SUPERAVIT DE CAPITAL "]
[{"$f":"LEN(PUC[[#This Row],[AUXILIAR]])","v":6},939915,"RESERVAS "]
[{"$f":"LEN(PUC[[#This Row],[AUXILIAR]])","v":6},939925,"DIVIDENDOS O PARTICIPACIONES DECRETADAS EN ACCIONES, CUOTAS O PARTES DE INTERES SOCIAL "]
[{"$f":"LEN(PUC[[#This Row],[AUXILIAR]])","v":6},939930,"RESULTADOS DE EJERCICIOS ANTERIORES "]
[{"$f":"LEN(PUC[[#This Row],[AUXILIAR]])","v":2},94,"RESPONSABILIDADES CONTINGENTES POR CONTRA (DB) "]
[{"$f":"LEN(PUC[[#This Row],[AUXILIAR]])","v":2},95,"ACREEDORAS FISCALES POR CONTRA (DB) "]
[{"$f":"LEN(PUC[[#This Row],[AUXILIAR]])","v":2},96,"ACREEDORAS DE CONTROL POR CONTRA (DB) "]
[{"$f":"LEN(PUC[[#This Row],[AUXILIAR]])","v":6},259533,"VALORES RECIBIDOS POR PRIVATIZACIONES"]
[{"$f":"LEN(PUC[[#This Row],[AUXILIAR]])","v":6},259535,"INCENTIVO PRODUCCION GANADERA (ICG)"]
[{"$f":"LEN(PUC[[#This Row],[AUXILIAR]])","v":6},259538,"CUENTAS POR PAGAR EXASOCIADOS"]
[{"$f":"LEN(PUC[[#This Row],[AUXILIAR]])","v":6},259570,"RECUADUOS REALIZADOS"]
[{"$f":"LEN(PUC[[#This Row],[AUXILIAR]])","v":6},259580,"NACION LEY 546 DE 1999"]
[{"$f":"LEN(PUC[[#This Row],[AUXILIAR]])","v":6},259595,"OTRAS"]
[{"$f":"LEN(PUC[[#This Row],[AUXILIAR]])","v":6},260000,"TITULOS DE INVERSION  EN CIRCULACIO"]
[{"$f":"LEN(PUC[[#This Row],[AUXILIAR]])","v":6},260500,"BONOS"]
[{"$f":"LEN(PUC[[#This Row],[AUXILIAR]])","v":6},260515,"BONOS DE FOMENTO URBANO"]
[{"$f":"LEN(PUC[[#This Row],[AUXILIAR]])","v":6},260530,"BONOS DE VIVIENDA DE INTERES SOCIAL BCH"]
[{"$f":"LEN(PUC[[#This Row],[AUXILIAR]])","v":6},260535,"BONOS DE VIVIENDA - CAV"]
[{"$f":"LEN(PUC[[#This Row],[AUXILIAR]])","v":6},260540,"DE GARANTIA GRAL MENOR DE 18M."]
[{"$f":"LEN(PUC[[#This Row],[AUXILIAR]])","v":6},260545,"DE GARANTIA GRAL IGUAL O SUPERIOR A 18M"]
[{"$f":"LEN(PUC[[#This Row],[AUXILIAR]])","v":6},260550,"BONOS OPCIONALMENTE CONV EN ACCIONES"]
[{"$f":"LEN(PUC[[#This Row],[AUXILIAR]])","v":6},260580,"OTROS MENOR DE 18M."]
[{"$f":"LEN(PUC[[#This Row],[AUXILIAR]])","v":6},260585,"OTROS IGUAL O SUPERIOR A 18M."]
[{"$f":"LEN(PUC[[#This Row],[AUXILIAR]])","v":6},260590,"BONOS HIPOTECARIOS"]
[{"$f":"LEN(PUC[[#This Row],[AUXILIAR]])","v":6},261000,"CEDULAS"]
[{"$f":"LEN(PUC[[#This Row],[AUXILIAR]])","v":6},261005,"CEDULAS DE CAPITALIZACION"]
[{"$f":"LEN(PUC[[#This Row],[AUXILIAR]])","v":6},261010,"CEDULAS HIPOTECARIAS"]
[{"$f":"LEN(PUC[[#This Row],[AUXILIAR]])","v":6},261015,"CEDULAS DE AHORRO Y VIVIENDA"]
[{"$f":"LEN(PUC[[#This Row],[AUXILIAR]])","v":6},261200,"TITULOS DE DESARROLLO AGROPECUARIO"]
[{"$f":"LEN(PUC[[#This Row],[AUXILIAR]])","v":6},261205,"TITULOS DESARROLLO AGROPECUARIO CLA"]
[{"$f":"LEN(PUC[[#This Row],[AUXILIAR]])","v":6},261210,"TITULOS DESARROLLO AGROPECUARIO CLA"]
[{"$f":"LEN(PUC[[#This Row],[AUXILIAR]])","v":6},261215,"TITULOS DESARROLLO AGROPECUARIO CLA"]
[{"$f":"LEN(PUC[[#This Row],[AUXILIAR]])","v":6},261300,"TITULOS COLOCADOS EN PROCES. DE TITULA"]
[{"$f":"LEN(PUC[[#This Row],[AUXILIAR]])","v":6},261305,"TITULOS POR EMITIR"]
[{"$f":"LEN(PUC[[#This Row],[AUXILIAR]])","v":6},261310,"TITULOS AUTORIZADOS POR EMITIR"]
[{"$f":"LEN(PUC[[#This Row],[AUXILIAR]])","v":6},261500,"OTROS TITULOS DE INVERSION"]
[{"$f":"LEN(PUC[[#This Row],[AUXILIAR]])","v":6},261505,"CERTIFICADOS ELECTRICOS VALORIZABLE"]
[{"$f":"LEN(PUC[[#This Row],[AUXILIAR]])","v":6},261510,"TITULOS ENERGETICOS DE RENTABILIDAD"]
[{"$f":"LEN(PUC[[#This Row],[AUXILIAR]])","v":6},261595,"OTROS"]
[{"$f":"LEN(PUC[[#This Row],[AUXILIAR]])","v":6},270000,"OTROS PASIVOS"]
[{"$f":"LEN(PUC[[#This Row],[AUXILIAR]])","v":6},270400,"SUCURSALES Y AGENCIAS"]
[{"$f":"LEN(PUC[[#This Row],[AUXILIAR]])","v":6},270406,"DEPOS.ACEPTACIONES Y PASIVOS FIDUCI"]
[{"$f":"LEN(PUC[[#This Row],[AUXILIAR]])","v":6},270407,"DEPOS.Y PASIVOS FIDUCIARIOS SECTOR"]
[{"$f":"LEN(PUC[[#This Row],[AUXILIAR]])","v":6},270411,"DEPOSITOS A TERMINO IGUAL O SUP 12 MESES"]
[{"$f":"LEN(PUC[[#This Row],[AUXILIAR]])","v":6},270416,"DEPOSITOS A TERMINO ENTRE 6 Y 12 ME"]
[{"$f":"LEN(PUC[[#This Row],[AUXILIAR]])","v":6},270421,"DEPOS A TERMINO MENOR A 6 MESES"]
[{"$f":"LEN(PUC[[#This Row],[AUXILIAR]])","v":6},270426,"DEPOS.ORDINARIOS Y DE AHORRO Y NEGO"]
[{"$f":"LEN(PUC[[#This Row],[AUXILIAR]])","v":6},270431,"DEPOSITOS JUDICIALES INSTITUC.NACIO"]
[{"$f":"LEN(PUC[[#This Row],[AUXILIAR]])","v":6},270440,"TRASLADO DE INGRESOS"]
[{"$f":"LEN(PUC[[#This Row],[AUXILIAR]])","v":6},270495,"OTROS TRASLADOS"]
[{"$f":"LEN(PUC[[#This Row],[AUXILIAR]])","v":6},271000,"OBLIGACIONES LABORALES CONSOLIDADAS"]
[{"$f":"LEN(PUC[[#This Row],[AUXILIAR]])","v":6},271005,"CESANTIAS CONSOLIDADAS"]
[{"$f":"LEN(PUC[[#This Row],[AUXILIAR]])","v":6},271010,"INTERESES SOBRE CESANTIAS"]
[{"$f":"LEN(PUC[[#This Row],[AUXILIAR]])","v":6},271015,"VACACIONES CONSOLIDADAS"]
[{"$f":"LEN(PUC[[#This Row],[AUXILIAR]])","v":6},271095,"OTRAS PRESTACIONES SOCIALES"]
[{"$f":"LEN(PUC[[#This Row],[AUXILIAR]])","v":6},271500,"INGRESOS ANTICIPADOS"]
[{"$f":"LEN(PUC[[#This Row],[AUXILIAR]])","v":6},271505,"INTERESES"]
[{"$f":"LEN(PUC[[#This Row],[AUXILIAR]])","v":6},271510,"COMISIONES"]
[{"$f":"LEN(PUC[[#This Row],[AUXILIAR]])","v":6},271515,"ARRENDAMIENTOS"]
[{"$f":"LEN(PUC[[#This Row],[AUXILIAR]])","v":6},271520,"SERVICIOS DE ALMACEN"]
[{"$f":"LEN(PUC[[#This Row],[AUXILIAR]])","v":6},271528,"PRIMAS SEGURO DE DEPOSITOS"]
[{"$f":"LEN(PUC[[#This Row],[AUXILIAR]])","v":6},271575,"COMISIONES RECIBIDAS POR PROD DERIVADOS"]
[{"$f":"LEN(PUC[[#This Row],[AUXILIAR]])","v":6},271595,"OTROS"]
[{"$f":"LEN(PUC[[#This Row],[AUXILIAR]])","v":6},272000,"ABONOS DIFERIDOS"]
[{"$f":"LEN(PUC[[#This Row],[AUXILIAR]])","v":6},272005,"PRIMA EN COLOCACION TITULOS DE INVE"]
[{"$f":"LEN(PUC[[#This Row],[AUXILIAR]])","v":6},272010,"PRIMA EN COLOCACION DE BOCEAS"]
[{"$f":"LEN(PUC[[#This Row],[AUXILIAR]])","v":6},272015,"UTILIDADES POR VENTA DE ACTIVOS"]
[{"$f":"LEN(PUC[[#This Row],[AUXILIAR]])","v":6},272035,"INTERESES ORIGIN PROCESOS REESTRUCTUR"]
[{"$f":"LEN(PUC[[#This Row],[AUXILIAR]])","v":6},272060,"CARTERA DE CREDITOS EXPRESADA EN UVR"]
[{"$f":"LEN(PUC[[#This Row],[AUXILIAR]])","v":6},272080,"CREDITO MERCANTIL"]
[{"$f":"LEN(PUC[[#This Row],[AUXILIAR]])","v":6},272085,"UTILID. POR AJUSTE EN VALORAC, DE TITUL"]
[{"$f":"LEN(PUC[[#This Row],[AUXILIAR]])","v":6},272091,"DEFECTO CTO INV SOBRE VLOR EN LIBROS"]
[{"$f":"LEN(PUC[[#This Row],[AUXILIAR]])","v":6},272095,"OTROS"]
[{"$f":"LEN(PUC[[#This Row],[AUXILIAR]])","v":6},273000,"CERTIFICADOS DE CAMBIO EN ADMINISTR"]
[{"$f":"LEN(PUC[[#This Row],[AUXILIAR]])","v":6},273500,"DEPOSITOS EN TRAMITE PAGOS EXTERIOR"]
[{"$f":"LEN(PUC[[#This Row],[AUXILIAR]])","v":6},274000,"PENSIONES DE JUBILACION"]
[{"$f":"LEN(PUC[[#This Row],[AUXILIAR]])","v":6},274005,"CALCULO ACTUARIAL PENSIONES DE JUBIL.(CR"]
[{"$f":"LEN(PUC[[#This Row],[AUXILIAR]])","v":6},274010,"PENSIONES DE JUBILACION POR AMORTIZ.(DB)"]
[{"$f":"LEN(PUC[[#This Row],[AUXILIAR]])","v":6},274500,"CARTAS DE CREDITO PAGO DIFERIDO"]
[{"$f":"LEN(PUC[[#This Row],[AUXILIAR]])","v":6},274700,"CRED.POR CORRECCION MONETARIA DIFER"]
[{"$f":"LEN(PUC[[#This Row],[AUXILIAR]])","v":6},274718,"PROPIEDADES Y EQUIPO"]
[{"$f":"LEN(PUC[[#This Row],[AUXILIAR]])","v":6},274719,"OTROS ACTIVOS"]
[{"$f":"LEN(PUC[[#This Row],[AUXILIAR]])","v":6},275000,"ANTICIPOS INCREMENTO DE CAPITAL"]
[{"$f":"LEN(PUC[[#This Row],[AUXILIAR]])","v":6},275100,"APORTES PENDIENTES X RECAUDAR"]
[{"$f":"LEN(PUC[[#This Row],[AUXILIAR]])","v":6},275500,"IMPUESTO DE RENTA DIFERIDO"]
[{"$f":"LEN(PUC[[#This Row],[AUXILIAR]])","v":6},276000,"PROGRAMA EXTEN AGROP SUST DE IMPTO"]
[{"$f":"LEN(PUC[[#This Row],[AUXILIAR]])","v":6},276500,"EXIGIBILIDAD DISPONIB.10% ART.6 LEY"]
[{"$f":"LEN(PUC[[#This Row],[AUXILIAR]])","v":6},276505,"ACCIONES FORZOSAS"]
[{"$f":"LEN(PUC[[#This Row],[AUXILIAR]])","v":6},276510,"DIVIDENDOS DE ACCIONES FORZOSAS"]
[{"$f":"LEN(PUC[[#This Row],[AUXILIAR]])","v":6},277000,"CUENTAS CANCELADAS"]
[{"$f":"LEN(PUC[[#This Row],[AUXILIAR]])","v":6},277005,"CUENTA CORRIENTE BANCARIA"]
[{"$f":"LEN(PUC[[#This Row],[AUXILIAR]])","v":6},277020,"CUENTAS DE AHORRO"]
[{"$f":"LEN(PUC[[#This Row],[AUXILIAR]])","v":6},277025,"CUENTAS DE AHORRO DE VALOR REAL"]
[{"$f":"LEN(PUC[[#This Row],[AUXILIAR]])","v":6},277500,"FONDOS COOPERATIVOS ESPECIFICOS"]
[{"$f":"LEN(PUC[[#This Row],[AUXILIAR]])","v":6},277505,"DE EDUCACION"]
[{"$f":"LEN(PUC[[#This Row],[AUXILIAR]])","v":6},277510,"DE SOLIDARIDAD"]
[{"$f":"LEN(PUC[[#This Row],[AUXILIAR]])","v":6},277515,"PARA RECREACION"]
[{"$f":"LEN(PUC[[#This Row],[AUXILIAR]])","v":6},277520,"MEJORAS DE VIVIENDA"]
[{"$f":"LEN(PUC[[#This Row],[AUXILIAR]])","v":6},277525,"PREVENCION Y SEGURIDAD SOCIAL"]
[{"$f":"LEN(PUC[[#This Row],[AUXILIAR]])","v":6},277595,"OTROS"]
[{"$f":"LEN(PUC[[#This Row],[AUXILIAR]])","v":6},278000,"RESERVAS TECNICAS SEGURO DE DEPOSITOS"]
[{"$f":"LEN(PUC[[#This Row],[AUXILIAR]])","v":6},278005,"SEGURO DEPOS INSTITUCIONES FINANCIERAS"]
[{"$f":"LEN(PUC[[#This Row],[AUXILIAR]])","v":6},278010,"SEGURO DEPOS ENTID COOPERATIVAS"]
[{"$f":"LEN(PUC[[#This Row],[AUXILIAR]])","v":6},278015,"GTIAS OTORGADAS FDOS DE CESANTIAS"]
[{"$f":"LEN(PUC[[#This Row],[AUXILIAR]])","v":6},278020,"TEC GTIAS OTORGADAS FDOS PENSIONES"]
[{"$f":"LEN(PUC[[#This Row],[AUXILIAR]])","v":6},278025,"PENSIONES ADMIN DE RIESGOS PROFESIONALES"]
[{"$f":"LEN(PUC[[#This Row],[AUXILIAR]])","v":6},278030,"ADMINISTRACION DE RIESGO DE GARANTIAS"]
[{"$f":"LEN(PUC[[#This Row],[AUXILIAR]])","v":6},279500,"DIVERSOS"]
[{"$f":"LEN(PUC[[#This Row],[AUXILIAR]])","v":6},279505,"ABONOS PARA APLICAR A OBLIGACI. AL "]
[{"$f":"LEN(PUC[[#This Row],[AUXILIAR]])","v":6},279510,"SOBRANTES EN CAJA"]
[{"$f":"LEN(PUC[[#This Row],[AUXILIAR]])","v":6},279515,"SOBRANTES EN CANJE"]
[{"$f":"LEN(PUC[[#This Row],[AUXILIAR]])","v":6},279520,"SOBRANTES SEGURO DE DEPOSITOS"]
[{"$f":"LEN(PUC[[#This Row],[AUXILIAR]])","v":6},279525,"SOBRANTES COSTO DE GARANTIA"]
[{"$f":"LEN(PUC[[#This Row],[AUXILIAR]])","v":6},279530,"CONTRIBUCIONES"]
[{"$f":"LEN(PUC[[#This Row],[AUXILIAR]])","v":6},279545,"CONSORCIOS O UNIONES TEMPORALES"]
[{"$f":"LEN(PUC[[#This Row],[AUXILIAR]])","v":6},279585,"DIVERSOS - UTILIDAD AJUSTE EN VALO. TITU"]
[{"$f":"LEN(PUC[[#This Row],[AUXILIAR]])","v":6},279595,"OTROS"]
[{"$f":"LEN(PUC[[#This Row],[AUXILIAR]])","v":6},279700,"CUENTAS PASIVAS DE REPORTE-SECC.ESP"]
[{"$f":"LEN(PUC[[#This Row],[AUXILIAR]])","v":6},279705,"SECCION DE SEGUROS"]
[{"$f":"LEN(PUC[[#This Row],[AUXILIAR]])","v":6},279710,"AREAS COMERCIALES"]
[{"$f":"LEN(PUC[[#This Row],[AUXILIAR]])","v":6},279715,"CAJA DE COMPENSACION FAMILIAR"]
[{"$f":"LEN(PUC[[#This Row],[AUXILIAR]])","v":6},279800,"CUENTAS PASIVAS DE REPORTE SECC. ES"]
[{"$f":"LEN(PUC[[#This Row],[AUXILIAR]])","v":6},279805,"SECCION VALOR CONSTANTE"]
[{"$f":"LEN(PUC[[#This Row],[AUXILIAR]])","v":6},279810,"SECCION TRADICIONAL"]
[{"$f":"LEN(PUC[[#This Row],[AUXILIAR]])","v":6},280000,"PASIVOS ESTIMADOS Y PROVISIONES"]
[{"$f":"LEN(PUC[[#This Row],[AUXILIAR]])","v":6},280500,"INTERESES"]
[{"$f":"LEN(PUC[[#This Row],[AUXILIAR]])","v":6},280505,"DEPOSITOS DE AHORRO"]
[{"$f":"LEN(PUC[[#This Row],[AUXILIAR]])","v":6},280510,"CUENTAS DE AHORRO DE VALOR CONSTANT"]
[{"$f":"LEN(PUC[[#This Row],[AUXILIAR]])","v":6},280515,"LEY 546 DE 1999"]
[{"$f":"LEN(PUC[[#This Row],[AUXILIAR]])","v":6},281000,"OBLIGACIONES LABORALES"]
[{"$f":"LEN(PUC[[#This Row],[AUXILIAR]])","v":6},281005,"CESANTIAS"]
[{"$f":"LEN(PUC[[#This Row],[AUXILIAR]])","v":6},281010,"INTERESES SOBRE CESANTIAS"]
[{"$f":"LEN(PUC[[#This Row],[AUXILIAR]])","v":6},281015,"VACACIONES"]
[{"$f":"LEN(PUC[[#This Row],[AUXILIAR]])","v":6},281020,"PRIMA LEGAL"]
[{"$f":"LEN(PUC[[#This Row],[AUXILIAR]])","v":6},281025,"PRIMA EXTRALEGAL"]
[{"$f":"LEN(PUC[[#This Row],[AUXILIAR]])","v":6},281030,"PRIMA DE VACACIONES"]
[{"$f":"LEN(PUC[[#This Row],[AUXILIAR]])","v":6},281035,"BONIFICACIONES"]
[{"$f":"LEN(PUC[[#This Row],[AUXILIAR]])","v":6},281040,"PRIMA DE ANTIGUEDAD"]
[{"$f":"LEN(PUC[[#This Row],[AUXILIAR]])","v":6},281045,"INSTITUTO DE SEGUROS SOCIALES"]
[{"$f":"LEN(PUC[[#This Row],[AUXILIAR]])","v":6},281095,"OTRAS PRESTACIONES"]
[{"$f":"LEN(PUC[[#This Row],[AUXILIAR]])","v":6},281500,"IMPUESTOS"]
[{"$f":"LEN(PUC[[#This Row],[AUXILIAR]])","v":6},281505,"RENTA Y COMPLEMENTARIOS"]
[{"$f":"LEN(PUC[[#This Row],[AUXILIAR]])","v":6},281510,"INDUSTRIA Y COMERCIO"]
[{"$f":"LEN(PUC[[#This Row],[AUXILIAR]])","v":6},281515,"PREDIAL"]
[{"$f":"LEN(PUC[[#This Row],[AUXILIAR]])","v":6},281520,"VEHICULOS"]
[{"$f":"LEN(PUC[[#This Row],[AUXILIAR]])","v":6},281595,"OTROS"]
[{"$f":"LEN(PUC[[#This Row],[AUXILIAR]])","v":6},282000,"CONTRIBUCIONES Y AFILIACIONES"]
[{"$f":"LEN(PUC[[#This Row],[AUXILIAR]])","v":6},282005,"SUPERINTENDENCIA BANCARIA"]
[{"$f":"LEN(PUC[[#This Row],[AUXILIAR]])","v":6},282010,"ASOCIACION BANCARIA"]
[{"$f":"LEN(PUC[[#This Row],[AUXILIAR]])","v":6},282015,"ASOCIACION NAL DE INSTIT. FINANC.- "]
[{"$f":"LEN(PUC[[#This Row],[AUXILIAR]])","v":6},282020,"FONDO DE GARANTIAS INSTITUCIONES FI"]
[{"$f":"LEN(PUC[[#This Row],[AUXILIAR]])","v":6},282025,"SERVIBANCA"]
[{"$f":"LEN(PUC[[#This Row],[AUXILIAR]])","v":6},282030,"ASCREDIBANCO"]
[{"$f":"LEN(PUC[[#This Row],[AUXILIAR]])","v":6},282035,"RED MULTICOLOR"]
[{"$f":"LEN(PUC[[#This Row],[AUXILIAR]])","v":6},282037,"REDEBAN"]
[{"$f":"LEN(PUC[[#This Row],[AUXILIAR]])","v":6},282045,"CONFEDERACION DE COOPERATIVAS DE CO"]
[{"$f":"LEN(PUC[[#This Row],[AUXILIAR]])","v":6},282050,"CONFED.LATINOAMER.DE COOP.D.AHOR.Y "]
[{"$f":"LEN(PUC[[#This Row],[AUXILIAR]])","v":6},282055,"CONTRALORIA GENERAL DE LA REPUBLICA"]
[{"$f":"LEN(PUC[[#This Row],[AUXILIAR]])","v":6},282060,"FEDERACION NACIONAL DE AGENTES DE A"]
[{"$f":"LEN(PUC[[#This Row],[AUXILIAR]])","v":6},282065,"FEDER.COLOMB.DE CIAS LEASING-FEDELE"]
[{"$f":"LEN(PUC[[#This Row],[AUXILIAR]])","v":6},282095,"OTRAS"]
[{"$f":"LEN(PUC[[#This Row],[AUXILIAR]])","v":6},286000,"MULTAS Y SANCIONES SUPERBANCARIA"]
[{"$f":"LEN(PUC[[#This Row],[AUXILIAR]])","v":6},286005,"RELACION ACTIVOS PONDERADOS POR RIE"]
[{"$f":"LEN(PUC[[#This Row],[AUXILIAR]])","v":6},286010,"EXCESOS (DEFECTOS) DE COLOCAC.DE CA"]
[{"$f":"LEN(PUC[[#This Row],[AUXILIAR]])","v":6},286015,"EXCESO EN ADQUIS.INVERS. O ACTIVOS "]
[{"$f":"LEN(PUC[[#This Row],[AUXILIAR]])","v":6},286020,"DEFECTOS EN INVERSIONES"]
[{"$f":"LEN(PUC[[#This Row],[AUXILIAR]])","v":6},286025,"DEFECTOS DE ENCAJE"]
[{"$f":"LEN(PUC[[#This Row],[AUXILIAR]])","v":6},286030,"MARGEN DE SOLVENCIA"]
[{"$f":"LEN(PUC[[#This Row],[AUXILIAR]])","v":6},286035,"POSICION PROPIA"]
[{"$f":"LEN(PUC[[#This Row],[AUXILIAR]])","v":6},286095,"OTRAS"]
[{"$f":"LEN(PUC[[#This Row],[AUXILIAR]])","v":6},286500,"MULTAS Y SANC,LITIG,INDEMN Y DEMAND"]
[{"$f":"LEN(PUC[[#This Row],[AUXILIAR]])","v":6},286510,"MULTAS Y SANC.OTRAS AUTORID. ADMTIV"]
[{"$f":"LEN(PUC[[#This Row],[AUXILIAR]])","v":6},286515,"INDEMNIZACIONES A CLIENTES"]
[{"$f":"LEN(PUC[[#This Row],[AUXILIAR]])","v":6},286520,"OTRAS INDEMNIZACIONES"]
[{"$f":"LEN(PUC[[#This Row],[AUXILIAR]])","v":6},286525,"DEMANDAS LABORALES"]
[{"$f":"LEN(PUC[[#This Row],[AUXILIAR]])","v":6},286530,"DEMANDAS POR INCUMPLIMIENTO DE CONT"]
[{"$f":"LEN(PUC[[#This Row],[AUXILIAR]])","v":6},286535,"LITIGIOS EN PROCESO EJECUTIVO"]
[{"$f":"LEN(PUC[[#This Row],[AUXILIAR]])","v":6},286540,"OTROS LITIG.EN PROC.ADMTIVO JUDI.O "]
[{"$f":"LEN(PUC[[#This Row],[AUXILIAR]])","v":6},286595,"OTRAS"]
[{"$f":"LEN(PUC[[#This Row],[AUXILIAR]])","v":6},287000,"RIESGOS DE LIQUIDEZ Y DE TASA DE IN"]
[{"$f":"LEN(PUC[[#This Row],[AUXILIAR]])","v":6},287005,"RIESGO DE LIQUIDEZ"]
[{"$f":"LEN(PUC[[#This Row],[AUXILIAR]])","v":6},287010,"RIESGO DE TASA DE INTERES"]
[{"$f":"LEN(PUC[[#This Row],[AUXILIAR]])","v":6},288500,"PARA ALCANZAR LA RENTABILIDAD MINIMA"]
[{"$f":"LEN(PUC[[#This Row],[AUXILIAR]])","v":6},288505,"FONDO DE CESANTIA"]
[{"$f":"LEN(PUC[[#This Row],[AUXILIAR]])","v":6},288510,"FONDO DE PENSIONES"]
[{"$f":"LEN(PUC[[#This Row],[AUXILIAR]])","v":6},289000,"OTROS PASIVOS ESTIMADOS"]
[{"$f":"LEN(PUC[[#This Row],[AUXILIAR]])","v":6},289500,"DIVERSOS"]
[{"$f":"LEN(PUC[[#This Row],[AUXILIAR]])","v":6},289505,"INTERESES POR MULTAS Y SANCIONES"]
[{"$f":"LEN(PUC[[#This Row],[AUXILIAR]])","v":6},289595,"OTROS"]
[{"$f":"LEN(PUC[[#This Row],[AUXILIAR]])","v":6},289600,"PROVISIONES FONDOS DE GARANTIAS"]
[{"$f":"LEN(PUC[[#This Row],[AUXILIAR]])","v":6},289605,"SINIESTROS AVISADOS"]
[{"$f":"LEN(PUC[[#This Row],[AUXILIAR]])","v":6},289610,"RIESGOS EN CURSO"]
[{"$f":"LEN(PUC[[#This Row],[AUXILIAR]])","v":6},289611,"DEVOLUCION PRIMAS"]
[{"$f":"LEN(PUC[[#This Row],[AUXILIAR]])","v":6},289615,"CAPITAL GARANTIA"]
[{"$f":"LEN(PUC[[#This Row],[AUXILIAR]])","v":6},289695,"OTRAS"]
[{"$f":"LEN(PUC[[#This Row],[AUXILIAR]])","v":6},289800,"INTERES MINORITARIO"]
[{"$f":"LEN(PUC[[#This Row],[AUXILIAR]])","v":6},289805,"SECTOR FINANCIERO"]
[{"$f":"LEN(PUC[[#This Row],[AUXILIAR]])","v":6},290000,"BONOS OBLIG. CONVERTIBLES EN ACCION"]
[{"$f":"LEN(PUC[[#This Row],[AUXILIAR]])","v":6},290500,"BONOS OBLIG. CONVERTIBLES EN ACCION"]
[{"$f":"LEN(PUC[[#This Row],[AUXILIAR]])","v":6},300000,"PATRIMONIO"]
[{"$f":"LEN(PUC[[#This Row],[AUXILIAR]])","v":6},310000,"CAPITAL SOCIAL"]
[{"$f":"LEN(PUC[[#This Row],[AUXILIAR]])","v":6},310500,"CAPITAL SUSCRITO Y PAGADO"]
[{"$f":"LEN(PUC[[#This Row],[AUXILIAR]])","v":6},310505,"CAPITAL AUTORIZADO"]
[{"$f":"LEN(PUC[[#This Row],[AUXILIAR]])","v":6},310510,"CAPITAL POR SUSCRIBIR (-)"]
[{"$f":"LEN(PUC[[#This Row],[AUXILIAR]])","v":6},310515,"CAPITAL SUSCRITO"]
[{"$f":"LEN(PUC[[#This Row],[AUXILIAR]])","v":6},310520,"CAPITAL SUSCRITO POR COBRAR (-)"]
[{"$f":"LEN(PUC[[#This Row],[AUXILIAR]])","v":6},313500,"APORTES SOCIALES"]
[{"$f":"LEN(PUC[[#This Row],[AUXILIAR]])","v":6},314000,"CAPITAL MINIMO E IRREDUCIBLE-SEC.AH"]
[{"$f":"LEN(PUC[[#This Row],[AUXILIAR]])","v":6},315000,"AJUSTE POR CONVERSION DE ESTADOS FINANC"]
[{"$f":"LEN(PUC[[#This Row],[AUXILIAR]])","v":6},320000,"RESERVAS"]
[{"$f":"LEN(PUC[[#This Row],[AUXILIAR]])","v":6},320500,"RESERVA  LEGAL"]
[{"$f":"LEN(PUC[[#This Row],[AUXILIAR]])","v":6},320505,"POR APROPIACION DE UTILIDADES LIQUI"]
[{"$f":"LEN(PUC[[#This Row],[AUXILIAR]])","v":6},320510,"POR PRIMA EN COLOCACION DE ACCIONES"]
[{"$f":"LEN(PUC[[#This Row],[AUXILIAR]])","v":6},320515,"PRIMA EN COLOCACION DE ACCIONES X C"]
[{"$f":"LEN(PUC[[#This Row],[AUXILIAR]])","v":6},320520,"PARA PROTECCION DE APORTES SOCIALES"]
[{"$f":"LEN(PUC[[#This Row],[AUXILIAR]])","v":6},321000,"RESERVAS ESTATUTARIAS"]
[{"$f":"LEN(PUC[[#This Row],[AUXILIAR]])","v":6},321500,"RESERVAS OCASIONALES"]
[{"$f":"LEN(PUC[[#This Row],[AUXILIAR]])","v":6},321505,"A DISPOSICION DE LA JUNTA DIRECTIVA"]
[{"$f":"LEN(PUC[[#This Row],[AUXILIAR]])","v":6},321510,"PARA PROTECCION DE INVERSIONES"]
[{"$f":"LEN(PUC[[#This Row],[AUXILIAR]])","v":6},321515,"PARA PROTECCION DE CARTERA DE CREDITOS"]
[{"$f":"LEN(PUC[[#This Row],[AUXILIAR]])","v":6},321520,"PARA BENEFICENCIA Y DONACIONES"]
[{"$f":"LEN(PUC[[#This Row],[AUXILIAR]])","v":6},321525,"POR DISPOSICIONES FISCALES"]
[{"$f":"LEN(PUC[[#This Row],[AUXILIAR]])","v":6},321530,"PARA READQUISICION DE ACCIONES"]
[{"$f":"LEN(PUC[[#This Row],[AUXILIAR]])","v":6},321531,"ACCIONES PROPIAS READQUIRIDAS (-)"]
[{"$f":"LEN(PUC[[#This Row],[AUXILIAR]])","v":6},321535,"PARA ADQUIS,MEJOR.O REMODEL.PROP.Y EQ."]
[{"$f":"LEN(PUC[[#This Row],[AUXILIAR]])","v":6},321540,"PARA REPOSICION DE SEMOVIENTES"]
[{"$f":"LEN(PUC[[#This Row],[AUXILIAR]])","v":6},321590,"PARA LA SECCION DE SEGUROS"]
[{"$f":"LEN(PUC[[#This Row],[AUXILIAR]])","v":6},321595,"OTRAS"]
[{"$f":"LEN(PUC[[#This Row],[AUXILIAR]])","v":6},322000,"OTRAS RESERVAS"]
[{"$f":"LEN(PUC[[#This Row],[AUXILIAR]])","v":6},322005,"RESERVAS DE ESTABILIZACION"]
[{"$f":"LEN(PUC[[#This Row],[AUXILIAR]])","v":6},330000,"FONDOS DE DESTINACION ESPECIFICA"]
[{"$f":"LEN(PUC[[#This Row],[AUXILIAR]])","v":6},331500,"AMORTIZACION DE APORTES  SOCIALES"]
[{"$f":"LEN(PUC[[#This Row],[AUXILIAR]])","v":6},332500,"FONDOS DE CAPITAL"]
[{"$f":"LEN(PUC[[#This Row],[AUXILIAR]])","v":6},333000,"FONDO DE REVALORIZACION DE APORTES"]
[{"$f":"LEN(PUC[[#This Row],[AUXILIAR]])","v":6},333500,"FONDOS SOCIALES CAPITALIZABLES"]
[{"$f":"LEN(PUC[[#This Row],[AUXILIAR]])","v":6},333505,"DE EDUCACION"]
[{"$f":"LEN(PUC[[#This Row],[AUXILIAR]])","v":6},333510,"DE SOLIDARIDAD"]
[{"$f":"LEN(PUC[[#This Row],[AUXILIAR]])","v":6},333515,"PARA RECREACION"]
[{"$f":"LEN(PUC[[#This Row],[AUXILIAR]])","v":6},333520,"MEJORAS PARA VIVIENDA"]
[{"$f":"LEN(PUC[[#This Row],[AUXILIAR]])","v":6},333525,"PREVENCION Y SEGURIDAD SOCIAL"]
[{"$f":"LEN(PUC[[#This Row],[AUXILIAR]])","v":6},333595,"OTRAS"]
[{"$f":"LEN(PUC[[#This Row],[AUXILIAR]])","v":6},335000,"FONDO ESPECIAL"]
[{"$f":"LEN(PUC[[#This Row],[AUXILIAR]])","v":6},340000,"SUPERAVIT O DEFICIT"]
[{"$f":"LEN(PUC[[#This Row],[AUXILIAR]])","v":6},340700,"CONTRIBUCIONES"]
[{"$f":"LEN(PUC[[#This Row],[AUXILIAR]])","v":6},341000,"DONACIONES"]
[{"$f":"LEN(PUC[[#This Row],[AUXILIAR]])","v":6},341300,"GANANC O PERD ACUM NO REAL INV DIS XA VT"]
[{"$f":"LEN(PUC[[#This Row],[AUXILIAR]])","v":6},341305,"TITULOS DE DEUDA"]
[{"$f":"LEN(PUC[[#This Row],[AUXILIAR]])","v":6},341310,"TIT PARTICIP ALTA O MEDIA BURSATIL"]
[{"$f":"LEN(PUC[[#This Row],[AUXILIAR]])","v":6},341315,"TIT PARTICIP O MIXTOS PROC TITULARIZ"]
[{"$f":"LEN(PUC[[#This Row],[AUXILIAR]])","v":6},341320,"EN TRANSFER TEMPORAL VLORES"]
[{"$f":"LEN(PUC[[#This Row],[AUXILIAR]])","v":6},341400,"GANANCIAS O PÉRDIDAS ACUMULADAS NO REALI"]
[{"$f":"LEN(PUC[[#This Row],[AUXILIAR]])","v":6},341415,"POR COBERTURAS DE FLUJOS DE EFECTIVO"]
[{"$f":"LEN(PUC[[#This Row],[AUXILIAR]])","v":6},341420,"POR COBERTURAS DE INVERSIONES EN OPERACI"]
[{"$f":"LEN(PUC[[#This Row],[AUXILIAR]])","v":6},341500,"VALORIZACIONES"]
[{"$f":"LEN(PUC[[#This Row],[AUXILIAR]])","v":6},341507,"APORTES PERMANENTES"]
[{"$f":"LEN(PUC[[#This Row],[AUXILIAR]])","v":6},341510,"PROPIEDADES Y EQUIPO"]
[{"$f":"LEN(PUC[[#This Row],[AUXILIAR]])","v":6},341515,"BIENES RECIBIDOS EN PAGO"]
[{"$f":"LEN(PUC[[#This Row],[AUXILIAR]])","v":6},341520,"SEMOVIENTES"]
[{"$f":"LEN(PUC[[#This Row],[AUXILIAR]])","v":6},341525,"BIENES DE ARTE Y CULTURA"]
[{"$f":"LEN(PUC[[#This Row],[AUXILIAR]])","v":6},341530,"PATRIMONIO AUTONOMO-SANEAMIENTO FOGAFIN"]
[{"$f":"LEN(PUC[[#This Row],[AUXILIAR]])","v":6},341535,"PATRIMONIO AUTONOMO-SANEAMIENTO VOLUNTAR"]
[{"$f":"LEN(PUC[[#This Row],[AUXILIAR]])","v":6},341550,"INV DISP XA VTA TIT PART BAJA O MIN BURS"]
[{"$f":"LEN(PUC[[#This Row],[AUXILIAR]])","v":6},341600,"DESVALORIZACIONES (DB)"]
[{"$f":"LEN(PUC[[#This Row],[AUXILIAR]])","v":6},341650,"INV DISP XA VTA TIT PART BAJA O MIN BURS"]
[{"$f":"LEN(PUC[[#This Row],[AUXILIAR]])","v":6},341700,"REVALORIZACION DEL PATRIMONIO"]
[{"$f":"LEN(PUC[[#This Row],[AUXILIAR]])","v":6},341707,"PROPIEDADES Y EQUIPO"]
[{"$f":"LEN(PUC[[#This Row],[AUXILIAR]])","v":6},341710,"AJUSTES AL PATRIMONIO"]
[{"$f":"LEN(PUC[[#This Row],[AUXILIAR]])","v":6},343000,"EJECUCION PROGRAMA DE EXTEN AGROPEC"]
[{"$f":"LEN(PUC[[#This Row],[AUXILIAR]])","v":6},343500,"ARTICULO 6 LEY 4/80"]
[{"$f":"LEN(PUC[[#This Row],[AUXILIAR]])","v":6},343505,"ACCIONES FORZOSAS"]
[{"$f":"LEN(PUC[[#This Row],[AUXILIAR]])","v":6},343510,"DIVIDENDOS DE ACCIONES FORZOSAS"]
[{"$f":"LEN(PUC[[#This Row],[AUXILIAR]])","v":6},350000,"RESULTADOS DE EJERCICIOS ANTERIORES"]
[{"$f":"LEN(PUC[[#This Row],[AUXILIAR]])","v":6},360000,"RESULTADOS DEL EJERCICIO"]
[{"$f":"LEN(PUC[[#This Row],[AUXILIAR]])","v":6},370000,"DIVIDENDOS DECRETADOS EN ACCIONES"]
[{"$f":"LEN(PUC[[#This Row],[AUXILIAR]])","v":6},370500,"DIVIDENDOS DECRETADOS EN ACCIONES"]
[{"$f":"LEN(PUC[[#This Row],[AUXILIAR]])","v":6},390000,"PATRIMONIO SECCIONES ESPECIALES"]
[{"$f":"LEN(PUC[[#This Row],[AUXILIAR]])","v":6},390500,"SECCION VALOR CONSTANTE"]
[{"$f":"LEN(PUC[[#This Row],[AUXILIAR]])","v":6},391000,"SECCION TRADICIONAL"]
[{"$f":"LEN(PUC[[#This Row],[AUXILIAR]])","v":6},391500,"SECCION DE AHORRO Y CREDITO ENT COOPERAT"]
[{"$f":"LEN(PUC[[#This Row],[AUXILIAR]])","v":6},400000,"INGRESOS"]
[{"$f":"LEN(PUC[[#This Row],[AUXILIAR]])","v":6},410000,"OPERACIONALES"]
[{"$f":"LEN(PUC[[#This Row],[AUXILIAR]])","v":6},410200,"INTERESES Y DESCTO AMORTIZ.CART.D.CRED."]
[{"$f":"LEN(PUC[[#This Row],[AUXILIAR]])","v":6},410202,"CREDITOS COMERCIALES"]
[{"$f":"LEN(PUC[[#This Row],[AUXILIAR]])","v":6},410203,"CREDITOS DE CONSUMO"]
[{"$f":"LEN(PUC[[#This Row],[AUXILIAR]])","v":6},410204,"CARTERA DE TARJETAS DE CREDITO COMERCIAL"]
[{"$f":"LEN(PUC[[#This Row],[AUXILIAR]])","v":6},410205,"SOBREGIROS CREDITOS COMERCIALES"]
[{"$f":"LEN(PUC[[#This Row],[AUXILIAR]])","v":6},410206,"OPERACIONES DE REDESCUENTO BANCO REPUBLI"]
[{"$f":"LEN(PUC[[#This Row],[AUXILIAR]])","v":6},410207,"OPERACIONES DE REDESCUENTO DE CART COMER"]
[{"$f":"LEN(PUC[[#This Row],[AUXILIAR]])","v":6},410208,"CREDITOS DE VIVIENDA"]
[{"$f":"LEN(PUC[[#This Row],[AUXILIAR]])","v":6},410209,"MICROCREDITOS"]
[{"$f":"LEN(PUC[[#This Row],[AUXILIAR]])","v":6},410210,"MORATORIOS CARTERA COMERCIAL"]
[{"$f":"LEN(PUC[[#This Row],[AUXILIAR]])","v":6},410211,"CARTERA DE TARJETAS DE CREDITO CONSUMO"]
[{"$f":"LEN(PUC[[#This Row],[AUXILIAR]])","v":6},410212,"SOBREGIROS CREDITOS CONSUMO"]
[{"$f":"LEN(PUC[[#This Row],[AUXILIAR]])","v":6},410217,"OPERACIONES DE DESCUENTO DE CARTER COMER"]
[{"$f":"LEN(PUC[[#This Row],[AUXILIAR]])","v":6},410218,"OPERACIONES FACTORING"]
[{"$f":"LEN(PUC[[#This Row],[AUXILIAR]])","v":6},410219,"CONCEPTOS REPUTADOS INTERESES"]
[{"$f":"LEN(PUC[[#This Row],[AUXILIAR]])","v":6},410220,"OPERACIONES DE DESCUENTO DE CARTER CONSU"]
[{"$f":"LEN(PUC[[#This Row],[AUXILIAR]])","v":6},410221,"OPERACIONES DE REDESCUENTO CARTER CONSUM"]
[{"$f":"LEN(PUC[[#This Row],[AUXILIAR]])","v":6},410222,"OPERACIONES DE REDESCUENTO CARTER VIVIEN"]
[{"$f":"LEN(PUC[[#This Row],[AUXILIAR]])","v":6},410223,"OPERACIONES DE REDESCUENT CARTER MICROCR"]
[{"$f":"LEN(PUC[[#This Row],[AUXILIAR]])","v":6},410229,"CARTERA DE LEASING HABITACIONAL"]
[{"$f":"LEN(PUC[[#This Row],[AUXILIAR]])","v":6},410241,"MORATORIOS CARTERA DE CONSUMO"]
[{"$f":"LEN(PUC[[#This Row],[AUXILIAR]])","v":6},410242,"MORATORIOS CARTERA DE VIVIENDA"]
[{"$f":"LEN(PUC[[#This Row],[AUXILIAR]])","v":6},410243,"MORATORIOS CARTERA DE MICROCREDITO"]
[{"$f":"LEN(PUC[[#This Row],[AUXILIAR]])","v":6},410400,"RENDIMIENTOS EN OPERACIONES REPO, SIMULT"]
[{"$f":"LEN(PUC[[#This Row],[AUXILIAR]])","v":6},410402,"DEPOSITOS A LA VISTA"]
[{"$f":"LEN(PUC[[#This Row],[AUXILIAR]])","v":6},410403,"FONDOS INTERBANCARIOS VENDIDOS ORDI"]
[{"$f":"LEN(PUC[[#This Row],[AUXILIAR]])","v":6},410409,"TITULOS DE INVERSION EN CIRCULACION"]
[{"$f":"LEN(PUC[[#This Row],[AUXILIAR]])","v":6},410410,"MORA EN TRASLADO DE CESANTIAS AL F.N.A."]
[{"$f":"LEN(PUC[[#This Row],[AUXILIAR]])","v":6},410421,"RENDIMIENTOS POR COMPROMISOS DE TRANSFER"]
[{"$f":"LEN(PUC[[#This Row],[AUXILIAR]])","v":6},410423,"RENDIMIENTOS POR COMPROMISOS DE TRANSFER"]
[{"$f":"LEN(PUC[[#This Row],[AUXILIAR]])","v":6},410424,"RENDIMIENTOS POR COMPROMISOS EN OPERACIO"]
[{"$f":"LEN(PUC[[#This Row],[AUXILIAR]])","v":6},410435,"DIFERENCIAL DE TASAS"]
[{"$f":"LEN(PUC[[#This Row],[AUXILIAR]])","v":6},410450,"RENDIM FINAN. POR EJECUCION DE PROYECTOS"]
[{"$f":"LEN(PUC[[#This Row],[AUXILIAR]])","v":6},410480,"INTERESES GANADOS FOGAFIN"]
[{"$f":"LEN(PUC[[#This Row],[AUXILIAR]])","v":6},410485,"DEPOSITOS DE CONTRACCION MONETARIA"]
[{"$f":"LEN(PUC[[#This Row],[AUXILIAR]])","v":6},410490,"UTIL x PARTICIP EN LA FORMACISN DEL IBR"]
[{"$f":"LEN(PUC[[#This Row],[AUXILIAR]])","v":6},410495,"OTROS INTERESES"]
[{"$f":"LEN(PUC[[#This Row],[AUXILIAR]])","v":6},410700,"UTIL VLORAC INV NEG EN TIT DE DEUDA"]
[{"$f":"LEN(PUC[[#This Row],[AUXILIAR]])","v":6},410706,"POR INCREMENTO VLOR DE MCDO"]
[{"$f":"LEN(PUC[[#This Row],[AUXILIAR]])","v":6},410712,"POR DISMINUCION VLOR DE MCDO"]
[{"$f":"LEN(PUC[[#This Row],[AUXILIAR]])","v":6},410800,"UTIL VLORACION INV NEG EN TIT PARTICIP"]
[{"$f":"LEN(PUC[[#This Row],[AUXILIAR]])","v":6},410806,"POR INCREMENTO VLOR DE MCDO CR"]
[{"$f":"LEN(PUC[[#This Row],[AUXILIAR]])","v":6},410811,"POR DISMIN VLOR DE MCDO DB"]
[{"$f":"LEN(PUC[[#This Row],[AUXILIAR]])","v":6},410900,"UTIL VLORAC INV DISP XA VTA TIT DEUDA"]
[{"$f":"LEN(PUC[[#This Row],[AUXILIAR]])","v":6},410906,"POR INCREM EN EL VLOR PRESENTE CR"]
[{"$f":"LEN(PUC[[#This Row],[AUXILIAR]])","v":6},410912,"POR DISMIN VLOR PRESENTE DB"]
[{"$f":"LEN(PUC[[#This Row],[AUXILIAR]])","v":6},411000,"REAJUSTE DE LA UNIDAD VLOR REAL UVR"]
[{"$f":"LEN(PUC[[#This Row],[AUXILIAR]])","v":6},411005,"DEPOSITOS A LA VISTA"]
[{"$f":"LEN(PUC[[#This Row],[AUXILIAR]])","v":6},411015,"CARTERA DE CREDITOS"]
[{"$f":"LEN(PUC[[#This Row],[AUXILIAR]])","v":6},411018,"OPERACIONES LEASING FINANCIERO"]
[{"$f":"LEN(PUC[[#This Row],[AUXILIAR]])","v":6},411100,"UTIL VLORAC INV XA MANT HASTA VENCIM"]
[{"$f":"LEN(PUC[[#This Row],[AUXILIAR]])","v":6},411106,"POR INCREMENTO EN EL VLOR PRESENTE"]
[{"$f":"LEN(PUC[[#This Row],[AUXILIAR]])","v":6},411112,"POR DISMINUC EN EL VALOR PRESENTE DB"]
[{"$f":"LEN(PUC[[#This Row],[AUXILIAR]])","v":6},411200,"UTILIDAD VALORACION CARRUSELES"]
[{"$f":"LEN(PUC[[#This Row],[AUXILIAR]])","v":6},411205,"POR COMPROMISOS DE COMPRA"]
[{"$f":"LEN(PUC[[#This Row],[AUXILIAR]])","v":6},411210,"POR COMPROMISOS DE VENTA"]
[{"$f":"LEN(PUC[[#This Row],[AUXILIAR]])","v":6},411500,"COMISIONES Y/O HONORARIOS"]
[{"$f":"LEN(PUC[[#This Row],[AUXILIAR]])","v":6},411505,"ACEPTACIONES (BANCARIAS)"]
[{"$f":"LEN(PUC[[#This Row],[AUXILIAR]])","v":6},411510,"CARTAS DE CREDITO"]
[{"$f":"LEN(PUC[[#This Row],[AUXILIAR]])","v":6},411515,"AVALES"]
[{"$f":"LEN(PUC[[#This Row],[AUXILIAR]])","v":6},411520,"GARANTIAS BANCARIAS"]
[{"$f":"LEN(PUC[[#This Row],[AUXILIAR]])","v":6},411525,"SERVICIOS BANCARIOS"]
[{"$f":"LEN(PUC[[#This Row],[AUXILIAR]])","v":6},411530,"NEG FIDUCIARIOS(COMISIONES Y HONORA"]
[{"$f":"LEN(PUC[[#This Row],[AUXILIAR]])","v":6},411535,"ESTABLEC.AFILIADOS A TARJETAS DE CR"]
[{"$f":"LEN(PUC[[#This Row],[AUXILIAR]])","v":6},411540,"Uso medios de pago dif de efectivo"]
[{"$f":"LEN(PUC[[#This Row],[AUXILIAR]])","v":6},411543,"SERVICIO RED DE OFICINAS"]
[{"$f":"LEN(PUC[[#This Row],[AUXILIAR]])","v":6},411556,"COMISIÓN DE ADMINISTRACIÓN-FONDO DE CESA"]
[{"$f":"LEN(PUC[[#This Row],[AUXILIAR]])","v":6},411557,"COMISIÓN DE ADMINISTRACIÓN-FONDO DE CESA"]
[{"$f":"LEN(PUC[[#This Row],[AUXILIAR]])","v":6},411558,"COMISIÓN RETIROS PARCIALES-FONDO DE CESA"]
[{"$f":"LEN(PUC[[#This Row],[AUXILIAR]])","v":6},411559,"COMISIÓN RETIROS PARCIALES-FONDO DE CESA"]
[{"$f":"LEN(PUC[[#This Row],[AUXILIAR]])","v":6},411560,"COMISION DE ADMINIS.FDO DE PENS.OBLIGATO"]
[{"$f":"LEN(PUC[[#This Row],[AUXILIAR]])","v":6},411561,"COMISION ADMON PENSIONES RETIRO PROGAM"]
[{"$f":"LEN(PUC[[#This Row],[AUXILIAR]])","v":6},411562,"COMISION ADMON RECURSOS AFIL CESANTES"]
[{"$f":"LEN(PUC[[#This Row],[AUXILIAR]])","v":6},411563,"COMISION TRASLADO AFILIADOS"]
[{"$f":"LEN(PUC[[#This Row],[AUXILIAR]])","v":6},411564,"ADMIN APORTES VOLUNT FDOS PENSI OBLIG"]
[{"$f":"LEN(PUC[[#This Row],[AUXILIAR]])","v":6},411565,"COMISION DE ADMINIS.FDO DE PENS.VOLUNTAR"]
[{"$f":"LEN(PUC[[#This Row],[AUXILIAR]])","v":6},411566,"COMISION ADMON PASIVOS PENSIONALES ENTID"]
[{"$f":"LEN(PUC[[#This Row],[AUXILIAR]])","v":6},411567,"COMISON ADMINISTRACION FONPET"]
[{"$f":"LEN(PUC[[#This Row],[AUXILIAR]])","v":6},411568,"COMISION ADMON PASIVOS PENSIONALES REACT"]
[{"$f":"LEN(PUC[[#This Row],[AUXILIAR]])","v":6},411570,"COMISIONES POR GIROS"]
[{"$f":"LEN(PUC[[#This Row],[AUXILIAR]])","v":6},411572,"PRIVATIZACIONES"]
[{"$f":"LEN(PUC[[#This Row],[AUXILIAR]])","v":6},411573,"CAPITAL GARANTIA"]
[{"$f":"LEN(PUC[[#This Row],[AUXILIAR]])","v":6},411575,"COMISIONES POR PRODUCTOS DERIVADOS"]
[{"$f":"LEN(PUC[[#This Row],[AUXILIAR]])","v":6},411580,"COMISIONES POR GARANTIAS - FNG"]
[{"$f":"LEN(PUC[[#This Row],[AUXILIAR]])","v":6},411595,"OTRAS"]
[{"$f":"LEN(PUC[[#This Row],[AUXILIAR]])","v":6},411600,"GANANC REALIZ EN INV DISP XA VTA"]
[{"$f":"LEN(PUC[[#This Row],[AUXILIAR]])","v":6},411605,"TITULOS DE DEUDA"]
[{"$f":"LEN(PUC[[#This Row],[AUXILIAR]])","v":6},411610,"TIT PARTICIP ALTA O MEDIA BURSATILIDAD"]
[{"$f":"LEN(PUC[[#This Row],[AUXILIAR]])","v":6},411615,"TIT PARTICIP O MIXTOS PROC TITULARIZ"]
[{"$f":"LEN(PUC[[#This Row],[AUXILIAR]])","v":6},411620,"EN TRANSFER TEMP DE VALORES"]
[{"$f":"LEN(PUC[[#This Row],[AUXILIAR]])","v":6},411700,"INGRESOS POR RETROGARANTES"]
[{"$f":"LEN(PUC[[#This Row],[AUXILIAR]])","v":6},412000,"SERVICIOS DE ALMACEN"]
[{"$f":"LEN(PUC[[#This Row],[AUXILIAR]])","v":6},412005,"ALMACEN BODEGAS PROPIAS"]
[{"$f":"LEN(PUC[[#This Row],[AUXILIAR]])","v":6},412010,"ALMACEN BODEGAS PARTICULARES"]
[{"$f":"LEN(PUC[[#This Row],[AUXILIAR]])","v":6},412015,"ALMACEN MERCANCIAS EN TRANSITO"]
[{"$f":"LEN(PUC[[#This Row],[AUXILIAR]])","v":6},412020,"ALMACEN SILOS"]
[{"$f":"LEN(PUC[[#This Row],[AUXILIAR]])","v":6},412025,"AGENCIAMIENTO ADUANERO"]
[{"$f":"LEN(PUC[[#This Row],[AUXILIAR]])","v":6},412030,"OPERACIONES COMPRA VENTA"]
[{"$f":"LEN(PUC[[#This Row],[AUXILIAR]])","v":6},412035,"MANEJO Y DISTRIBUCION"]
[{"$f":"LEN(PUC[[#This Row],[AUXILIAR]])","v":6},412039,"TRATAMIENTO DE MERCANCIAS"]
[{"$f":"LEN(PUC[[#This Row],[AUXILIAR]])","v":6},412044,"MOVILIZACION Y TRANSPORTE DE MERCAN"]
[{"$f":"LEN(PUC[[#This Row],[AUXILIAR]])","v":6},412049,"ALMACENAJE"]
[{"$f":"LEN(PUC[[#This Row],[AUXILIAR]])","v":6},412095,"OTRAS"]
[{"$f":"LEN(PUC[[#This Row],[AUXILIAR]])","v":6},412300,"UTILIDAD EN POSICIONES EN CORTO DE OPERA"]
[{"$f":"LEN(PUC[[#This Row],[AUXILIAR]])","v":6},412305,"OPERACIONES REPO ABIERTO"]
[{"$f":"LEN(PUC[[#This Row],[AUXILIAR]])","v":6},412310,"OPERACIONES SIMULTANEAS"]
[{"$f":"LEN(PUC[[#This Row],[AUXILIAR]])","v":6},412315,"OPERACIONES DE TRANSFERENCIA TEMPORAL DE"]
[{"$f":"LEN(PUC[[#This Row],[AUXILIAR]])","v":6},412500,"UTILIDAD EN VENTA DE INVERSIONES"]
[{"$f":"LEN(PUC[[#This Row],[AUXILIAR]])","v":6},412504,"NEGOCIABLES EN TITULOS DE DEUDA"]
[{"$f":"LEN(PUC[[#This Row],[AUXILIAR]])","v":6},412506,"NEGOCIABLES EN TITULOS PARTICIPATIVOS"]
[{"$f":"LEN(PUC[[#This Row],[AUXILIAR]])","v":6},412507,"XA MANTENER HASTA EL VENCIMIENTO"]
[{"$f":"LEN(PUC[[#This Row],[AUXILIAR]])","v":6},412509,"DISPONIBLES XA VTA EN TITULOS DE DEUDA"]
[{"$f":"LEN(PUC[[#This Row],[AUXILIAR]])","v":6},412511,"DISPON XA VTA TITULOS PARTICIPATIVOS"]
[{"$f":"LEN(PUC[[#This Row],[AUXILIAR]])","v":6},412700,"UTILIDAD EN VENTA DE CARTERA"]
[{"$f":"LEN(PUC[[#This Row],[AUXILIAR]])","v":6},412705,"UTILIDAD EN VENTA DE CARTERA"]
[{"$f":"LEN(PUC[[#This Row],[AUXILIAR]])","v":6},412800,"UTILIDAD VLORAC OPERAC CONTADO"]
[{"$f":"LEN(PUC[[#This Row],[AUXILIAR]])","v":6},412805,"CONTRATOS COMPRA DIVISAS"]
[{"$f":"LEN(PUC[[#This Row],[AUXILIAR]])","v":6},412806,"CONTRATOS VENTA DIVISAS"]
[{"$f":"LEN(PUC[[#This Row],[AUXILIAR]])","v":6},412815,"CONTRATOS COMPRA TITULOS"]
[{"$f":"LEN(PUC[[#This Row],[AUXILIAR]])","v":6},412816,"CONTRATOS VENTA TITULOS"]
[{"$f":"LEN(PUC[[#This Row],[AUXILIAR]])","v":6},412820,"CONTRATOS OTROS"]
[{"$f":"LEN(PUC[[#This Row],[AUXILIAR]])","v":6},412900,"UTILIDAD EN LA VALORACION DE DERIVADOS -"]
[{"$f":"LEN(PUC[[#This Row],[AUXILIAR]])","v":6},412905,"FORWARDS DE COMPRA DE MONEDAS (PESODÓLA"]
[{"$f":"LEN(PUC[[#This Row],[AUXILIAR]])","v":6},412906,"FORWARDS DE VENTA DE MONEDAS (PESODÓLAR"]
[{"$f":"LEN(PUC[[#This Row],[AUXILIAR]])","v":6},412907,"FORWARDS DE COMPRA DE MONEDAS (DIFERENTE"]
[{"$f":"LEN(PUC[[#This Row],[AUXILIAR]])","v":6},412908,"FORWARDS DE VENTA DE MONEDAS (DIFERENTES"]
[{"$f":"LEN(PUC[[#This Row],[AUXILIAR]])","v":6},412910,"FORWARDS SOBRE TASAS DE INTERÉS"]
[{"$f":"LEN(PUC[[#This Row],[AUXILIAR]])","v":6},412915,"FORWARDS DE COMPRA DE TÍTULOS"]
[{"$f":"LEN(PUC[[#This Row],[AUXILIAR]])","v":6},412916,"FORWARDS DE VENTA DE TÍTULOS"]
[{"$f":"LEN(PUC[[#This Row],[AUXILIAR]])","v":6},412920,"FORWARDS - OTROS"]
[{"$f":"LEN(PUC[[#This Row],[AUXILIAR]])","v":6},412925,"FUTUROS DE COMPRA DE MONEDAS"]
[{"$f":"LEN(PUC[[#This Row],[AUXILIAR]])","v":6},412926,"FUTUROS DE VENTA DE MONEDAS"]
[{"$f":"LEN(PUC[[#This Row],[AUXILIAR]])","v":6},412930,"FUTUROS SOBRE TASAS DE INTERÉS"]
[{"$f":"LEN(PUC[[#This Row],[AUXILIAR]])","v":6},412935,"FUTUROS DE COMPRA DE TÍTULOS"]
[{"$f":"LEN(PUC[[#This Row],[AUXILIAR]])","v":6},412936,"FUTUROS DE VENTA DE TÍTULOS"]
[{"$f":"LEN(PUC[[#This Row],[AUXILIAR]])","v":6},412937,"FUTUROS DE COMPRA DE ÍNDICES"]
[{"$f":"LEN(PUC[[#This Row],[AUXILIAR]])","v":6},412938,"FUTUROS DE VENTA DE ÍNDICES"]
[{"$f":"LEN(PUC[[#This Row],[AUXILIAR]])","v":6},412940,"FUTUROS - OTROS"]
[{"$f":"LEN(PUC[[#This Row],[AUXILIAR]])","v":6},412945,"SWAPS DE MONEDAS"]
[{"$f":"LEN(PUC[[#This Row],[AUXILIAR]])","v":6},412950,"SWAPS DE TASAS DE INTERÉS"]
[{"$f":"LEN(PUC[[#This Row],[AUXILIAR]])","v":6},412955,"SWAPS - OTROS"]
[{"$f":"LEN(PUC[[#This Row],[AUXILIAR]])","v":6},412960,"COMPRA DE OPCIONES CALLS SOBRE MONEDAS"]
[{"$f":"LEN(PUC[[#This Row],[AUXILIAR]])","v":6},412961,"COMPRA DE OPCIONES PUTS DE MONEDAS"]
[{"$f":"LEN(PUC[[#This Row],[AUXILIAR]])","v":6},412963,"EMISIONES O VENTAS DE OPCIONES CALL SOBR"]
[{"$f":"LEN(PUC[[#This Row],[AUXILIAR]])","v":6},412964,"EMISIONES O VENTA DE OPCIONES PUT SOBRE "]
[{"$f":"LEN(PUC[[#This Row],[AUXILIAR]])","v":6},412965,"COMPRA DE OPCIONES CALLS SOBRE TASAS DE "]
[{"$f":"LEN(PUC[[#This Row],[AUXILIAR]])","v":6},412966,"COMPRA DE OPCIONES PUTS SOBRE TASAS DE I"]
[{"$f":"LEN(PUC[[#This Row],[AUXILIAR]])","v":6},412968,"EMISIONES O VENTAS DE OPCIONES CALL SOBR"]
[{"$f":"LEN(PUC[[#This Row],[AUXILIAR]])","v":6},412969,"EMISIONES O VENTAS DE OPCIONES PUT SOBRE"]
[{"$f":"LEN(PUC[[#This Row],[AUXILIAR]])","v":6},412970,"COMPRAS DE OPCIONES CALLS SOBRE TÍTULOS"]
[{"$f":"LEN(PUC[[#This Row],[AUXILIAR]])","v":6},412971,"COMPRAS DE OPCIONES PUTS SOBRE TÍTULOS"]
[{"$f":"LEN(PUC[[#This Row],[AUXILIAR]])","v":6},412973,"EMISIONES O VENTAS DE OPCIONES CALL SOBR"]
[{"$f":"LEN(PUC[[#This Row],[AUXILIAR]])","v":6},412974,"EMISIONES O VENTAS DE OPCIONES PUT SOBRE"]
[{"$f":"LEN(PUC[[#This Row],[AUXILIAR]])","v":6},412975,"COMPRA DE OPCIONES CALLS - OTROS"]
[{"$f":"LEN(PUC[[#This Row],[AUXILIAR]])","v":6},412976,"EMISIONES O VENTAS DE OPCIONES CALL - OT"]
[{"$f":"LEN(PUC[[#This Row],[AUXILIAR]])","v":6},412978,"COMPRAS DE OPCIONES CALL SOBRE ÍNDICES"]
[{"$f":"LEN(PUC[[#This Row],[AUXILIAR]])","v":6},412979,"EMISIONES O VENTAS DE OPCIONES CALL SOBR"]
[{"$f":"LEN(PUC[[#This Row],[AUXILIAR]])","v":6},412980,"COMPRAS DE OPCIONES PUT SOBRE ÍNDICES"]
[{"$f":"LEN(PUC[[#This Row],[AUXILIAR]])","v":6},412981,"EMISIONES O VENTAS DE OPCIONES PUT SOBRE"]
[{"$f":"LEN(PUC[[#This Row],[AUXILIAR]])","v":6},412985,"COMPRA DE OPCIONES PUTS ¿ OTRAS"]
[{"$f":"LEN(PUC[[#This Row],[AUXILIAR]])","v":6},412990,"EMISIONES O VENTAS DE OPCIONES PUTS - OT"]
[{"$f":"LEN(PUC[[#This Row],[AUXILIAR]])","v":6},413000,"VENTA BIENES REALIZABLES"]
[{"$f":"LEN(PUC[[#This Row],[AUXILIAR]])","v":6},413005,"VIVIENDA"]
[{"$f":"LEN(PUC[[#This Row],[AUXILIAR]])","v":6},413010,"LOCALES Y OFICINAS"]
[{"$f":"LEN(PUC[[#This Row],[AUXILIAR]])","v":6},413015,"BIENES TERMINADOS"]
[{"$f":"LEN(PUC[[#This Row],[AUXILIAR]])","v":6},413020,"MERCANCIAS"]
[{"$f":"LEN(PUC[[#This Row],[AUXILIAR]])","v":6},413025,"VEHICULOS"]
[{"$f":"LEN(PUC[[#This Row],[AUXILIAR]])","v":6},413030,"SEMOVIENTES"]
[{"$f":"LEN(PUC[[#This Row],[AUXILIAR]])","v":6},413035,"TERRENOS"]
[{"$f":"LEN(PUC[[#This Row],[AUXILIAR]])","v":6},413500,"CAMBIOS"]
[{"$f":"LEN(PUC[[#This Row],[AUXILIAR]])","v":6},413525,"POR REEXPRESION DE ACTIV.DE LA POS.PROP."]
[{"$f":"LEN(PUC[[#This Row],[AUXILIAR]])","v":6},413530,"POR REALIZACION DE ACTIV.DE LA POS.PROPI"]
[{"$f":"LEN(PUC[[#This Row],[AUXILIAR]])","v":6},413535,"POR REEXPRESION DE OTROS ACTIVOS"]
[{"$f":"LEN(PUC[[#This Row],[AUXILIAR]])","v":6},413540,"POR REALIZACION DE OTROS ACTIVOS"]
[{"$f":"LEN(PUC[[#This Row],[AUXILIAR]])","v":6},413545,"POR REEXPRESION DE PASIV.DE LA POS.PROP."]
[{"$f":"LEN(PUC[[#This Row],[AUXILIAR]])","v":6},413550,"POR LIQUIDACION DE PASIV.DE LA POS.PROP."]
[{"$f":"LEN(PUC[[#This Row],[AUXILIAR]])","v":6},413555,"POR REEXPRESION DE OTROS PASIVOS"]
[{"$f":"LEN(PUC[[#This Row],[AUXILIAR]])","v":6},413560,"POR LIQUIDACION DE OTROS PASIVOS"]
[{"$f":"LEN(PUC[[#This Row],[AUXILIAR]])","v":6},413700,"UTILIDAD EN LA VENTA DE DERIVADOS - DE E"]
[{"$f":"LEN(PUC[[#This Row],[AUXILIAR]])","v":6},413705,"FORWARDS DE COMPRA DE MONEDAS (PESODÓLA"]
[{"$f":"LEN(PUC[[#This Row],[AUXILIAR]])","v":6},413706,"FORWARDS DE VENTA DE MONEDAS (PESODÓLAR"]
[{"$f":"LEN(PUC[[#This Row],[AUXILIAR]])","v":6},413707,"FORWARDS DE COMPRA DE MONEDAS (DIFERENTE"]
[{"$f":"LEN(PUC[[#This Row],[AUXILIAR]])","v":6},413708,"FORWARDS DE VENTA DE MONEDAS (DIFERENTES"]
[{"$f":"LEN(PUC[[#This Row],[AUXILIAR]])","v":6},413710,"FORWARDS SOBRE TASAS DE INTERÉS"]
[{"$f":"LEN(PUC[[#This Row],[AUXILIAR]])","v":6},413715,"FORWARDS DE COMPRA DE TÍTULOS"]
[{"$f":"LEN(PUC[[#This Row],[AUXILIAR]])","v":6},413716,"FORWARDS DE VENTA DE TÍTULOS"]
[{"$f":"LEN(PUC[[#This Row],[AUXILIAR]])","v":6},413720,"FORWARDS - OTROS"]
[{"$f":"LEN(PUC[[#This Row],[AUXILIAR]])","v":6},413725,"FUTUROS DE COMPRA DE MONEDAS"]
[{"$f":"LEN(PUC[[#This Row],[AUXILIAR]])","v":6},413726,"FUTUROS DE VENTA DE MONEDAS"]
[{"$f":"LEN(PUC[[#This Row],[AUXILIAR]])","v":6},413730,"FUTUROS SOBRE TASAS DE INTERÉS"]
[{"$f":"LEN(PUC[[#This Row],[AUXILIAR]])","v":6},413735,"FUTUROS DE COMPRA DE TÍTULOS"]
[{"$f":"LEN(PUC[[#This Row],[AUXILIAR]])","v":6},413736,"FUTUROS DE VENTA DE TÍTULOS"]
[{"$f":"LEN(PUC[[#This Row],[AUXILIAR]])","v":6},413737,"FUTUROS DE COMPRA DE ÍNDICES"]
[{"$f":"LEN(PUC[[#This Row],[AUXILIAR]])","v":6},413738,"FUTUROS DE VENTA DE ÍNDICES"]
[{"$f":"LEN(PUC[[#This Row],[AUXILIAR]])","v":6},413740,"FUTUROS - OTROS"]
[{"$f":"LEN(PUC[[#This Row],[AUXILIAR]])","v":6},413745,"SWAPS DE MONEDAS"]
[{"$f":"LEN(PUC[[#This Row],[AUXILIAR]])","v":6},413750,"SWAPS DE TASAS DE INTERÉS"]
[{"$f":"LEN(PUC[[#This Row],[AUXILIAR]])","v":6},413755,"SWAPS - OTROS"]
[{"$f":"LEN(PUC[[#This Row],[AUXILIAR]])","v":6},413760,"COMPRA DE OPCIONES CALLS SOBRE MONEDAS"]
[{"$f":"LEN(PUC[[#This Row],[AUXILIAR]])","v":6},413761,"COMPRA DE OPCIONES PUTS DE MONEDAS"]
[{"$f":"LEN(PUC[[#This Row],[AUXILIAR]])","v":6},413763,"EMISIONES O VENTAS DE OPCIONES CALL SOBR"]
[{"$f":"LEN(PUC[[#This Row],[AUXILIAR]])","v":6},413764,"EMISIONES O VENTA DE OPCIONES PUT SOBRE "]
[{"$f":"LEN(PUC[[#This Row],[AUXILIAR]])","v":6},413765,"COMPRA DE OPCIONES CALLS SOBRE TASAS DE "]
[{"$f":"LEN(PUC[[#This Row],[AUXILIAR]])","v":6},413766,"COMPRA DE OPCIONES PUTS SOBRE TASAS DE I"]
[{"$f":"LEN(PUC[[#This Row],[AUXILIAR]])","v":6},413768,"EMISIONES O VENTAS DE OPCIONES CALL SOBR"]
[{"$f":"LEN(PUC[[#This Row],[AUXILIAR]])","v":6},413769,"EMISIONES O VENTAS DE OPCIONES PUT SOBRE"]
[{"$f":"LEN(PUC[[#This Row],[AUXILIAR]])","v":6},413770,"COMPRAS DE OPCIONES CALLS SOBRE TÍTULOS"]
[{"$f":"LEN(PUC[[#This Row],[AUXILIAR]])","v":6},413771,"COMPRAS DE OPCIONES PUTS SOBRE TÍTULOS"]
[{"$f":"LEN(PUC[[#This Row],[AUXILIAR]])","v":6},413773,"EMISIONES O VENTAS DE OPCIONES CALL SOBR"]
[{"$f":"LEN(PUC[[#This Row],[AUXILIAR]])","v":6},413774,"EMISIONES O VENTAS DE OPCIONES PUT SOBRE"]
[{"$f":"LEN(PUC[[#This Row],[AUXILIAR]])","v":6},413775,"COMPRA DE OPCIONES CALLS - OTROS"]
[{"$f":"LEN(PUC[[#This Row],[AUXILIAR]])","v":6},413776,"EMISIONES O VENTAS DE OPCIONES CALL - OT"]
[{"$f":"LEN(PUC[[#This Row],[AUXILIAR]])","v":6},413778,"COMPRAS DE OPCIONES CALL SOBRE ÍNDICES"]
[{"$f":"LEN(PUC[[#This Row],[AUXILIAR]])","v":6},413779,"EMISIONES O VENTAS DE OPCIONES CALL SOBR"]
[{"$f":"LEN(PUC[[#This Row],[AUXILIAR]])","v":6},413780,"COMPRAS DE OPCIONES PUT SOBRE ÍNDICES"]
[{"$f":"LEN(PUC[[#This Row],[AUXILIAR]])","v":6},413781,"EMISIONES O VENTAS DE OPCIONES PUT SOBRE"]
[{"$f":"LEN(PUC[[#This Row],[AUXILIAR]])","v":6},413785,"COMPRA DE OPCIONES PUTS ¿ OTRAS"]
[{"$f":"LEN(PUC[[#This Row],[AUXILIAR]])","v":6},413790,"EMISIONES O VENTAS DE OPCIONES PUTS - OT"]
[{"$f":"LEN(PUC[[#This Row],[AUXILIAR]])","v":6},413800,"UTILIDAD EN LA VENTA DE DERIVADOS - DE C"]
[{"$f":"LEN(PUC[[#This Row],[AUXILIAR]])","v":6},413805,"FORWARDS DE COMPRA DE MONEDAS (PESODÓLA"]
[{"$f":"LEN(PUC[[#This Row],[AUXILIAR]])","v":6},413806,"FORWARDS DE VENTA DE MONEDAS (PESODÓLAR"]
[{"$f":"LEN(PUC[[#This Row],[AUXILIAR]])","v":6},413807,"FORWARDS DE COMPRA DE MONEDAS (DIFERENTE"]
[{"$f":"LEN(PUC[[#This Row],[AUXILIAR]])","v":6},413808,"FORWARDS DE VENTA DE MONEDAS (DIFERENTES"]
[{"$f":"LEN(PUC[[#This Row],[AUXILIAR]])","v":6},413810,"FORWARDS SOBRE TASAS DE INTERÉS"]
[{"$f":"LEN(PUC[[#This Row],[AUXILIAR]])","v":6},413815,"FORWARDS DE COMPRA DE TÍTULOS"]
[{"$f":"LEN(PUC[[#This Row],[AUXILIAR]])","v":6},413816,"FORWARDS DE VENTA DE TÍTULOS"]
[{"$f":"LEN(PUC[[#This Row],[AUXILIAR]])","v":6},413820,"FORWARDS - OTROS"]
[{"$f":"LEN(PUC[[#This Row],[AUXILIAR]])","v":6},413825,"FUTUROS DE COMPRA DE MONEDAS"]
[{"$f":"LEN(PUC[[#This Row],[AUXILIAR]])","v":6},413826,"FUTUROS DE VENTA DE MONEDAS"]
[{"$f":"LEN(PUC[[#This Row],[AUXILIAR]])","v":6},413830,"FUTUROS SOBRE TASAS DE INTERÉS"]
[{"$f":"LEN(PUC[[#This Row],[AUXILIAR]])","v":6},413835,"FUTUROS DE COMPRA DE TÍTULOS"]
[{"$f":"LEN(PUC[[#This Row],[AUXILIAR]])","v":6},413836,"FUTUROS DE VENTA DE TÍTULOS"]
[{"$f":"LEN(PUC[[#This Row],[AUXILIAR]])","v":6},413837,"FUTUROS DE COMPRA DE ÍNDICES"]
[{"$f":"LEN(PUC[[#This Row],[AUXILIAR]])","v":6},413838,"FUTUROS DE VENTA DE ÍNDICES"]
[{"$f":"LEN(PUC[[#This Row],[AUXILIAR]])","v":6},413840,"FUTUROS - OTROS"]
[{"$f":"LEN(PUC[[#This Row],[AUXILIAR]])","v":6},413845,"SWAPS DE MONEDAS"]
[{"$f":"LEN(PUC[[#This Row],[AUXILIAR]])","v":6},413850,"SWAPS DE TASAS DE INTERÉS"]
[{"$f":"LEN(PUC[[#This Row],[AUXILIAR]])","v":6},413855,"SWAPS - OTROS"]
[{"$f":"LEN(PUC[[#This Row],[AUXILIAR]])","v":6},413860,"COMPRA DE OPCIONES CALLS SOBRE MONEDAS"]
[{"$f":"LEN(PUC[[#This Row],[AUXILIAR]])","v":6},413861,"COMPRA DE OPCIONES PUTS DE MONEDAS"]
[{"$f":"LEN(PUC[[#This Row],[AUXILIAR]])","v":6},413863,"EMISIONES O VENTAS DE OPCIONES CALL SOBR"]
[{"$f":"LEN(PUC[[#This Row],[AUXILIAR]])","v":6},413864,"EMISIONES O VENTA DE OPCIONES PUT SOBRE "]
[{"$f":"LEN(PUC[[#This Row],[AUXILIAR]])","v":6},413865,"COMPRA DE OPCIONES CALLS SOBRE TASAS DE "]
[{"$f":"LEN(PUC[[#This Row],[AUXILIAR]])","v":6},413866,"COMPRA DE OPCIONES PUTS SOBRE TASAS DE I"]
[{"$f":"LEN(PUC[[#This Row],[AUXILIAR]])","v":6},413868,"EMISIONES O VENTAS DE OPCIONES CALL SOBR"]
[{"$f":"LEN(PUC[[#This Row],[AUXILIAR]])","v":6},413869,"EMISIONES O VENTAS DE OPCIONES PUT SOBRE"]
[{"$f":"LEN(PUC[[#This Row],[AUXILIAR]])","v":6},413870,"COMPRAS DE OPCIONES CALLS SOBRE TÍTULOS"]
[{"$f":"LEN(PUC[[#This Row],[AUXILIAR]])","v":6},413871,"COMPRAS DE OPCIONES PUTS SOBRE TÍTULOS"]
[{"$f":"LEN(PUC[[#This Row],[AUXILIAR]])","v":6},413873,"EMISIONES O VENTAS DE OPCIONES CALL SOBR"]
[{"$f":"LEN(PUC[[#This Row],[AUXILIAR]])","v":6},413874,"EMISIONES O VENTAS DE OPCIONES PUT SOBRE"]
[{"$f":"LEN(PUC[[#This Row],[AUXILIAR]])","v":6},413875,"COMPRA DE OPCIONES CALLS - OTROS"]
[{"$f":"LEN(PUC[[#This Row],[AUXILIAR]])","v":6},413876,"EMISIONES O VENTAS DE OPCIONES CALL - OT"]
[{"$f":"LEN(PUC[[#This Row],[AUXILIAR]])","v":6},413878,"COMPRAS DE OPCIONES CALL SOBRE ÍNDICES"]
[{"$f":"LEN(PUC[[#This Row],[AUXILIAR]])","v":6},413879,"EMISIONES O VENTAS DE OPCIONES CALL SOBR"]
[{"$f":"LEN(PUC[[#This Row],[AUXILIAR]])","v":6},413880,"COMPRAS DE OPCIONES PUT SOBRE ÍNDICES"]
[{"$f":"LEN(PUC[[#This Row],[AUXILIAR]])","v":6},413881,"EMISIONES O VENTAS DE OPCIONES PUT SOBRE"]
[{"$f":"LEN(PUC[[#This Row],[AUXILIAR]])","v":6},413885,"COMPRA DE OPCIONES PUTS ¿ OTRAS"]
[{"$f":"LEN(PUC[[#This Row],[AUXILIAR]])","v":6},413890,"EMISIONES O VENTAS DE OPCIONES PUTS - OT"]
[{"$f":"LEN(PUC[[#This Row],[AUXILIAR]])","v":6},413900,"UTILIDAD EN LA VALORACION DE DERIVADOS -"]
[{"$f":"LEN(PUC[[#This Row],[AUXILIAR]])","v":6},413905,"FORWARDS DE COMPRA DE MONEDAS (PESODÓLA"]
[{"$f":"LEN(PUC[[#This Row],[AUXILIAR]])","v":6},413906,"FORWARDS DE VENTA DE MONEDAS (PESODÓLAR"]
[{"$f":"LEN(PUC[[#This Row],[AUXILIAR]])","v":6},413907,"FORWARDS DE COMPRA DE MONEDAS (DIFERENTE"]
[{"$f":"LEN(PUC[[#This Row],[AUXILIAR]])","v":6},413908,"FORWARDS DE VENTA DE MONEDAS (DIFERENTES"]
[{"$f":"LEN(PUC[[#This Row],[AUXILIAR]])","v":6},413910,"FORWARDS SOBRE TASAS DE INTERÉS"]
[{"$f":"LEN(PUC[[#This Row],[AUXILIAR]])","v":6},413915,"FORWARDS DE COMPRA DE TÍTULOS"]
[{"$f":"LEN(PUC[[#This Row],[AUXILIAR]])","v":6},413916,"FORWARDS DE VENTA DE TÍTULOS"]
[{"$f":"LEN(PUC[[#This Row],[AUXILIAR]])","v":6},413920,"FORWARDS - OTROS"]
[{"$f":"LEN(PUC[[#This Row],[AUXILIAR]])","v":6},413925,"FUTUROS DE COMPRA DE MONEDAS"]
[{"$f":"LEN(PUC[[#This Row],[AUXILIAR]])","v":6},413926,"FUTUROS DE VENTA DE MONEDAS"]
[{"$f":"LEN(PUC[[#This Row],[AUXILIAR]])","v":6},413930,"FUTUROS SOBRE TASAS DE INTERÉS"]
[{"$f":"LEN(PUC[[#This Row],[AUXILIAR]])","v":6},413935,"FUTUROS DE COMPRA DE TÍTULOS"]
[{"$f":"LEN(PUC[[#This Row],[AUXILIAR]])","v":6},413936,"FUTUROS DE VENTA DE TÍTULOS"]
[{"$f":"LEN(PUC[[#This Row],[AUXILIAR]])","v":6},413937,"FUTUROS DE COMPRA DE ÍNDICES"]
[{"$f":"LEN(PUC[[#This Row],[AUXILIAR]])","v":6},413938,"FUTUROS DE VENTA DE ÍNDICES"]
[{"$f":"LEN(PUC[[#This Row],[AUXILIAR]])","v":6},413940,"FUTUROS - OTROS"]
[{"$f":"LEN(PUC[[#This Row],[AUXILIAR]])","v":6},413945,"SWAPS DE MONEDAS"]
[{"$f":"LEN(PUC[[#This Row],[AUXILIAR]])","v":6},413950,"SWAPS DE TASAS DE INTERÉS"]
[{"$f":"LEN(PUC[[#This Row],[AUXILIAR]])","v":6},413955,"SWAPS - OTROS"]
[{"$f":"LEN(PUC[[#This Row],[AUXILIAR]])","v":6},413960,"COMPRA DE OPCIONES CALLS SOBRE MONEDAS"]
[{"$f":"LEN(PUC[[#This Row],[AUXILIAR]])","v":6},413961,"COMPRA DE OPCIONES PUTS DE MONEDAS"]
[{"$f":"LEN(PUC[[#This Row],[AUXILIAR]])","v":6},413963,"EMISIONES O VENTAS DE OPCIONES CALL SOBR"]
[{"$f":"LEN(PUC[[#This Row],[AUXILIAR]])","v":6},413964,"EMISIONES O VENTA DE OPCIONES PUT SOBRE "]
[{"$f":"LEN(PUC[[#This Row],[AUXILIAR]])","v":6},413965,"COMPRA DE OPCIONES CALLS SOBRE TASAS DE "]
[{"$f":"LEN(PUC[[#This Row],[AUXILIAR]])","v":6},413966,"COMPRA DE OPCIONES PUTS SOBRE TASAS DE I"]
[{"$f":"LEN(PUC[[#This Row],[AUXILIAR]])","v":6},413968,"EMISIONES O VENTAS DE OPCIONES CALL SOBR"]
[{"$f":"LEN(PUC[[#This Row],[AUXILIAR]])","v":6},413969,"EMISIONES O VENTAS DE OPCIONES PUT SOBRE"]
[{"$f":"LEN(PUC[[#This Row],[AUXILIAR]])","v":6},413970,"COMPRAS DE OPCIONES CALLS SOBRE TÍTULOS"]
[{"$f":"LEN(PUC[[#This Row],[AUXILIAR]])","v":6},413971,"COMPRAS DE OPCIONES PUTS SOBRE TÍTULOS"]
[{"$f":"LEN(PUC[[#This Row],[AUXILIAR]])","v":6},413973,"EMISIONES O VENTAS DE OPCIONES CALL SOBR"]
[{"$f":"LEN(PUC[[#This Row],[AUXILIAR]])","v":6},413974,"EMISIONES O VENTAS DE OPCIONES PUT SOBRE"]
[{"$f":"LEN(PUC[[#This Row],[AUXILIAR]])","v":6},413975,"COMPRA DE OPCIONES CALLS - OTROS"]
[{"$f":"LEN(PUC[[#This Row],[AUXILIAR]])","v":6},413976,"EMISIONES O VENTAS DE OPCIONES CALL - OT"]
[{"$f":"LEN(PUC[[#This Row],[AUXILIAR]])","v":6},413978,"COMPRAS DE OPCIONES CALL SOBRE ÍNDICES"]
[{"$f":"LEN(PUC[[#This Row],[AUXILIAR]])","v":6},413979,"EMISIONES O VENTAS DE OPCIONES CALL SOBR"]
[{"$f":"LEN(PUC[[#This Row],[AUXILIAR]])","v":6},413980,"COMPRAS DE OPCIONES PUT SOBRE ÍNDICES"]
[{"$f":"LEN(PUC[[#This Row],[AUXILIAR]])","v":6},413981,"EMISIONES O VENTAS DE OPCIONES PUT SOBRE"]
[{"$f":"LEN(PUC[[#This Row],[AUXILIAR]])","v":6},413985,"COMPRA DE OPCIONES PUTS ¿ OTRAS"]
[{"$f":"LEN(PUC[[#This Row],[AUXILIAR]])","v":6},413990,"EMISIONES O VENTAS DE OPCIONES PUTS - OT"]
[{"$f":"LEN(PUC[[#This Row],[AUXILIAR]])","v":6},414000,"DIVIDENDOS Y PARTICIPACIONES"]
[{"$f":"LEN(PUC[[#This Row],[AUXILIAR]])","v":6},414005,"MATRIZ,FILIALES,SUBSIDIARIAS"]
[{"$f":"LEN(PUC[[#This Row],[AUXILIAR]])","v":6},414010,"OTRAS PERSONAS JURIDICAS"]
[{"$f":"LEN(PUC[[#This Row],[AUXILIAR]])","v":6},414500,"ARRENDAMIENTOS"]
[{"$f":"LEN(PUC[[#This Row],[AUXILIAR]])","v":6},414505,"CAJILLAS DE SEGURIDAD"]
[{"$f":"LEN(PUC[[#This Row],[AUXILIAR]])","v":6},414510,"Medios de Pago"]
[{"$f":"LEN(PUC[[#This Row],[AUXILIAR]])","v":6},415000,"DESCUENTO  DE PROVEEDORES"]
[{"$f":"LEN(PUC[[#This Row],[AUXILIAR]])","v":6},415005,"EN ADQUISICION DE MERCANCIAS"]
[{"$f":"LEN(PUC[[#This Row],[AUXILIAR]])","v":6},415010,"EN FINANCIACION POR COMPRA DE MERCA"]
[{"$f":"LEN(PUC[[#This Row],[AUXILIAR]])","v":6},416000,"RECUPERACIONES OPERACIONALES"]
[{"$f":"LEN(PUC[[#This Row],[AUXILIAR]])","v":6},416008,"REINTEGRO PROV CUENTAS POR COBRAR"]
[{"$f":"LEN(PUC[[#This Row],[AUXILIAR]])","v":6},416009,"REINTEGRO PROV CARTERA DE CREDITOS"]
[{"$f":"LEN(PUC[[#This Row],[AUXILIAR]])","v":6},416011,"REINTEGRO PROV OPERAC LEASING FINANCIERO"]
[{"$f":"LEN(PUC[[#This Row],[AUXILIAR]])","v":6},416012,"REINTEGRO PROV OPERAC LEASING OPERATIVO"]
[{"$f":"LEN(PUC[[#This Row],[AUXILIAR]])","v":6},416015,"REINTEGRO PROV DE SEGUROS DE DEPOSITOS"]
[{"$f":"LEN(PUC[[#This Row],[AUXILIAR]])","v":6},416020,"REINTEGRO PROV DE CAPITAL GARANTIA"]
[{"$f":"LEN(PUC[[#This Row],[AUXILIAR]])","v":6},416035,"REINTEGRO PROV COMPONENTE INDIV CONTRACI"]
[{"$f":"LEN(PUC[[#This Row],[AUXILIAR]])","v":6},416040,"REINT PROV  IND CONTRA LEAS OPER CONSUMO"]
[{"$f":"LEN(PUC[[#This Row],[AUXILIAR]])","v":6},416045,"REINT PROV  IND CONTRA LEAS OPER COMERC"]
[{"$f":"LEN(PUC[[#This Row],[AUXILIAR]])","v":6},416050,"REINT PROV  IND CONTRA LEAS OPER COMERC"]
[{"$f":"LEN(PUC[[#This Row],[AUXILIAR]])","v":6},416055,"REINT PROV CONTRA LEASING HABITACIONAL"]
[{"$f":"LEN(PUC[[#This Row],[AUXILIAR]])","v":6},416060,"REINTEGRO PROV COMPONENTE INDIV CONTRACI"]
[{"$f":"LEN(PUC[[#This Row],[AUXILIAR]])","v":6},416500,"PRIMA"]
[{"$f":"LEN(PUC[[#This Row],[AUXILIAR]])","v":6},416505,"SEGURO DE DEPOSITOS"]
[{"$f":"LEN(PUC[[#This Row],[AUXILIAR]])","v":6},416510,"COSTO DE GARANTIA"]
[{"$f":"LEN(PUC[[#This Row],[AUXILIAR]])","v":6},417000,"INSCRIPCION DE ENTIDADES"]
[{"$f":"LEN(PUC[[#This Row],[AUXILIAR]])","v":6},417005,"SEGURO DE DEPOSITOS"]
[{"$f":"LEN(PUC[[#This Row],[AUXILIAR]])","v":6},417010,"COSTO DE GARANTIA"]
[{"$f":"LEN(PUC[[#This Row],[AUXILIAR]])","v":6},417200,"OPERACIONES DE APOYO Y TRANSFERENCIAS"]
[{"$f":"LEN(PUC[[#This Row],[AUXILIAR]])","v":6},417205,"OPERACIONES DE APOYO"]
[{"$f":"LEN(PUC[[#This Row],[AUXILIAR]])","v":6},417210,"TRANSFERENCIAS DE LA NACION"]
[{"$f":"LEN(PUC[[#This Row],[AUXILIAR]])","v":6},419000,"RECUPERACIONES RIESGO OPERATIVO"]
[{"$f":"LEN(PUC[[#This Row],[AUXILIAR]])","v":6},419005,"RECUPERACIONES POR SEGURO-RIESGO OPERATI"]
[{"$f":"LEN(PUC[[#This Row],[AUXILIAR]])","v":6},419010,"RECUPERACIONES DIFERENTES A SEGUROS-RIES"]
[{"$f":"LEN(PUC[[#This Row],[AUXILIAR]])","v":6},419400,"OPERACIONES FONDOS GANADEROS"]
[{"$f":"LEN(PUC[[#This Row],[AUXILIAR]])","v":6},419405,"VENTA DE SEMOVIENTES EN PARTICIPACION"]
[{"$f":"LEN(PUC[[#This Row],[AUXILIAR]])","v":6},419410,"VENTA DE SEMOVIENTES ADMON DIRECTA"]
[{"$f":"LEN(PUC[[#This Row],[AUXILIAR]])","v":6},419415,"VENTA DE SEMOVIENTES DE SERVICIO"]
[{"$f":"LEN(PUC[[#This Row],[AUXILIAR]])","v":6},419420,"VENTA DE INSUMOS AGROPECUARIOS"]
[{"$f":"LEN(PUC[[#This Row],[AUXILIAR]])","v":6},419425,"VENTA DE PRODUCTOS CONEXOS"]
[{"$f":"LEN(PUC[[#This Row],[AUXILIAR]])","v":6},419430,"SERVICIOS AGRICOLAS Y GANADEROS"]
[{"$f":"LEN(PUC[[#This Row],[AUXILIAR]])","v":6},419435,"ACTIVIDADES DE FOMENTO"]
[{"$f":"LEN(PUC[[#This Row],[AUXILIAR]])","v":6},419495,"OTROS"]
[{"$f":"LEN(PUC[[#This Row],[AUXILIAR]])","v":6},419500,"DIVERSOS"]
[{"$f":"LEN(PUC[[#This Row],[AUXILIAR]])","v":6},419505,"VENTAS DE CHEQUERAS"]
[{"$f":"LEN(PUC[[#This Row],[AUXILIAR]])","v":6},419510,"INFORMACION COMERCIAL"]
[{"$f":"LEN(PUC[[#This Row],[AUXILIAR]])","v":6},419515,"CABLES, PORTES, TELEFONO"]
[{"$f":"LEN(PUC[[#This Row],[AUXILIAR]])","v":6},419520,"CLAUSULA PENAL"]
[{"$f":"LEN(PUC[[#This Row],[AUXILIAR]])","v":6},419530,"Contribuciones"]
[{"$f":"LEN(PUC[[#This Row],[AUXILIAR]])","v":6},419545,"INGRESOS OPERAC CONSORCIOS O UNI TEMP"]
[{"$f":"LEN(PUC[[#This Row],[AUXILIAR]])","v":6},419595,"OTROS"]
[{"$f":"LEN(PUC[[#This Row],[AUXILIAR]])","v":6},419600,"INGRESOS OPERACIONALES LEASING"]
[{"$f":"LEN(PUC[[#This Row],[AUXILIAR]])","v":6},419620,"COMP FINANC LEAS FINANC CONSUMO"]
[{"$f":"LEN(PUC[[#This Row],[AUXILIAR]])","v":6},419622,"COMP FINANC LEAS FINANC COMERCIAL"]
[{"$f":"LEN(PUC[[#This Row],[AUXILIAR]])","v":6},419624,"COMP FINANC LEAS FINANC MICROCREDITO"]
[{"$f":"LEN(PUC[[#This Row],[AUXILIAR]])","v":6},419626,"COMP FINANCIERO LEASING HABITACIONAL"]
[{"$f":"LEN(PUC[[#This Row],[AUXILIAR]])","v":6},419628,"CANONES ARRENDAMIENTO LEASING OPERATIVO"]
[{"$f":"LEN(PUC[[#This Row],[AUXILIAR]])","v":6},419630,"UTILIDAD EN VENTA DE ACTIVOS LEAS FINANC"]
[{"$f":"LEN(PUC[[#This Row],[AUXILIAR]])","v":6},419632,"UTILIDAD EN VENTA ACTIVOS LEAS FINANCIER"]
[{"$f":"LEN(PUC[[#This Row],[AUXILIAR]])","v":6},419634,"SANCIONES X INCUM CONTRAT LEAS FINANCIER"]
[{"$f":"LEN(PUC[[#This Row],[AUXILIAR]])","v":6},419636,"SANCIONES X INCUM CONTRAT LEAS OPERATIVO"]
[{"$f":"LEN(PUC[[#This Row],[AUXILIAR]])","v":6},419700,"CTAS  REPORTE INGRESOS OPER.-SECC.ESPEC."]
[{"$f":"LEN(PUC[[#This Row],[AUXILIAR]])","v":6},419705,"SECCION DE SEGUROS"]
[{"$f":"LEN(PUC[[#This Row],[AUXILIAR]])","v":6},419710,"AREAS COMERCIALES"]
[{"$f":"LEN(PUC[[#This Row],[AUXILIAR]])","v":6},419800,"CTAS  REPORTE INGRESOS OPER.-SECC.ESPEC."]
[{"$f":"LEN(PUC[[#This Row],[AUXILIAR]])","v":6},419805,"SECCION VALOR CONSTANTE"]
[{"$f":"LEN(PUC[[#This Row],[AUXILIAR]])","v":6},419810,"SECCION TRADICIONAL"]
[{"$f":"LEN(PUC[[#This Row],[AUXILIAR]])","v":6},420000,"NO OPERACIONALES"]
[{"$f":"LEN(PUC[[#This Row],[AUXILIAR]])","v":6},420500,"UTIL VTA BIENES RECIB PAGO Y RESTITUIDOS"]
[{"$f":"LEN(PUC[[#This Row],[AUXILIAR]])","v":6},420505,"BIENES INMUEBLES"]
[{"$f":"LEN(PUC[[#This Row],[AUXILIAR]])","v":6},420510,"BIENES MUEBLES"]
[{"$f":"LEN(PUC[[#This Row],[AUXILIAR]])","v":6},421000,"UTILIDAD EN VENTA DE PROPIEDADES Y EQ."]
[{"$f":"LEN(PUC[[#This Row],[AUXILIAR]])","v":6},421005,"TERRENOS"]
[{"$f":"LEN(PUC[[#This Row],[AUXILIAR]])","v":6},421010,"EDIFICIOS"]
[{"$f":"LEN(PUC[[#This Row],[AUXILIAR]])","v":6},421015,"EQUIPOS, MUEBLES Y ENSERES DE OFICI"]
[{"$f":"LEN(PUC[[#This Row],[AUXILIAR]])","v":6},421020,"EQUIPOS DE COMPUTACION"]
[{"$f":"LEN(PUC[[#This Row],[AUXILIAR]])","v":6},421025,"VEHICULOS"]
[{"$f":"LEN(PUC[[#This Row],[AUXILIAR]])","v":6},421030,"EQUIPOS DE MOVILIZACION Y MAQUINARI"]
[{"$f":"LEN(PUC[[#This Row],[AUXILIAR]])","v":6},421035,"SILOS"]
[{"$f":"LEN(PUC[[#This Row],[AUXILIAR]])","v":6},421040,"BODEGAS"]
[{"$f":"LEN(PUC[[#This Row],[AUXILIAR]])","v":6},421045,"BIENES RURALES"]
[{"$f":"LEN(PUC[[#This Row],[AUXILIAR]])","v":6},421050,"SEMOVIENTES"]
[{"$f":"LEN(PUC[[#This Row],[AUXILIAR]])","v":6},421500,"UTILIDAD EN VENTA DE OTROS ACTIVOS"]
[{"$f":"LEN(PUC[[#This Row],[AUXILIAR]])","v":6},421506,"APORTES PERMANENTES"]
[{"$f":"LEN(PUC[[#This Row],[AUXILIAR]])","v":6},421510,"BIENES DE ARTE Y CULTURA"]
[{"$f":"LEN(PUC[[#This Row],[AUXILIAR]])","v":6},422000,"ARRENDAMIENTOS"]
[{"$f":"LEN(PUC[[#This Row],[AUXILIAR]])","v":6},422005,"BIENES PROPIOS"]
[{"$f":"LEN(PUC[[#This Row],[AUXILIAR]])","v":6},422010,"BIENES ADJUDICADOS"]
[{"$f":"LEN(PUC[[#This Row],[AUXILIAR]])","v":6},422500,"RECUPERACIONES"]
[{"$f":"LEN(PUC[[#This Row],[AUXILIAR]])","v":6},422505,"BIENES CASTIGADOS"]
[{"$f":"LEN(PUC[[#This Row],[AUXILIAR]])","v":6},422506,"REINTEGRO PROVISIONES PROPIEDADES Y"]
[{"$f":"LEN(PUC[[#This Row],[AUXILIAR]])","v":6},422507,"REINT PROV BIENES REALIZ REC PAGO Y REST"]
[{"$f":"LEN(PUC[[#This Row],[AUXILIAR]])","v":6},422512,"REINTEGRO PROVISIONES DE INVERSIONE"]
[{"$f":"LEN(PUC[[#This Row],[AUXILIAR]])","v":6},422513,"REINTEGRO OTRAS PROVISIONES"]
[{"$f":"LEN(PUC[[#This Row],[AUXILIAR]])","v":6},422514,"REINTEGRO PROVISIONES OTROS ACTIVOS"]
[{"$f":"LEN(PUC[[#This Row],[AUXILIAR]])","v":6},422515,"DEVOLUCIONES"]
[{"$f":"LEN(PUC[[#This Row],[AUXILIAR]])","v":6},422517,"REINT.PROVIS. PARA PROTECCION SEMOV"]
[{"$f":"LEN(PUC[[#This Row],[AUXILIAR]])","v":6},422530,"RECUPERACIONES POR SINIESTROS"]
[{"$f":"LEN(PUC[[#This Row],[AUXILIAR]])","v":6},422595,"OTRAS RECUPERACIONES"]
[{"$f":"LEN(PUC[[#This Row],[AUXILIAR]])","v":6},425000,"APLICACION DE RESERVAS TECNICAS"]
[{"$f":"LEN(PUC[[#This Row],[AUXILIAR]])","v":6},429500,"DIVERSOS"]
[{"$f":"LEN(PUC[[#This Row],[AUXILIAR]])","v":6},429510,"INGRESOS BIENES RECIB PAGO Y RESTITUIDOS"]
[{"$f":"LEN(PUC[[#This Row],[AUXILIAR]])","v":6},429545,"INGRESOS NO OPERAC CONSORC O UNI TEMP"]
[{"$f":"LEN(PUC[[#This Row],[AUXILIAR]])","v":6},429550,"AMORT DEF CTO INV SOBRE VLOR EN LIBROS"]
[{"$f":"LEN(PUC[[#This Row],[AUXILIAR]])","v":6},429555,"INTERES MINORITARIO"]
[{"$f":"LEN(PUC[[#This Row],[AUXILIAR]])","v":6},429580,"AMORTIZACION CREDITO MERCANTIL"]
[{"$f":"LEN(PUC[[#This Row],[AUXILIAR]])","v":6},429595,"OTROS"]
[{"$f":"LEN(PUC[[#This Row],[AUXILIAR]])","v":6},429700,"CTAS REPORTE INGRESOS NO OPER-SECC.ESPEC"]
[{"$f":"LEN(PUC[[#This Row],[AUXILIAR]])","v":6},429705,"SECCION DE SEGUROS"]
[{"$f":"LEN(PUC[[#This Row],[AUXILIAR]])","v":6},429710,"AREAS COMERCIALES"]
[{"$f":"LEN(PUC[[#This Row],[AUXILIAR]])","v":6},429800,"CTAS REPORTE INGRESOS NO OPER-SECC.ESPEC"]
[{"$f":"LEN(PUC[[#This Row],[AUXILIAR]])","v":6},429805,"SECCION VALOR CONSTANTE"]
[{"$f":"LEN(PUC[[#This Row],[AUXILIAR]])","v":6},429810,"SECCION TRADICIONAL"]
[{"$f":"LEN(PUC[[#This Row],[AUXILIAR]])","v":6},430000,"INGRESOS COMPENSADOS"]
[{"$f":"LEN(PUC[[#This Row],[AUXILIAR]])","v":6},430500,"INGRESOS COMPENSADOS"]
[{"$f":"LEN(PUC[[#This Row],[AUXILIAR]])","v":6},500000,"GASTOS Y COSTOS"]
[{"$f":"LEN(PUC[[#This Row],[AUXILIAR]])","v":6},510000,"OPERACIONALES"]
[{"$f":"LEN(PUC[[#This Row],[AUXILIAR]])","v":6},510200,"INTERESES DEPOSITOS Y EXIGIBILIDADE"]
[{"$f":"LEN(PUC[[#This Row],[AUXILIAR]])","v":6},510202,"DEPOSITOS DE AHORRO ORDINARIO"]
[{"$f":"LEN(PUC[[#This Row],[AUXILIAR]])","v":6},510203,"DEPOSITOS DE AHORRO DE VALOR CONSTA"]
[{"$f":"LEN(PUC[[#This Row],[AUXILIAR]])","v":6},510204,"CERTIFICADOS DE AHORRO A TERMINO"]
[{"$f":"LEN(PUC[[#This Row],[AUXILIAR]])","v":6},510205,"CDT O EMITIDOS A MENOS DE 6 MESES"]
[{"$f":"LEN(PUC[[#This Row],[AUXILIAR]])","v":6},510206,"CDT O EMITIDOS = A 6 MESES Y < A 12"]
[{"$f":"LEN(PUC[[#This Row],[AUXILIAR]])","v":6},510207,"CDT O EMITIDOS = O SUPERIOR A 12 ME"]
[{"$f":"LEN(PUC[[#This Row],[AUXILIAR]])","v":6},510250,"PERDIDA DE PODER ADQUISITIVO-CESANTIAS"]
[{"$f":"LEN(PUC[[#This Row],[AUXILIAR]])","v":6},510260,"INTERESES DOCEAVAS PARTES ESTIMADAS"]
[{"$f":"LEN(PUC[[#This Row],[AUXILIAR]])","v":6},510295,"OTROS INTERESES"]
[{"$f":"LEN(PUC[[#This Row],[AUXILIAR]])","v":6},510297,"RIESGO OPERATIVO"]
[{"$f":"LEN(PUC[[#This Row],[AUXILIAR]])","v":6},510300,"INTERESES CRED.DE BCOS Y OTRAS OBLI"]
[{"$f":"LEN(PUC[[#This Row],[AUXILIAR]])","v":6},510302,"CRED.ORD.Y EXTRAORD.BCO DE LA REPUB"]
[{"$f":"LEN(PUC[[#This Row],[AUXILIAR]])","v":6},510303,"REDESCUENTOS BANCO DE LA REPUBLICA"]
[{"$f":"LEN(PUC[[#This Row],[AUXILIAR]])","v":6},510304,"REDESCUENTOS OTRAS ENTIDADES"]
[{"$f":"LEN(PUC[[#This Row],[AUXILIAR]])","v":6},510305,"BCOS DEL EXTER.Y LINEAS DE REDESCTO"]
[{"$f":"LEN(PUC[[#This Row],[AUXILIAR]])","v":6},510310,"MORATORIOS"]
[{"$f":"LEN(PUC[[#This Row],[AUXILIAR]])","v":6},510395,"OTROS CREDITOS"]
[{"$f":"LEN(PUC[[#This Row],[AUXILIAR]])","v":6},510397,"RIESGO OPERATIVO"]
[{"$f":"LEN(PUC[[#This Row],[AUXILIAR]])","v":6},510400,"RENDIMIENTOS EN OPERACIONES REPO, SIMULT"]
[{"$f":"LEN(PUC[[#This Row],[AUXILIAR]])","v":6},510402,"FONDOS INTERBANCARIOS COMPRADOS ORD"]
[{"$f":"LEN(PUC[[#This Row],[AUXILIAR]])","v":6},510406,"PRIMA AMORTIZADA DE CARTERA"]
[{"$f":"LEN(PUC[[#This Row],[AUXILIAR]])","v":6},510407,"INTERESES Y AMORTIZAC. DESCTO TIT.D"]
[{"$f":"LEN(PUC[[#This Row],[AUXILIAR]])","v":6},510408,"INTERESES Y AMORTIZACION DESCUENTO "]
[{"$f":"LEN(PUC[[#This Row],[AUXILIAR]])","v":6},510421,"RENDIMIENTOS POR COMPROMISOS DE TRANSFER"]
[{"$f":"LEN(PUC[[#This Row],[AUXILIAR]])","v":6},510423,"RENDIMIENTOS POR COMPROMISOS DE TRANSFER"]
[{"$f":"LEN(PUC[[#This Row],[AUXILIAR]])","v":6},510424,"POR COMPROMISOS EN OPERACIONES DE TRANSF"]
[{"$f":"LEN(PUC[[#This Row],[AUXILIAR]])","v":6},510435,"DIFERENCIAL DE TASAS"]
[{"$f":"LEN(PUC[[#This Row],[AUXILIAR]])","v":6},510450,"APORTE CONTRACTUAL POR LA EJEC PROYECTOS"]
[{"$f":"LEN(PUC[[#This Row],[AUXILIAR]])","v":6},510480,"INTERESES DEVENGADOS A FAVOR DE FOGAFIN"]
[{"$f":"LEN(PUC[[#This Row],[AUXILIAR]])","v":6},510490,"PERD x PARTICIP EN LA FORMACISN DEL IBR"]
[{"$f":"LEN(PUC[[#This Row],[AUXILIAR]])","v":6},510495,"OTROS INTERESES"]
[{"$f":"LEN(PUC[[#This Row],[AUXILIAR]])","v":6},510497,"RIESGO OPERATIVO"]
[{"$f":"LEN(PUC[[#This Row],[AUXILIAR]])","v":6},510600,"PERDIDA VLORACION INV NEG TIT DEUDA"]
[{"$f":"LEN(PUC[[#This Row],[AUXILIAR]])","v":6},510800,"PERDIDA VLORAC INV NEG EN TIT PARTICIPAT"]
[{"$f":"LEN(PUC[[#This Row],[AUXILIAR]])","v":6},510900,"PERDIDA VLORAC INV DISP XA VTA TIT DEUDA"]
[{"$f":"LEN(PUC[[#This Row],[AUXILIAR]])","v":6},511000,"REAJUSTE UNIDAD VLOR REAL UVR"]
[{"$f":"LEN(PUC[[#This Row],[AUXILIAR]])","v":6},511005,"CUENTAS DE AHORRO DE VALOR CONSTANT"]
[{"$f":"LEN(PUC[[#This Row],[AUXILIAR]])","v":6},511011,"CERTIF.DE AHO.DE VALOR CONST.HASTA 6M"]
[{"$f":"LEN(PUC[[#This Row],[AUXILIAR]])","v":6},511012,"CERTIF.DE AHO.DE VAL.CONST.ENT.6 Y 12M."]
[{"$f":"LEN(PUC[[#This Row],[AUXILIAR]])","v":6},511013,"CERTIF.DE AHO.DE VALOR CONST.+ DE 12MES."]
[{"$f":"LEN(PUC[[#This Row],[AUXILIAR]])","v":6},511015,"CREDITOS"]
[{"$f":"LEN(PUC[[#This Row],[AUXILIAR]])","v":6},511020,"BONOS DE FOMENTO URBANO"]
[{"$f":"LEN(PUC[[#This Row],[AUXILIAR]])","v":6},511025,"BONOS GARANTIA GENERAL"]
[{"$f":"LEN(PUC[[#This Row],[AUXILIAR]])","v":6},511095,"OTROS"]
[{"$f":"LEN(PUC[[#This Row],[AUXILIAR]])","v":6},511100,"PERDIDA VLORAC INV XA MANT HASTA VENC"]
[{"$f":"LEN(PUC[[#This Row],[AUXILIAR]])","v":6},511200,"PERDIDA VALORACION DE CARRUSELES"]
[{"$f":"LEN(PUC[[#This Row],[AUXILIAR]])","v":6},511205,"POR COMPROMISOS DE COMPRA"]
[{"$f":"LEN(PUC[[#This Row],[AUXILIAR]])","v":6},511210,"POR COMPROMISOS DE VENTA"]
[{"$f":"LEN(PUC[[#This Row],[AUXILIAR]])","v":6},511500,"COMISIONES"]
[{"$f":"LEN(PUC[[#This Row],[AUXILIAR]])","v":6},511505,"ACEPTACIONES BANCARIAS"]
[{"$f":"LEN(PUC[[#This Row],[AUXILIAR]])","v":6},511510,"CARTAS DE CREDITO"]
[{"$f":"LEN(PUC[[#This Row],[AUXILIAR]])","v":6},511515,"AVALES"]
[{"$f":"LEN(PUC[[#This Row],[AUXILIAR]])","v":6},511520,"SERVICIOS BANCARIOS"]
[{"$f":"LEN(PUC[[#This Row],[AUXILIAR]])","v":6},511525,"GARANTIAS BANCARIAS"]
[{"$f":"LEN(PUC[[#This Row],[AUXILIAR]])","v":6},511530,"NEGOCIOS FIDUCIARIOS"]
[{"$f":"LEN(PUC[[#This Row],[AUXILIAR]])","v":6},511543,"SERVICIO RED DE OFICINAS"]
[{"$f":"LEN(PUC[[#This Row],[AUXILIAR]])","v":6},511555,"POR AFILIACIONES AL FONDO DE CESANTIA"]
[{"$f":"LEN(PUC[[#This Row],[AUXILIAR]])","v":6},511563,"POR AFILIACIONES A LOS FONDOS DE PENSION"]
[{"$f":"LEN(PUC[[#This Row],[AUXILIAR]])","v":6},511565,"SERV. DE PROCESAM. DE INFORM. A LOS OPER"]
[{"$f":"LEN(PUC[[#This Row],[AUXILIAR]])","v":6},511566,"SERV. DE RECAUD. DE APORT. A INSTIT. FIN"]
[{"$f":"LEN(PUC[[#This Row],[AUXILIAR]])","v":6},511575,"POR PRODUCTOS DERIVADOS"]
[{"$f":"LEN(PUC[[#This Row],[AUXILIAR]])","v":6},511580,"COMISIONES POR GARANTIAS"]
[{"$f":"LEN(PUC[[#This Row],[AUXILIAR]])","v":6},511593,"PRECIO POR TRANSF TEMPORAL DE VALORES"]
[{"$f":"LEN(PUC[[#This Row],[AUXILIAR]])","v":6},511595,"OTROS SERVICIOS"]
[{"$f":"LEN(PUC[[#This Row],[AUXILIAR]])","v":6},511597,"RIESGO OPERATIVO"]
[{"$f":"LEN(PUC[[#This Row],[AUXILIAR]])","v":6},511600,"PERDIDA REALIZ INV DISP XA LA VTA"]
[{"$f":"LEN(PUC[[#This Row],[AUXILIAR]])","v":6},511605,"TITULOS DE DEUDA"]
[{"$f":"LEN(PUC[[#This Row],[AUXILIAR]])","v":6},511610,"TIT PARTICIPATIVOS ALTA O MEDIA BURSATIL"]
[{"$f":"LEN(PUC[[#This Row],[AUXILIAR]])","v":6},511615,"TIT PARTICIPATIVOS O MIXTOS PROC TITULAR"]
[{"$f":"LEN(PUC[[#This Row],[AUXILIAR]])","v":6},511620,"EN TRANSFER TEMPORAL DE VALORES"]
[{"$f":"LEN(PUC[[#This Row],[AUXILIAR]])","v":6},511697,"RIESGO OPERATIVO"]
[{"$f":"LEN(PUC[[#This Row],[AUXILIAR]])","v":6},511700,"GASTOS POR RETROGARANTES"]
[{"$f":"LEN(PUC[[#This Row],[AUXILIAR]])","v":6},511705,"GASTOS POR RETROGARANTES"]
[{"$f":"LEN(PUC[[#This Row],[AUXILIAR]])","v":6},511797,"RIESGO OPERATIVO"]
[{"$f":"LEN(PUC[[#This Row],[AUXILIAR]])","v":6},512000,"GASTOS DE PERSONAL"]
[{"$f":"LEN(PUC[[#This Row],[AUXILIAR]])","v":6},512003,"SALARIO INTEGRAL"]
[{"$f":"LEN(PUC[[#This Row],[AUXILIAR]])","v":6},512005,"SUELDOS"]
[{"$f":"LEN(PUC[[#This Row],[AUXILIAR]])","v":6},512010,"HORAS EXTRAS"]
[{"$f":"LEN(PUC[[#This Row],[AUXILIAR]])","v":6},512015,"AUXILIO DE TRANSPORTE"]
[{"$f":"LEN(PUC[[#This Row],[AUXILIAR]])","v":6},512020,"SUBSIDIO DE ALIMENTACION"]
[{"$f":"LEN(PUC[[#This Row],[AUXILIAR]])","v":6},512025,"CESANTIAS"]
[{"$f":"LEN(PUC[[#This Row],[AUXILIAR]])","v":6},512030,"INTERESES SOBRE CESANTIAS"]
[{"$f":"LEN(PUC[[#This Row],[AUXILIAR]])","v":6},512035,"PRIMA LEGAL"]
[{"$f":"LEN(PUC[[#This Row],[AUXILIAR]])","v":6},512040,"PRIMA EXTRALEGAL"]
[{"$f":"LEN(PUC[[#This Row],[AUXILIAR]])","v":6},512045,"VACACIONES"]
[{"$f":"LEN(PUC[[#This Row],[AUXILIAR]])","v":6},512050,"PRIMA DE VACACIONES"]
[{"$f":"LEN(PUC[[#This Row],[AUXILIAR]])","v":6},512055,"PRIMA DE ANTIGUEDAD"]
[{"$f":"LEN(PUC[[#This Row],[AUXILIAR]])","v":6},512060,"PENSIONES DE JUBILACION"]
[{"$f":"LEN(PUC[[#This Row],[AUXILIAR]])","v":6},512065,"OTRAS PRESTACIONES SOCIALES"]
[{"$f":"LEN(PUC[[#This Row],[AUXILIAR]])","v":6},512070,"BONIFICACIONES"]
[{"$f":"LEN(PUC[[#This Row],[AUXILIAR]])","v":6},512075,"INDEMNIZACIONES"]
[{"$f":"LEN(PUC[[#This Row],[AUXILIAR]])","v":6},512080,"VIATICOS"]
[{"$f":"LEN(PUC[[#This Row],[AUXILIAR]])","v":6},512085,"APORTES I.S.S."]
[{"$f":"LEN(PUC[[#This Row],[AUXILIAR]])","v":6},512090,"APORTES CAJA COMPEN.FAMILIAR ICBF Y SENA"]
[{"$f":"LEN(PUC[[#This Row],[AUXILIAR]])","v":6},512092,"APOR.CAJA COMP,ICBF Y SENA-SALARIO INTG."]
[{"$f":"LEN(PUC[[#This Row],[AUXILIAR]])","v":6},512095,"OTROS APORTES"]
[{"$f":"LEN(PUC[[#This Row],[AUXILIAR]])","v":6},512096,"AUXILIOS AL PERSONAL"]
[{"$f":"LEN(PUC[[#This Row],[AUXILIAR]])","v":6},512097,"RIESGO OPERATIVO"]
[{"$f":"LEN(PUC[[#This Row],[AUXILIAR]])","v":6},512200,"SERVICIOS DE ALMACENADORAS"]
[{"$f":"LEN(PUC[[#This Row],[AUXILIAR]])","v":6},512205,"SERVICIOS DE ALMACENAJES"]
[{"$f":"LEN(PUC[[#This Row],[AUXILIAR]])","v":6},512295,"OTROS"]
[{"$f":"LEN(PUC[[#This Row],[AUXILIAR]])","v":6},512297,"RIESGO OPERATIVO"]
[{"$f":"LEN(PUC[[#This Row],[AUXILIAR]])","v":6},512300,"PIRDIDA EN POSICIONES EN CORTO DE OPERAC"]
[{"$f":"LEN(PUC[[#This Row],[AUXILIAR]])","v":6},512305,"OPERACIONES REPO"]
[{"$f":"LEN(PUC[[#This Row],[AUXILIAR]])","v":6},512310,"OPERACIONES SIMULTANEAS"]
[{"$f":"LEN(PUC[[#This Row],[AUXILIAR]])","v":6},512315,"OPERACIONES DE TRANSFERENCIA TEMPORAL DE"]
[{"$f":"LEN(PUC[[#This Row],[AUXILIAR]])","v":6},512500,"PERDIDA EN VENTA DE INVERSIONES"]
[{"$f":"LEN(PUC[[#This Row],[AUXILIAR]])","v":6},512504,"NEGOCIABLES EN TITULOS DE DEUDA"]
[{"$f":"LEN(PUC[[#This Row],[AUXILIAR]])","v":6},512506,"NEGOCIABLES EN TITULOS PARTICIPATIVOS"]
[{"$f":"LEN(PUC[[#This Row],[AUXILIAR]])","v":6},512507,"XA MANTENER HASTA EL VENCIMIENTO"]
[{"$f":"LEN(PUC[[#This Row],[AUXILIAR]])","v":6},512509,"DISPON XA VTA EN TITULOS DE DEUDA"]
[{"$f":"LEN(PUC[[#This Row],[AUXILIAR]])","v":6},512511,"DISPON XA VTA EN TITULOS PARTICIPATIVOS"]
[{"$f":"LEN(PUC[[#This Row],[AUXILIAR]])","v":6},512597,"RIESGO OPERATIVO"]
[{"$f":"LEN(PUC[[#This Row],[AUXILIAR]])","v":6},512700,"PERDIDA EN VENTA DE CARTERA"]
[{"$f":"LEN(PUC[[#This Row],[AUXILIAR]])","v":6},512705,"PERDIDA EN VENTA DE CARTERA"]
[{"$f":"LEN(PUC[[#This Row],[AUXILIAR]])","v":6},512797,"RIESGO OPERATIVO"]
[{"$f":"LEN(PUC[[#This Row],[AUXILIAR]])","v":6},512800,"PERDIDA VALORAC OPERAC CONTADO"]
[{"$f":"LEN(PUC[[#This Row],[AUXILIAR]])","v":6},512805,"CONTRATOS COMPRA DIVISAS"]
[{"$f":"LEN(PUC[[#This Row],[AUXILIAR]])","v":6},512806,"CONTRATOS VENTA DIVISAS"]
[{"$f":"LEN(PUC[[#This Row],[AUXILIAR]])","v":6},512815,"CONTRATOS COMPRA TITULOS"]
[{"$f":"LEN(PUC[[#This Row],[AUXILIAR]])","v":6},512816,"CONTRATOS VENTA TITULOS"]
[{"$f":"LEN(PUC[[#This Row],[AUXILIAR]])","v":6},512820,"CONTRATOS OTROS"]
[{"$f":"LEN(PUC[[#This Row],[AUXILIAR]])","v":6},512900,"PÉRDIDA EN LA VALORACION DE DERIVADOS ¿ "]
[{"$f":"LEN(PUC[[#This Row],[AUXILIAR]])","v":6},512905,"FORWARDS DE COMPRA DE MONEDAS (PESODÓLA"]
[{"$f":"LEN(PUC[[#This Row],[AUXILIAR]])","v":6},512906,"FORWARDS DE VENTA DE MONEDAS (PESODÓLAR"]
[{"$f":"LEN(PUC[[#This Row],[AUXILIAR]])","v":6},512907,"FORWARDS DE COMPRA DE MONEDAS (DIFERENTE"]
[{"$f":"LEN(PUC[[#This Row],[AUXILIAR]])","v":6},512908,"FORWARDS DE VENTA DE MONEDAS (DIFERENTES"]
[{"$f":"LEN(PUC[[#This Row],[AUXILIAR]])","v":6},512910,"FORWARDS SOBRE TASAS DE INTERÉS"]
[{"$f":"LEN(PUC[[#This Row],[AUXILIAR]])","v":6},512915,"FORWARDS DE COMPRA DE TÍTULOS"]
[{"$f":"LEN(PUC[[#This Row],[AUXILIAR]])","v":6},512916,"FORWARDS DE VENTA DE TÍTULOS"]
[{"$f":"LEN(PUC[[#This Row],[AUXILIAR]])","v":6},512920,"FORWARDS - OTROS"]
[{"$f":"LEN(PUC[[#This Row],[AUXILIAR]])","v":6},512925,"FUTUROS DE COMPRA DE MONEDAS"]
[{"$f":"LEN(PUC[[#This Row],[AUXILIAR]])","v":6},512926,"FUTUROS DE VENTA DE MONEDAS"]
[{"$f":"LEN(PUC[[#This Row],[AUXILIAR]])","v":6},512930,"FUTUROS SOBRE TASAS DE INTERÉS"]
[{"$f":"LEN(PUC[[#This Row],[AUXILIAR]])","v":6},512935,"FUTUROS DE COMPRA DE TÍTULOS"]
[{"$f":"LEN(PUC[[#This Row],[AUXILIAR]])","v":6},512936,"FUTUROS DE VENTA DE TÍTULOS"]
[{"$f":"LEN(PUC[[#This Row],[AUXILIAR]])","v":6},512937,"FUTUROS DE COMPRA DE ÍNDICES"]
[{"$f":"LEN(PUC[[#This Row],[AUXILIAR]])","v":6},512938,"FUTUROS DE VENTA DE ÍNDICES"]
[{"$f":"LEN(PUC[[#This Row],[AUXILIAR]])","v":6},512940,"FUTUROS - OTROS"]
[{"$f":"LEN(PUC[[#This Row],[AUXILIAR]])","v":6},512945,"SWAPS DE MONEDAS"]
[{"$f":"LEN(PUC[[#This Row],[AUXILIAR]])","v":6},512950,"SWAPS DE TASAS DE INTERÉS"]
[{"$f":"LEN(PUC[[#This Row],[AUXILIAR]])","v":6},512955,"SWAPS - OTROS"]
[{"$f":"LEN(PUC[[#This Row],[AUXILIAR]])","v":6},512960,"COMPRA DE OPCIONES CALLS SOBRE MONEDAS"]
[{"$f":"LEN(PUC[[#This Row],[AUXILIAR]])","v":6},512961,"COMPRA DE OPCIONES PUTS DE MONEDAS"]
[{"$f":"LEN(PUC[[#This Row],[AUXILIAR]])","v":6},512963,"EMISIONES O VENTAS DE OPCIONES CALL SOBR"]
[{"$f":"LEN(PUC[[#This Row],[AUXILIAR]])","v":6},512964,"EMISIONES O VENTA DE OPCIONES PUT SOBRE "]
[{"$f":"LEN(PUC[[#This Row],[AUXILIAR]])","v":6},512965,"COMPRA DE OPCIONES CALLS SOBRE TASAS DE "]
[{"$f":"LEN(PUC[[#This Row],[AUXILIAR]])","v":6},512966,"COMPRA DE OPCIONES PUTS SOBRE TASAS DE I"]
[{"$f":"LEN(PUC[[#This Row],[AUXILIAR]])","v":6},512968,"EMISIONES O VENTAS DE OPCIONES CALL SOBR"]
[{"$f":"LEN(PUC[[#This Row],[AUXILIAR]])","v":6},512969,"EMISIONES O VENTAS DE OPCIONES PUT SOBRE"]
[{"$f":"LEN(PUC[[#This Row],[AUXILIAR]])","v":6},512970,"COMPRAS DE OPCIONES CALLS SOBRE TÍTULOS"]
[{"$f":"LEN(PUC[[#This Row],[AUXILIAR]])","v":6},512971,"COMPRAS DE OPCIONES PUTS SOBRE TÍTULOS"]
[{"$f":"LEN(PUC[[#This Row],[AUXILIAR]])","v":6},512973,"EMISIONES O VENTAS DE OPCIONES CALL SOBR"]
[{"$f":"LEN(PUC[[#This Row],[AUXILIAR]])","v":6},512974,"EMISIONES O VENTAS DE OPCIONES PUT SOBRE"]
[{"$f":"LEN(PUC[[#This Row],[AUXILIAR]])","v":6},512975,"COMPRA DE OPCIONES CALLS - OTROS"]
[{"$f":"LEN(PUC[[#This Row],[AUXILIAR]])","v":6},512976,"EMISIONES O VENTAS DE OPCIONES CALL - OT"]
[{"$f":"LEN(PUC[[#This Row],[AUXILIAR]])","v":6},512978,"COMPRAS DE OPCIONES CALL SOBRE ÍNDICES"]
[{"$f":"LEN(PUC[[#This Row],[AUXILIAR]])","v":6},512979,"EMISIONES O VENTAS DE OPCIONES CALL SOBR"]
[{"$f":"LEN(PUC[[#This Row],[AUXILIAR]])","v":6},512980,"COMPRAS DE OPCIONES PUT SOBRE ÍNDICES"]
[{"$f":"LEN(PUC[[#This Row],[AUXILIAR]])","v":6},512981,"EMISIONES O VENTAS DE OPCIONES PUT SOBRE"]
[{"$f":"LEN(PUC[[#This Row],[AUXILIAR]])","v":6},512985,"COMPRA DE OPCIONES PUTS ¿ OTRAS"]
[{"$f":"LEN(PUC[[#This Row],[AUXILIAR]])","v":6},512990,"EMISIONES O VENTAS DE OPCIONES PUTS ¿ OT"]
[{"$f":"LEN(PUC[[#This Row],[AUXILIAR]])","v":6},513000,"HONORARIOS"]
[{"$f":"LEN(PUC[[#This Row],[AUXILIAR]])","v":6},513005,"JUNTA DIRECTIVA"]
[{"$f":"LEN(PUC[[#This Row],[AUXILIAR]])","v":6},513010,"REVISORIA FISCAL Y AUDITORIA EXTERNA"]
[{"$f":"LEN(PUC[[#This Row],[AUXILIAR]])","v":6},513015,"AVALUOS"]
[{"$f":"LEN(PUC[[#This Row],[AUXILIAR]])","v":6},513020,"ASESORIAS JURIDICAS"]
[{"$f":"LEN(PUC[[#This Row],[AUXILIAR]])","v":6},513025,"ASESORIAS FINANCIERAS"]
[{"$f":"LEN(PUC[[#This Row],[AUXILIAR]])","v":6},513030,"NEGOCIOS FIDUCIARIOS"]
[{"$f":"LEN(PUC[[#This Row],[AUXILIAR]])","v":6},513095,"OTROS"]
[{"$f":"LEN(PUC[[#This Row],[AUXILIAR]])","v":6},513097,"RIESGO OPERATIVO"]
[{"$f":"LEN(PUC[[#This Row],[AUXILIAR]])","v":6},513500,"CAMBIOS"]
[{"$f":"LEN(PUC[[#This Row],[AUXILIAR]])","v":6},513525,"POR REEXPRES.DE PASIVOS DE LA POSIC"]
[{"$f":"LEN(PUC[[#This Row],[AUXILIAR]])","v":6},513530,"POR LIQUIDAC.DE PASIVOS DE LA POSIC.PROP"]
[{"$f":"LEN(PUC[[#This Row],[AUXILIAR]])","v":6},513535,"POR REEXPRES.DE OTROS PASIVOS"]
[{"$f":"LEN(PUC[[#This Row],[AUXILIAR]])","v":6},513540,"POR LIQUIDAC.DE OTROS PASIVOS"]
[{"$f":"LEN(PUC[[#This Row],[AUXILIAR]])","v":6},513545,"POR REEXPRES.DE ACTIVOS DE LA POSIC"]
[{"$f":"LEN(PUC[[#This Row],[AUXILIAR]])","v":6},513550,"POR REALIZAC.DE ACTIVOS DE LA POSIC"]
[{"$f":"LEN(PUC[[#This Row],[AUXILIAR]])","v":6},513555,"POR REEXPRES.DE OTROS ACTIVOS"]
[{"$f":"LEN(PUC[[#This Row],[AUXILIAR]])","v":6},513560,"POR REALIZAC.DE OTROS ACTIVOS"]
[{"$f":"LEN(PUC[[#This Row],[AUXILIAR]])","v":6},513700,"PÉRDIDA EN LA VENTA DE DERIVADOS - DE ES"]
[{"$f":"LEN(PUC[[#This Row],[AUXILIAR]])","v":6},513705,"FORWARDS DE COMPRA DE MONEDAS (PESODÓLA"]
[{"$f":"LEN(PUC[[#This Row],[AUXILIAR]])","v":6},513706,"FORWARDS DE VENTA DE MONEDAS (PESODÓLAR"]
[{"$f":"LEN(PUC[[#This Row],[AUXILIAR]])","v":6},513707,"FORWARDS DE COMPRA DE MONEDAS (DIFERENTE"]
[{"$f":"LEN(PUC[[#This Row],[AUXILIAR]])","v":6},513708,"FORWARDS DE VENTA DE MONEDAS (DIFERENTES"]
[{"$f":"LEN(PUC[[#This Row],[AUXILIAR]])","v":6},513710,"FORWARDS SOBRE TASAS DE INTERÉS"]
[{"$f":"LEN(PUC[[#This Row],[AUXILIAR]])","v":6},513715,"FORWARDS DE COMPRA DE TÍTULOS"]
[{"$f":"LEN(PUC[[#This Row],[AUXILIAR]])","v":6},513716,"FORWARDS DE VENTA DE TÍTULOS"]
[{"$f":"LEN(PUC[[#This Row],[AUXILIAR]])","v":6},513720,"FORWARDS - OTROS"]
[{"$f":"LEN(PUC[[#This Row],[AUXILIAR]])","v":6},513725,"FUTUROS DE COMPRA DE MONEDAS"]
[{"$f":"LEN(PUC[[#This Row],[AUXILIAR]])","v":6},513726,"FUTUROS DE VENTA DE MONEDAS"]
[{"$f":"LEN(PUC[[#This Row],[AUXILIAR]])","v":6},513730,"FUTUROS SOBRE TASAS DE INTERÉS"]
[{"$f":"LEN(PUC[[#This Row],[AUXILIAR]])","v":6},513735,"FUTUROS DE COMPRA DE TÍTULOS"]
[{"$f":"LEN(PUC[[#This Row],[AUXILIAR]])","v":6},513736,"FUTUROS DE VENTA DE TÍTULOS"]
[{"$f":"LEN(PUC[[#This Row],[AUXILIAR]])","v":6},513737,"FUTUROS DE COMPRA DE ÍNDICES"]
[{"$f":"LEN(PUC[[#This Row],[AUXILIAR]])","v":6},513738,"FUTUROS DE VENTA DE ÍNDICES"]
[{"$f":"LEN(PUC[[#This Row],[AUXILIAR]])","v":6},513740,"FUTUROS - OTROS"]
[{"$f":"LEN(PUC[[#This Row],[AUXILIAR]])","v":6},513745,"SWAPS DE MONEDAS"]
[{"$f":"LEN(PUC[[#This Row],[AUXILIAR]])","v":6},513750,"SWAPS DE TASAS DE INTERÉS"]
[{"$f":"LEN(PUC[[#This Row],[AUXILIAR]])","v":6},513755,"SWAPS - OTROS"]
[{"$f":"LEN(PUC[[#This Row],[AUXILIAR]])","v":6},513760,"COMPRA DE OPCIONES CALLS SOBRE MONEDAS"]
[{"$f":"LEN(PUC[[#This Row],[AUXILIAR]])","v":6},513761,"COMPRA DE OPCIONES PUTS DE MONEDAS"]
[{"$f":"LEN(PUC[[#This Row],[AUXILIAR]])","v":6},513763,"EMISIONES O VENTAS DE OPCIONES CALL SOBR"]
[{"$f":"LEN(PUC[[#This Row],[AUXILIAR]])","v":6},513764,"EMISIONES O VENTA DE OPCIONES PUT SOBRE "]
[{"$f":"LEN(PUC[[#This Row],[AUXILIAR]])","v":6},513765,"COMPRA DE OPCIONES CALLS SOBRE TASAS DE "]
[{"$f":"LEN(PUC[[#This Row],[AUXILIAR]])","v":6},513766,"COMPRA DE OPCIONES PUTS SOBRE TASAS DE I"]
[{"$f":"LEN(PUC[[#This Row],[AUXILIAR]])","v":6},513768,"EMISIONES O VENTAS DE OPCIONES CALL SOBR"]
[{"$f":"LEN(PUC[[#This Row],[AUXILIAR]])","v":6},513769,"EMISIONES O VENTAS DE OPCIONES PUT SOBRE"]
[{"$f":"LEN(PUC[[#This Row],[AUXILIAR]])","v":6},513770,"COMPRAS DE OPCIONES CALLS SOBRE TÍTULOS"]
[{"$f":"LEN(PUC[[#This Row],[AUXILIAR]])","v":6},513771,"COMPRAS DE OPCIONES PUTS SOBRE TÍTULOS"]
[{"$f":"LEN(PUC[[#This Row],[AUXILIAR]])","v":6},513773,"EMISIONES O VENTAS DE OPCIONES CALL SOBR"]
[{"$f":"LEN(PUC[[#This Row],[AUXILIAR]])","v":6},513774,"EMISIONES O VENTAS DE OPCIONES PUT SOBRE"]
[{"$f":"LEN(PUC[[#This Row],[AUXILIAR]])","v":6},513775,"COMPRA DE OPCIONES CALLS - OTROS"]
[{"$f":"LEN(PUC[[#This Row],[AUXILIAR]])","v":6},513776,"EMISIONES O VENTAS DE OPCIONES CALL - OT"]
[{"$f":"LEN(PUC[[#This Row],[AUXILIAR]])","v":6},513778,"COMPRAS DE OPCIONES CALL SOBRE ÍNDICES"]
[{"$f":"LEN(PUC[[#This Row],[AUXILIAR]])","v":6},513779,"EMISIONES O VENTAS DE OPCIONES CALL SOBR"]
[{"$f":"LEN(PUC[[#This Row],[AUXILIAR]])","v":6},513780,"COMPRAS DE OPCIONES PUT SOBRE ÍNDICES"]
[{"$f":"LEN(PUC[[#This Row],[AUXILIAR]])","v":6},513781,"EMISIONES O VENTAS DE OPCIONES PUTS SOBR"]
[{"$f":"LEN(PUC[[#This Row],[AUXILIAR]])","v":6},513785,"COMPRA DE OPCIONES PUTS ¿ OTRAS"]
[{"$f":"LEN(PUC[[#This Row],[AUXILIAR]])","v":6},513790,"EMISIONES O VENTAS DE OPCIONES PUTS - OT"]
[{"$f":"LEN(PUC[[#This Row],[AUXILIAR]])","v":6},513800,"PÉRDIDA EN LA VENTA DE DERIVADOS - DE CO"]
[{"$f":"LEN(PUC[[#This Row],[AUXILIAR]])","v":6},513805,"FORWARDS DE COMPRA DE MONEDAS (PESODÓLA"]
[{"$f":"LEN(PUC[[#This Row],[AUXILIAR]])","v":6},513806,"FORWARDS DE VENTA DE MONEDAS (PESODÓLAR"]
[{"$f":"LEN(PUC[[#This Row],[AUXILIAR]])","v":6},513807,"FORWARDS DE COMPRA DE MONEDAS (DIFERENTE"]
[{"$f":"LEN(PUC[[#This Row],[AUXILIAR]])","v":6},513808,"FORWARDS DE VENTA DE MONEDAS (DIFERENTES"]
[{"$f":"LEN(PUC[[#This Row],[AUXILIAR]])","v":6},513810,"FORWARDS SOBRE TASAS DE INTERÉS"]
[{"$f":"LEN(PUC[[#This Row],[AUXILIAR]])","v":6},513815,"FORWARDS DE COMPRA DE TÍTULOS"]
[{"$f":"LEN(PUC[[#This Row],[AUXILIAR]])","v":6},513816,"FORWARDS DE VENTA DE TÍTULOS"]
[{"$f":"LEN(PUC[[#This Row],[AUXILIAR]])","v":6},513820,"FORWARDS - OTROS"]
[{"$f":"LEN(PUC[[#This Row],[AUXILIAR]])","v":6},513825,"FUTUROS DE COMPRA DE MONEDAS"]
[{"$f":"LEN(PUC[[#This Row],[AUXILIAR]])","v":6},513826,"FUTUROS DE VENTA DE MONEDAS"]
[{"$f":"LEN(PUC[[#This Row],[AUXILIAR]])","v":6},513830,"FUTUROS SOBRE TASAS DE INTERÉS"]
[{"$f":"LEN(PUC[[#This Row],[AUXILIAR]])","v":6},513835,"FUTUROS DE COMPRA DE TÍTULOS"]
[{"$f":"LEN(PUC[[#This Row],[AUXILIAR]])","v":6},513836,"FUTUROS DE VENTA DE TÍTULOS"]
[{"$f":"LEN(PUC[[#This Row],[AUXILIAR]])","v":6},513837,"FUTUROS DE COMPRA DE ÍNDICES"]
[{"$f":"LEN(PUC[[#This Row],[AUXILIAR]])","v":6},513838,"FUTUROS DE VENTA DE ÍNDICES"]
[{"$f":"LEN(PUC[[#This Row],[AUXILIAR]])","v":6},513840,"FUTUROS - OTROS"]
[{"$f":"LEN(PUC[[#This Row],[AUXILIAR]])","v":6},513845,"SWAPS DE MONEDAS"]
[{"$f":"LEN(PUC[[#This Row],[AUXILIAR]])","v":6},513850,"SWAPS DE TASAS DE INTERÉS"]
[{"$f":"LEN(PUC[[#This Row],[AUXILIAR]])","v":6},513855,"SWAPS - OTROS"]
[{"$f":"LEN(PUC[[#This Row],[AUXILIAR]])","v":6},513860,"COMPRA DE OPCIONES CALLS SOBRE MONEDAS"]
[{"$f":"LEN(PUC[[#This Row],[AUXILIAR]])","v":6},513861,"COMPRA DE OPCIONES PUTS DE MONEDAS"]
[{"$f":"LEN(PUC[[#This Row],[AUXILIAR]])","v":6},513863,"EMISIONES O VENTAS DE OPCIONES CALL SOBR"]
[{"$f":"LEN(PUC[[#This Row],[AUXILIAR]])","v":6},513864,"EMISIONES O VENTA DE OPCIONES PUT SOBRE "]
[{"$f":"LEN(PUC[[#This Row],[AUXILIAR]])","v":6},513865,"COMPRA DE OPCIONES CALLS SOBRE TASAS DE "]
[{"$f":"LEN(PUC[[#This Row],[AUXILIAR]])","v":6},513866,"COMPRA DE OPCIONES PUTS SOBRE TASAS DE I"]
[{"$f":"LEN(PUC[[#This Row],[AUXILIAR]])","v":6},513868,"EMISIONES O VENTAS DE OIPCIONES CALL SOB"]
[{"$f":"LEN(PUC[[#This Row],[AUXILIAR]])","v":6},513869,"EMISIONES O VENTAS DE OPCIONES PUT SOBRE"]
[{"$f":"LEN(PUC[[#This Row],[AUXILIAR]])","v":6},513870,"COMPRAS DE OPCIONES CALLS SOBRE TÍTULOS"]
[{"$f":"LEN(PUC[[#This Row],[AUXILIAR]])","v":6},513871,"COMPRAS DE OPCIONES PUTS SOBRE TÍTULOS"]
[{"$f":"LEN(PUC[[#This Row],[AUXILIAR]])","v":6},513873,"EMISIONES O VENTAS DE OPCIONES CALL SOBR"]
[{"$f":"LEN(PUC[[#This Row],[AUXILIAR]])","v":6},513874,"EMISIONES O VENTAS DE OPCIONES PUT SOBRE"]
[{"$f":"LEN(PUC[[#This Row],[AUXILIAR]])","v":6},513875,"COMPRA DE OPCIONES CALLS - OTROS"]
[{"$f":"LEN(PUC[[#This Row],[AUXILIAR]])","v":6},513876,"EMISIONES O VENTAS DE OPCIONES CALL - OT"]
[{"$f":"LEN(PUC[[#This Row],[AUXILIAR]])","v":6},513878,"COMPRAS DE OPCIONES CALL SOBRE ÍNDICES"]
[{"$f":"LEN(PUC[[#This Row],[AUXILIAR]])","v":6},513879,"EMISIONES O VENTAS DE OPCIONES CALL SOBR"]
[{"$f":"LEN(PUC[[#This Row],[AUXILIAR]])","v":6},513880,"COMPRAS DE OPCIONES PUT SOBRE ÍNDICES"]
[{"$f":"LEN(PUC[[#This Row],[AUXILIAR]])","v":6},513881,"EMISIONES O VENTAS DE OPCIONES PUT SOBRE"]
[{"$f":"LEN(PUC[[#This Row],[AUXILIAR]])","v":6},513885,"COMPRA DE OPCIONES PUTS ¿ OTRAS"]
[{"$f":"LEN(PUC[[#This Row],[AUXILIAR]])","v":6},513890,"EMISIONES O VENTAS DE OPCIONES PUTS - OT"]
[{"$f":"LEN(PUC[[#This Row],[AUXILIAR]])","v":6},513900,"PÉRDIDA EN LA VALORACION DE DERIVADOS ¿ "]
[{"$f":"LEN(PUC[[#This Row],[AUXILIAR]])","v":6},513905,"FORWARDS DE COMPRA DE MONEDAS (PESODÓLA"]
[{"$f":"LEN(PUC[[#This Row],[AUXILIAR]])","v":6},513906,"FORWARDS DE VENTA DE MONEDAS (PESODÓLAR"]
[{"$f":"LEN(PUC[[#This Row],[AUXILIAR]])","v":6},513907,"FORWARDS DE COMPRA DE MONEDAS (DIFERENTE"]
[{"$f":"LEN(PUC[[#This Row],[AUXILIAR]])","v":6},513908,"FORWARDS DE VENTA DE MONEDAS (DIFERENTES"]
[{"$f":"LEN(PUC[[#This Row],[AUXILIAR]])","v":6},513910,"FORWARDS SOBRE TASAS DE INTERÉS"]
[{"$f":"LEN(PUC[[#This Row],[AUXILIAR]])","v":6},513915,"FORWARDS DE COMPRA DE TÍTULOS"]
[{"$f":"LEN(PUC[[#This Row],[AUXILIAR]])","v":6},513916,"FORWARDS DE VENTA DE TÍTULOS"]
[{"$f":"LEN(PUC[[#This Row],[AUXILIAR]])","v":6},513920,"FORWARDS - OTROS"]
[{"$f":"LEN(PUC[[#This Row],[AUXILIAR]])","v":6},513925,"FUTUROS DE COMPRA DE MONEDAS"]
[{"$f":"LEN(PUC[[#This Row],[AUXILIAR]])","v":6},513926,"FUTUROS DE VENTA DE MONEDAS"]
[{"$f":"LEN(PUC[[#This Row],[AUXILIAR]])","v":6},513930,"FUTUROS SOBRE TASAS DE INTERÉS"]
[{"$f":"LEN(PUC[[#This Row],[AUXILIAR]])","v":6},513935,"FUTUROS DE COMPRA DE TÍTULOS"]
[{"$f":"LEN(PUC[[#This Row],[AUXILIAR]])","v":6},513936,"FUTUROS DE VENTA DE TÍTULOS"]
[{"$f":"LEN(PUC[[#This Row],[AUXILIAR]])","v":6},513937,"FUTUROS DE COMPRA DE ÍNDICES"]
[{"$f":"LEN(PUC[[#This Row],[AUXILIAR]])","v":6},513938,"FUTUROS DE VENTA DE ÍNDICES"]
[{"$f":"LEN(PUC[[#This Row],[AUXILIAR]])","v":6},513940,"FUTUROS - OTROS"]
[{"$f":"LEN(PUC[[#This Row],[AUXILIAR]])","v":6},513945,"SWAPS DE MONEDAS"]
[{"$f":"LEN(PUC[[#This Row],[AUXILIAR]])","v":6},513950,"SWAPS DE TASAS DE INTERÉS"]
[{"$f":"LEN(PUC[[#This Row],[AUXILIAR]])","v":6},513955,"SWAPS - OTROS"]
[{"$f":"LEN(PUC[[#This Row],[AUXILIAR]])","v":6},513960,"COMPRA DE OPCIONES CALLS SOBRE MONEDAS"]
[{"$f":"LEN(PUC[[#This Row],[AUXILIAR]])","v":6},513961,"COMPRA DE OPCIONES PUTS DE MONEDAS"]
[{"$f":"LEN(PUC[[#This Row],[AUXILIAR]])","v":6},513963,"EMISIONES O VENTAS DE OPCIONES CALL SOBR"]
[{"$f":"LEN(PUC[[#This Row],[AUXILIAR]])","v":6},513964,"EMISIONES O VENTA DE OPCIONES PUT SOBRE "]
[{"$f":"LEN(PUC[[#This Row],[AUXILIAR]])","v":6},513965,"COMPRA DE OPCIONES CALLS SOBRE TASAS DE "]
[{"$f":"LEN(PUC[[#This Row],[AUXILIAR]])","v":6},513966,"COMPRA DE OPCIONES PUTS SOBRE TASAS DE I"]
[{"$f":"LEN(PUC[[#This Row],[AUXILIAR]])","v":6},513968,"EMISIONES O VENTAS DE OPCIONES CALL SOBR"]
[{"$f":"LEN(PUC[[#This Row],[AUXILIAR]])","v":6},513969,"EMISIONES O VENTAS DE OPCIONES PUT SOBRE"]
[{"$f":"LEN(PUC[[#This Row],[AUXILIAR]])","v":6},513970,"COMPRAS DE OPCIONES CALLS SOBRE TÍTULOS"]
[{"$f":"LEN(PUC[[#This Row],[AUXILIAR]])","v":6},513971,"COMPRAS DE OPCIONES PUTS SOBRE TÍTULOS"]
[{"$f":"LEN(PUC[[#This Row],[AUXILIAR]])","v":6},513973,"EMISIONES O VENTAS DE OPCIONES CALL SOBR"]
[{"$f":"LEN(PUC[[#This Row],[AUXILIAR]])","v":6},513974,"EMISIONES O VENTAS DE OPCIONES PUT SOBRE"]
[{"$f":"LEN(PUC[[#This Row],[AUXILIAR]])","v":6},513975,"COMPRA DE OPCIONES CALLS - OTROS"]
[{"$f":"LEN(PUC[[#This Row],[AUXILIAR]])","v":6},513976,"EMISIONES O VENTAS DE OPCIONES CALL - OT"]
[{"$f":"LEN(PUC[[#This Row],[AUXILIAR]])","v":6},513978,"COMPRAS DE OPCIONES CALL SOBRE ÍNDICES"]
[{"$f":"LEN(PUC[[#This Row],[AUXILIAR]])","v":6},513979,"EMISIONES O VENTAS DE OPCIONES CALL SOBR"]
[{"$f":"LEN(PUC[[#This Row],[AUXILIAR]])","v":6},513980,"COMPRAS DE OPCIONES PUT SOBRE ÍNDICES"]
[{"$f":"LEN(PUC[[#This Row],[AUXILIAR]])","v":6},513981,"EMISIONES O VENTAS DE OPCIONES PUT SOBRE"]
[{"$f":"LEN(PUC[[#This Row],[AUXILIAR]])","v":6},513985,"COMPRA DE OPCIONES PUTS ¿ OTRAS"]
[{"$f":"LEN(PUC[[#This Row],[AUXILIAR]])","v":6},513990,"EMISIONES O VENTAS DE OPCIONES PUTS - OT"]
[{"$f":"LEN(PUC[[#This Row],[AUXILIAR]])","v":6},514000,"IMPUESTOS"]
[{"$f":"LEN(PUC[[#This Row],[AUXILIAR]])","v":6},514005,"REGISTRO Y ANOTACION"]
[{"$f":"LEN(PUC[[#This Row],[AUXILIAR]])","v":6},514010,"INDUSTRIA Y COMERCIO"]
[{"$f":"LEN(PUC[[#This Row],[AUXILIAR]])","v":6},514015,"PREDIAL"]
[{"$f":"LEN(PUC[[#This Row],[AUXILIAR]])","v":6},514020,"VEHICULOS"]
[{"$f":"LEN(PUC[[#This Row],[AUXILIAR]])","v":6},514025,"TIMBRE"]
[{"$f":"LEN(PUC[[#This Row],[AUXILIAR]])","v":6},514030,"PARA LA ESTABILIDAD DE CARTERA"]
[{"$f":"LEN(PUC[[#This Row],[AUXILIAR]])","v":6},514035,"GRAVAMEN A LOS MOVIMIENTOS FIANCIEROS"]
[{"$f":"LEN(PUC[[#This Row],[AUXILIAR]])","v":6},514095,"SOBRETASAS Y OTROS"]
[{"$f":"LEN(PUC[[#This Row],[AUXILIAR]])","v":6},514097,"RIESGO OPERATIVO"]
[{"$f":"LEN(PUC[[#This Row],[AUXILIAR]])","v":6},514500,"ARRENDAMIENTOS"]
[{"$f":"LEN(PUC[[#This Row],[AUXILIAR]])","v":6},514505,"EQUIPOS DE COMPUTACION"]
[{"$f":"LEN(PUC[[#This Row],[AUXILIAR]])","v":6},514510,"LOCALES Y OFICINAS"]
[{"$f":"LEN(PUC[[#This Row],[AUXILIAR]])","v":6},514515,"PARQUEADEROS"]
[{"$f":"LEN(PUC[[#This Row],[AUXILIAR]])","v":6},514520,"MUSICA AMBIENTAL"]
[{"$f":"LEN(PUC[[#This Row],[AUXILIAR]])","v":6},514525,"PREDIOS RURALES"]
[{"$f":"LEN(PUC[[#This Row],[AUXILIAR]])","v":6},514535,"MAQUINARIA Y EQUIPO"]
[{"$f":"LEN(PUC[[#This Row],[AUXILIAR]])","v":6},514540,"BODEGAS Y SILOS"]
[{"$f":"LEN(PUC[[#This Row],[AUXILIAR]])","v":6},514595,"OTROS"]
[{"$f":"LEN(PUC[[#This Row],[AUXILIAR]])","v":6},514597,"RIESGO OPERATIVO"]
[{"$f":"LEN(PUC[[#This Row],[AUXILIAR]])","v":6},515000,"CONTRIBUCIONES Y AFILIACIONES"]
[{"$f":"LEN(PUC[[#This Row],[AUXILIAR]])","v":6},515005,"SUPERINTENDENCIA BANCARIA"]
[{"$f":"LEN(PUC[[#This Row],[AUXILIAR]])","v":6},515010,"ASOCIACION BANCARIA"]
[{"$f":"LEN(PUC[[#This Row],[AUXILIAR]])","v":6},515015,"ASOCIACION NAL DE INSTIT.FINANC. - "]
[{"$f":"LEN(PUC[[#This Row],[AUXILIAR]])","v":6},515020,"FONDO DE GARANTIAS INSTITUCIONES FI"]
[{"$f":"LEN(PUC[[#This Row],[AUXILIAR]])","v":6},515025,"SERVIBANCA"]
[{"$f":"LEN(PUC[[#This Row],[AUXILIAR]])","v":6},515030,"ASCREDIBANCO"]
[{"$f":"LEN(PUC[[#This Row],[AUXILIAR]])","v":6},515035,"RED MULTICOLOR"]
[{"$f":"LEN(PUC[[#This Row],[AUXILIAR]])","v":6},515037,"REDEBAN"]
[{"$f":"LEN(PUC[[#This Row],[AUXILIAR]])","v":6},515045,"CONFEDERACION DE COOPERATIVAS DE CO"]
[{"$f":"LEN(PUC[[#This Row],[AUXILIAR]])","v":6},515050,"CONFED.LATINOAMER.DE COOP.DE AHOR Y"]
[{"$f":"LEN(PUC[[#This Row],[AUXILIAR]])","v":6},515055,"CONTRALORIA GENERAL DE LA REPUBLICA"]
[{"$f":"LEN(PUC[[#This Row],[AUXILIAR]])","v":6},515060,"FEDERACION NACIONAL DE AGENTES DE A"]
[{"$f":"LEN(PUC[[#This Row],[AUXILIAR]])","v":6},515065,"FEDER.COL.DE CIAS DE LEASING-FEDELE"]
[{"$f":"LEN(PUC[[#This Row],[AUXILIAR]])","v":6},515095,"OTRAS"]
[{"$f":"LEN(PUC[[#This Row],[AUXILIAR]])","v":6},515097,"RIESGO OPERATIVO"]
[{"$f":"LEN(PUC[[#This Row],[AUXILIAR]])","v":6},515500,"SEGUROS"]
[{"$f":"LEN(PUC[[#This Row],[AUXILIAR]])","v":6},515505,"MANEJO"]
[{"$f":"LEN(PUC[[#This Row],[AUXILIAR]])","v":6},515510,"CUMPLIMIENTO"]
[{"$f":"LEN(PUC[[#This Row],[AUXILIAR]])","v":6},515515,"CORRIENTE DEBIL"]
[{"$f":"LEN(PUC[[#This Row],[AUXILIAR]])","v":6},515520,"VIDA COLECTIVA"]
[{"$f":"LEN(PUC[[#This Row],[AUXILIAR]])","v":6},515525,"INCENDIO"]
[{"$f":"LEN(PUC[[#This Row],[AUXILIAR]])","v":6},515530,"TERREMOTO"]
[{"$f":"LEN(PUC[[#This Row],[AUXILIAR]])","v":6},515535,"SUSTRACCION"]
[{"$f":"LEN(PUC[[#This Row],[AUXILIAR]])","v":6},515540,"VEHICULOS"]
[{"$f":"LEN(PUC[[#This Row],[AUXILIAR]])","v":6},515545,"ACCIDENTES PERSONALES"]
[{"$f":"LEN(PUC[[#This Row],[AUXILIAR]])","v":6},515550,"SEGURO DE DEPOSITOS"]
[{"$f":"LEN(PUC[[#This Row],[AUXILIAR]])","v":6},515595,"OTROS"]
[{"$f":"LEN(PUC[[#This Row],[AUXILIAR]])","v":6},515597,"RIESGO OPERATIVO"]
[{"$f":"LEN(PUC[[#This Row],[AUXILIAR]])","v":6},516000,"MANTENIMIENTO Y REPARACIONES"]
[{"$f":"LEN(PUC[[#This Row],[AUXILIAR]])","v":6},516005,"EQUIPO DE COMPUTACION"]
[{"$f":"LEN(PUC[[#This Row],[AUXILIAR]])","v":6},516010,"EQUIPO DE OFICINA"]
[{"$f":"LEN(PUC[[#This Row],[AUXILIAR]])","v":6},516015,"MUEBLES Y ENSERES"]
[{"$f":"LEN(PUC[[#This Row],[AUXILIAR]])","v":6},516020,"VEHICULOS"]
[{"$f":"LEN(PUC[[#This Row],[AUXILIAR]])","v":6},516025,"PREDIOS RURALES"]
[{"$f":"LEN(PUC[[#This Row],[AUXILIAR]])","v":6},516035,"EQUIPO DE MOVILIZACION Y MAQUINARIA"]
[{"$f":"LEN(PUC[[#This Row],[AUXILIAR]])","v":6},516040,"BODEGAS Y SILOS"]
[{"$f":"LEN(PUC[[#This Row],[AUXILIAR]])","v":6},516095,"OTROS"]
[{"$f":"LEN(PUC[[#This Row],[AUXILIAR]])","v":6},516097,"RIESGO OPERATIVO"]
[{"$f":"LEN(PUC[[#This Row],[AUXILIAR]])","v":6},516500,"ADECUACION E INSTALACION DE OFICINA"]
[{"$f":"LEN(PUC[[#This Row],[AUXILIAR]])","v":6},516505,"INSTALACIONES ELECTRICAS"]
[{"$f":"LEN(PUC[[#This Row],[AUXILIAR]])","v":6},516510,"ARREGLOS ORNAMENTALES"]
[{"$f":"LEN(PUC[[#This Row],[AUXILIAR]])","v":6},516515,"REPARACIONES LOCATIVAS"]
[{"$f":"LEN(PUC[[#This Row],[AUXILIAR]])","v":6},516597,"RIESGO OPERATIVO"]
[{"$f":"LEN(PUC[[#This Row],[AUXILIAR]])","v":6},517000,"PROVISIONES"]
[{"$f":"LEN(PUC[[#This Row],[AUXILIAR]])","v":6},517003,"DISPONIBLE"]
[{"$f":"LEN(PUC[[#This Row],[AUXILIAR]])","v":6},517004,"POSICIONES ACTIVAS DEL MERCADO MONETARIO"]
[{"$f":"LEN(PUC[[#This Row],[AUXILIAR]])","v":6},517005,"INVERSIONES"]
[{"$f":"LEN(PUC[[#This Row],[AUXILIAR]])","v":6},517010,"CARTERA DE CREDITOS"]
[{"$f":"LEN(PUC[[#This Row],[AUXILIAR]])","v":6},517011,"OPERACIONES LEASING FINANCIERO"]
[{"$f":"LEN(PUC[[#This Row],[AUXILIAR]])","v":6},517012,"OPERACIONES LEASING OPERATIVO"]
[{"$f":"LEN(PUC[[#This Row],[AUXILIAR]])","v":6},517015,"CUENTAS POR COBRAR"]
[{"$f":"LEN(PUC[[#This Row],[AUXILIAR]])","v":6},517023,"BIENES REALIZ RECIB PAGO Y RESTITUIDOS"]
[{"$f":"LEN(PUC[[#This Row],[AUXILIAR]])","v":6},517030,"PROPIEDADES Y EQUIPO"]
[{"$f":"LEN(PUC[[#This Row],[AUXILIAR]])","v":6},517035,"PARA PROTECCION SEMOVIENTES"]
[{"$f":"LEN(PUC[[#This Row],[AUXILIAR]])","v":6},517040,"OTROS ACTIVOS"]
[{"$f":"LEN(PUC[[#This Row],[AUXILIAR]])","v":6},517070,"RIESGO DE LIQUIDEZ"]
[{"$f":"LEN(PUC[[#This Row],[AUXILIAR]])","v":6},517072,"FONDO DE CESANTIA"]
[{"$f":"LEN(PUC[[#This Row],[AUXILIAR]])","v":6},517073,"FONDO DE PENSIONES"]
[{"$f":"LEN(PUC[[#This Row],[AUXILIAR]])","v":6},517075,"RIESGO DE TASA DE INTERES"]
[{"$f":"LEN(PUC[[#This Row],[AUXILIAR]])","v":6},517081,"PRIMAS DEVUELTAS"]
[{"$f":"LEN(PUC[[#This Row],[AUXILIAR]])","v":6},517085,"CAPITAL GARANTIA - FOGAFIN"]
[{"$f":"LEN(PUC[[#This Row],[AUXILIAR]])","v":6},517095,"OTRAS"]
[{"$f":"LEN(PUC[[#This Row],[AUXILIAR]])","v":6},517100,"COMP CONTRACMCLICO PROV INDIVIDUALES"]
[{"$f":"LEN(PUC[[#This Row],[AUXILIAR]])","v":6},517105,"CREDITOS Y OPER LEASING DE CONSUMO"]
[{"$f":"LEN(PUC[[#This Row],[AUXILIAR]])","v":6},517110,"OPER LEASING OPER DE CONSUMO"]
[{"$f":"LEN(PUC[[#This Row],[AUXILIAR]])","v":6},517115,"CRIDITOS Y OPER LEASING COMERCIALES"]
[{"$f":"LEN(PUC[[#This Row],[AUXILIAR]])","v":6},517120,"OPERACIONES DE LEASING OPER COMERCIAL"]
[{"$f":"LEN(PUC[[#This Row],[AUXILIAR]])","v":6},517125,"OPERACIONES DE LEASING HABITACIONAL"]
[{"$f":"LEN(PUC[[#This Row],[AUXILIAR]])","v":6},517130,"CUENTAS POR COBRAR"]
[{"$f":"LEN(PUC[[#This Row],[AUXILIAR]])","v":6},517200,"PROVISIONES OTROS PASIVOS ESTIM"]
[{"$f":"LEN(PUC[[#This Row],[AUXILIAR]])","v":6},517205,"PROVISIONES OTROS PASIVOS ESTIM"]
[{"$f":"LEN(PUC[[#This Row],[AUXILIAR]])","v":6},517300,"PROV RESERVAS TECNICAS FDOS GARANTIAS"]
[{"$f":"LEN(PUC[[#This Row],[AUXILIAR]])","v":6},517305,"SEGURO DEPOSITO INSTITUCIONES FINANCIERA"]
[{"$f":"LEN(PUC[[#This Row],[AUXILIAR]])","v":6},517310,"SEGURO DEPOSITO ENTIDADES COOPERATIVAS"]
[{"$f":"LEN(PUC[[#This Row],[AUXILIAR]])","v":6},517315,"GARANTIAS OTORGADAS FDOS CESANTIAS"]
[{"$f":"LEN(PUC[[#This Row],[AUXILIAR]])","v":6},517320,"GARANTIAS OTORGADAS FONDOS PENSIONES"]
[{"$f":"LEN(PUC[[#This Row],[AUXILIAR]])","v":6},517325,"PENSIONES ADMIN RIESGOS PROFESIONALES"]
[{"$f":"LEN(PUC[[#This Row],[AUXILIAR]])","v":6},517330,"RESERVA POR ADMON DEL RIESGO DE GARANTIA"]
[{"$f":"LEN(PUC[[#This Row],[AUXILIAR]])","v":6},517400,"PAGOS SINIESTROS SIN RECUPERACION"]
[{"$f":"LEN(PUC[[#This Row],[AUXILIAR]])","v":6},517405,"PAGOS SINIESTROS SIN RECUPERACISN"]
[{"$f":"LEN(PUC[[#This Row],[AUXILIAR]])","v":6},517497,"PAGOS SINIESTROS SIN RECUPERACISN-RIESGO"]
[{"$f":"LEN(PUC[[#This Row],[AUXILIAR]])","v":6},517500,"DEPRECIACIONES"]
[{"$f":"LEN(PUC[[#This Row],[AUXILIAR]])","v":6},517505,"EDIFICIOS"]
[{"$f":"LEN(PUC[[#This Row],[AUXILIAR]])","v":6},517510,"EQUIPOS, MUEBLES Y ENSERES DE OFICI"]
[{"$f":"LEN(PUC[[#This Row],[AUXILIAR]])","v":6},517515,"EQUIPO DE COMPUTACION"]
[{"$f":"LEN(PUC[[#This Row],[AUXILIAR]])","v":6},517520,"VEHICULOS"]
[{"$f":"LEN(PUC[[#This Row],[AUXILIAR]])","v":6},517525,"EQUIPOS DE MOVILIZACION Y MAQUINARI"]
[{"$f":"LEN(PUC[[#This Row],[AUXILIAR]])","v":6},517530,"SILOS"]
[{"$f":"LEN(PUC[[#This Row],[AUXILIAR]])","v":6},517535,"BODEGAS"]
[{"$f":"LEN(PUC[[#This Row],[AUXILIAR]])","v":6},517545,"BIENES RURALES"]
[{"$f":"LEN(PUC[[#This Row],[AUXILIAR]])","v":6},517548,"MAQUINARIA Y EQUIPO EN LEASING"]
[{"$f":"LEN(PUC[[#This Row],[AUXILIAR]])","v":6},517550,"VEHICULOS EN LEASING"]
[{"$f":"LEN(PUC[[#This Row],[AUXILIAR]])","v":6},517552,"MUEBLES Y ENSERES EN LEASING"]
[{"$f":"LEN(PUC[[#This Row],[AUXILIAR]])","v":6},517554,"BARCOS,TRENES,AVIONES Y SIM. EN LEA"]
[{"$f":"LEN(PUC[[#This Row],[AUXILIAR]])","v":6},517556,"EQUIPO DE COMPUTACION EN LEASING"]
[{"$f":"LEN(PUC[[#This Row],[AUXILIAR]])","v":6},517558,"BIENES INMUEBLES EN LEASING"]
[{"$f":"LEN(PUC[[#This Row],[AUXILIAR]])","v":6},518000,"AMORTIZACIONES"]
[{"$f":"LEN(PUC[[#This Row],[AUXILIAR]])","v":6},518005,"ORGANIZACION Y PREOPERATIVOS"]
[{"$f":"LEN(PUC[[#This Row],[AUXILIAR]])","v":6},518010,"REMODELACION"]
[{"$f":"LEN(PUC[[#This Row],[AUXILIAR]])","v":6},518015,"ESTUDIOS Y PROYECTOS"]
[{"$f":"LEN(PUC[[#This Row],[AUXILIAR]])","v":6},518020,"PROGRAMAS PARA COMPUTADOR (SOFTWARE"]
[{"$f":"LEN(PUC[[#This Row],[AUXILIAR]])","v":6},518025,"MEJORAS A PROPIEDADES TOMADAS EN AR"]
[{"$f":"LEN(PUC[[#This Row],[AUXILIAR]])","v":6},518060,"SEMOVIENTES EN LEASING"]
[{"$f":"LEN(PUC[[#This Row],[AUXILIAR]])","v":6},518061,"PROG. COMPUT.-SOFTWARE DADOS  EN LE"]
[{"$f":"LEN(PUC[[#This Row],[AUXILIAR]])","v":6},518070,"Bienes entregados en comodato"]
[{"$f":"LEN(PUC[[#This Row],[AUXILIAR]])","v":6},518080,"CREDITO MERCANTIL"]
[{"$f":"LEN(PUC[[#This Row],[AUXILIAR]])","v":6},518095,"OTRAS"]
[{"$f":"LEN(PUC[[#This Row],[AUXILIAR]])","v":6},518500,"GASTOS CAPITALIZABLES"]
[{"$f":"LEN(PUC[[#This Row],[AUXILIAR]])","v":6},518504,"GASTOS CAPITALIZABLES"]
[{"$f":"LEN(PUC[[#This Row],[AUXILIAR]])","v":6},518509,"GASTOS DE PERS.DE HACIENDAS Y DPTO "]
[{"$f":"LEN(PUC[[#This Row],[AUXILIAR]])","v":6},518510,"GASTOS DE SEMOVIENTES"]
[{"$f":"LEN(PUC[[#This Row],[AUXILIAR]])","v":6},518516,"GASTOS CAPITALIZADOS (CR)"]
[{"$f":"LEN(PUC[[#This Row],[AUXILIAR]])","v":6},518597,"RIESGO OPERATIVO"]
[{"$f":"LEN(PUC[[#This Row],[AUXILIAR]])","v":6},519000,"DIVERSOS"]
[{"$f":"LEN(PUC[[#This Row],[AUXILIAR]])","v":6},519005,"SERVICIOS DE ASEO Y VIGILANCIA"]
[{"$f":"LEN(PUC[[#This Row],[AUXILIAR]])","v":6},519010,"SERVICIOS TEMPORALES"]
[{"$f":"LEN(PUC[[#This Row],[AUXILIAR]])","v":6},519015,"PUBLICIDAD Y PROPAGANDA"]
[{"$f":"LEN(PUC[[#This Row],[AUXILIAR]])","v":6},519020,"RELACIONES PUBLICAS"]
[{"$f":"LEN(PUC[[#This Row],[AUXILIAR]])","v":6},519025,"SERVICIOS PUBLICOS"]
[{"$f":"LEN(PUC[[#This Row],[AUXILIAR]])","v":6},519030,"PROCESAMIENTO ELECTRONICO DE DATOS"]
[{"$f":"LEN(PUC[[#This Row],[AUXILIAR]])","v":6},519035,"GASTOS DE VIAJE"]
[{"$f":"LEN(PUC[[#This Row],[AUXILIAR]])","v":6},519040,"TRANSPORTE"]
[{"$f":"LEN(PUC[[#This Row],[AUXILIAR]])","v":6},519045,"UTILES Y PAPELERIA"]
[{"$f":"LEN(PUC[[#This Row],[AUXILIAR]])","v":6},519046,"GASTOS OPERAC CONSORCIOS O UNI TEMP"]
[{"$f":"LEN(PUC[[#This Row],[AUXILIAR]])","v":6},519050,"MUERTE DE GANADO"]
[{"$f":"LEN(PUC[[#This Row],[AUXILIAR]])","v":6},519055,"EXTRAVIO Y HURTO DE GANADO"]
[{"$f":"LEN(PUC[[#This Row],[AUXILIAR]])","v":6},519060,"DONACIONES"]
[{"$f":"LEN(PUC[[#This Row],[AUXILIAR]])","v":6},519065,"PERDIDA EN VENTA DE ACTIVOS EN LEAS"]
[{"$f":"LEN(PUC[[#This Row],[AUXILIAR]])","v":6},519095,"OTROS"]
[{"$f":"LEN(PUC[[#This Row],[AUXILIAR]])","v":6},519097,"RIESGO OPERATIVO"]
[{"$f":"LEN(PUC[[#This Row],[AUXILIAR]])","v":6},519400,"CTO VTAS BIENES REALIZ Y NO UTIL OBJ SOC"]
[{"$f":"LEN(PUC[[#This Row],[AUXILIAR]])","v":6},519405,"VIVIENDA"]
[{"$f":"LEN(PUC[[#This Row],[AUXILIAR]])","v":6},519410,"LOCALES Y OFICINAS"]
[{"$f":"LEN(PUC[[#This Row],[AUXILIAR]])","v":6},519415,"BIENES TERMINADOS"]
[{"$f":"LEN(PUC[[#This Row],[AUXILIAR]])","v":6},519420,"MERCANCIAS"]
[{"$f":"LEN(PUC[[#This Row],[AUXILIAR]])","v":6},519425,"VEHICULOS"]
[{"$f":"LEN(PUC[[#This Row],[AUXILIAR]])","v":6},519435,"TERRENOS"]
[{"$f":"LEN(PUC[[#This Row],[AUXILIAR]])","v":6},519440,"BIENES NO UTILIZADOS EN EL OBJETO SOCIAL"]
[{"$f":"LEN(PUC[[#This Row],[AUXILIAR]])","v":6},519497,"RIESGO OPERATIVO"]
[{"$f":"LEN(PUC[[#This Row],[AUXILIAR]])","v":6},519500,"COSTO DE VENTAS SEMOVIENTES"]
[{"$f":"LEN(PUC[[#This Row],[AUXILIAR]])","v":6},519505,"COSTO DE VENTAS SEMOVIENTES"]
[{"$f":"LEN(PUC[[#This Row],[AUXILIAR]])","v":6},519510,"COSTO DE VENTA SEMOVIENTES EN PARTI"]
[{"$f":"LEN(PUC[[#This Row],[AUXILIAR]])","v":6},519515,"COSTO DE VENTA SEMOV EN ADMON DIREC"]
[{"$f":"LEN(PUC[[#This Row],[AUXILIAR]])","v":6},519597,"RIESGO OPERATIVO"]
[{"$f":"LEN(PUC[[#This Row],[AUXILIAR]])","v":6},519700,"CTAS DE REP.GAS.Y COSTOS OPER-SECC."]
[{"$f":"LEN(PUC[[#This Row],[AUXILIAR]])","v":6},519705,"SECCION DE SEGUROS"]
[{"$f":"LEN(PUC[[#This Row],[AUXILIAR]])","v":6},519710,"AREAS COMERCIALES"]
[{"$f":"LEN(PUC[[#This Row],[AUXILIAR]])","v":6},519797,"RIESGO OPERATIVO"]
[{"$f":"LEN(PUC[[#This Row],[AUXILIAR]])","v":6},519800,"CTA REP.GASTOS Y COSTOS OPER-SECC.E"]
[{"$f":"LEN(PUC[[#This Row],[AUXILIAR]])","v":6},519805,"SECCION VALOR CONSTANTE"]
[{"$f":"LEN(PUC[[#This Row],[AUXILIAR]])","v":6},519810,"SECCION TRADICIONAL"]
[{"$f":"LEN(PUC[[#This Row],[AUXILIAR]])","v":6},519897,"RIESGO OPERATIVO"]
[{"$f":"LEN(PUC[[#This Row],[AUXILIAR]])","v":6},520000,"NO OPERACIONALES"]
[{"$f":"LEN(PUC[[#This Row],[AUXILIAR]])","v":6},520500,"PERDIDA VTA BIENES REC PAGO Y RESTITUIDO"]
[{"$f":"LEN(PUC[[#This Row],[AUXILIAR]])","v":6},520505,"BIENES INMUEBLES"]
[{"$f":"LEN(PUC[[#This Row],[AUXILIAR]])","v":6},520510,"BIENES MUEBLES"]
[{"$f":"LEN(PUC[[#This Row],[AUXILIAR]])","v":6},520597,"RIESGO OPERATIVO"]
[{"$f":"LEN(PUC[[#This Row],[AUXILIAR]])","v":6},521000,"PERDIDA EN VENTA DE PROPIEDADES Y EQUIPO"]
[{"$f":"LEN(PUC[[#This Row],[AUXILIAR]])","v":6},521005,"TERRENOS"]
[{"$f":"LEN(PUC[[#This Row],[AUXILIAR]])","v":6},521010,"EDIFICIOS"]
[{"$f":"LEN(PUC[[#This Row],[AUXILIAR]])","v":6},521015,"EQUIPO, MUEBLES Y ENSERES DE OFICINA"]
[{"$f":"LEN(PUC[[#This Row],[AUXILIAR]])","v":6},521020,"EQUIPOS DE COMPUTACION"]
[{"$f":"LEN(PUC[[#This Row],[AUXILIAR]])","v":6},521025,"VEHICULOS"]
[{"$f":"LEN(PUC[[#This Row],[AUXILIAR]])","v":6},521030,"EQUIPOS DE MOVILIZACION Y MAQUINARIA"]
[{"$f":"LEN(PUC[[#This Row],[AUXILIAR]])","v":6},521035,"SILOS"]
[{"$f":"LEN(PUC[[#This Row],[AUXILIAR]])","v":6},521040,"BODEGAS"]
[{"$f":"LEN(PUC[[#This Row],[AUXILIAR]])","v":6},521045,"BIENES RURALES"]
[{"$f":"LEN(PUC[[#This Row],[AUXILIAR]])","v":6},521050,"SEMOVIENTES"]
[{"$f":"LEN(PUC[[#This Row],[AUXILIAR]])","v":6},521097,"RIESGO OPERATIVO"]
[{"$f":"LEN(PUC[[#This Row],[AUXILIAR]])","v":6},521500,"PERDIDA EN VENTA DE OTROS ACTIVOS"]
[{"$f":"LEN(PUC[[#This Row],[AUXILIAR]])","v":6},521506,"APORTES PERMANENTES"]
[{"$f":"LEN(PUC[[#This Row],[AUXILIAR]])","v":6},521510,"BIENES DE ARTE Y CULTURA"]
[{"$f":"LEN(PUC[[#This Row],[AUXILIAR]])","v":6},521597,"RIESGO OPERATIVO"]
[{"$f":"LEN(PUC[[#This Row],[AUXILIAR]])","v":6},521700,"PERDIDA POR SINIESTROS-RIESGO OPERATIVO"]
[{"$f":"LEN(PUC[[#This Row],[AUXILIAR]])","v":6},521710,"CONSTRUCCIONES EN CURSO"]
[{"$f":"LEN(PUC[[#This Row],[AUXILIAR]])","v":6},521715,"EDIFICIOS"]
[{"$f":"LEN(PUC[[#This Row],[AUXILIAR]])","v":6},521720,"MAQUINARIA MUEBLES Y ENSERES"]
[{"$f":"LEN(PUC[[#This Row],[AUXILIAR]])","v":6},521725,"EQUIPO DE COMPUTACION"]
[{"$f":"LEN(PUC[[#This Row],[AUXILIAR]])","v":6},521730,"VEHICULOS"]
[{"$f":"LEN(PUC[[#This Row],[AUXILIAR]])","v":6},521735,"EFECTIVO Y CANJE"]
[{"$f":"LEN(PUC[[#This Row],[AUXILIAR]])","v":6},521740,"TITULOS VALORES"]
[{"$f":"LEN(PUC[[#This Row],[AUXILIAR]])","v":6},521745,"CARTERA DE CREDITOS"]
[{"$f":"LEN(PUC[[#This Row],[AUXILIAR]])","v":6},521795,"OTROS ACTIVOS"]
[{"$f":"LEN(PUC[[#This Row],[AUXILIAR]])","v":6},522500,"AMORTIZACION BIENES ENTREG.EN COMODATO"]
[{"$f":"LEN(PUC[[#This Row],[AUXILIAR]])","v":6},523000,"MULTAS Y SANCIONES , LITIGIOS, INDEMNIZA"]
[{"$f":"LEN(PUC[[#This Row],[AUXILIAR]])","v":6},523006,"MULTAS Y SANC.SUPERBCARIA-DESENCAJE"]
[{"$f":"LEN(PUC[[#This Row],[AUXILIAR]])","v":6},523007,"MULTAS Y SANC.SUPERBCARIA-APALANCAM"]
[{"$f":"LEN(PUC[[#This Row],[AUXILIAR]])","v":6},523008,"MULTAS Y SANC.SUPERBCARIA-POSIC.PRO"]
[{"$f":"LEN(PUC[[#This Row],[AUXILIAR]])","v":6},523009,"MULTAS Y SANC.SUPERBCARIA-OTRAS"]
[{"$f":"LEN(PUC[[#This Row],[AUXILIAR]])","v":6},523010,"MULTAS Y SANCION. OTRAS AUTORID.ADM"]
[{"$f":"LEN(PUC[[#This Row],[AUXILIAR]])","v":6},523015,"INDEMNIZACIONES A CLIENTES"]
[{"$f":"LEN(PUC[[#This Row],[AUXILIAR]])","v":6},523020,"OTRAS INDEMNIZACIONES"]
[{"$f":"LEN(PUC[[#This Row],[AUXILIAR]])","v":6},523025,"DEMANDAS LABORALES"]
[{"$f":"LEN(PUC[[#This Row],[AUXILIAR]])","v":6},523030,"DEMANDAS POR INCUMPLIMIENTO DE CONT"]
[{"$f":"LEN(PUC[[#This Row],[AUXILIAR]])","v":6},523035,"LITIGIOS EN PROCESO EJECUTIVO"]
[{"$f":"LEN(PUC[[#This Row],[AUXILIAR]])","v":6},523040,"OTR.LITIG.EN PROC.ADMTIVO JUD.O ARB"]
[{"$f":"LEN(PUC[[#This Row],[AUXILIAR]])","v":6},523095,"OTRAS"]
[{"$f":"LEN(PUC[[#This Row],[AUXILIAR]])","v":6},529500,"DIVERSOS"]
[{"$f":"LEN(PUC[[#This Row],[AUXILIAR]])","v":6},529505,"INTERESES POR MULTAS Y SANCIONES-RIESGO "]
[{"$f":"LEN(PUC[[#This Row],[AUXILIAR]])","v":6},529510,"GTOS BIENES RECIB PAGO Y RESTITUIDOS"]
[{"$f":"LEN(PUC[[#This Row],[AUXILIAR]])","v":6},529515,"PERDIDA EN RECUPERACION DE CARTERA"]
[{"$f":"LEN(PUC[[#This Row],[AUXILIAR]])","v":6},529545,"GASTOS NO OPERAC CONSORCIOS O UNI TEMP"]
[{"$f":"LEN(PUC[[#This Row],[AUXILIAR]])","v":6},529550,"AMORT EXC CTO INV SOBRE VLOR EN LIBROS"]
[{"$f":"LEN(PUC[[#This Row],[AUXILIAR]])","v":6},529555,"INTERES MINORITARIO"]
[{"$f":"LEN(PUC[[#This Row],[AUXILIAR]])","v":6},529595,"OTROS"]
[{"$f":"LEN(PUC[[#This Row],[AUXILIAR]])","v":6},529597,"RIESGO OPERATIVO"]
[{"$f":"LEN(PUC[[#This Row],[AUXILIAR]])","v":6},529700,"CTAS REP.GAS.Y COST.NO OPER-SECC.ESPEC."]
[{"$f":"LEN(PUC[[#This Row],[AUXILIAR]])","v":6},529705,"SECCION DE SEGUROS"]
[{"$f":"LEN(PUC[[#This Row],[AUXILIAR]])","v":6},529710,"AREAS COMERCIALES"]
[{"$f":"LEN(PUC[[#This Row],[AUXILIAR]])","v":6},529797,"RIESGO OPERATIVO"]
[{"$f":"LEN(PUC[[#This Row],[AUXILIAR]])","v":6},529800,"CTAS REP.GAS.Y COST.NO OPER-SECC.ESPEC."]
[{"$f":"LEN(PUC[[#This Row],[AUXILIAR]])","v":6},529805,"SECCION VALOR CONSTANTE"]
[{"$f":"LEN(PUC[[#This Row],[AUXILIAR]])","v":6},529810,"SECCION TRADICIONAL"]
[{"$f":"LEN(PUC[[#This Row],[AUXILIAR]])","v":6},529897,"RIESGO OPERATIVO"]
[{"$f":"LEN(PUC[[#This Row],[AUXILIAR]])","v":6},530000,"GASTOS COMPENSADOS"]
[{"$f":"LEN(PUC[[#This Row],[AUXILIAR]])","v":6},530500,"GASTOS COMPENSADOS"]
[{"$f":"LEN(PUC[[#This Row],[AUXILIAR]])","v":6},540000,"IMPUESTO DE RENTA Y COMPLEMENTARIOS"]
[{"$f":"LEN(PUC[[#This Row],[AUXILIAR]])","v":6},540500,"IMPUESTO DE RENTA Y COMPLEMENTARIOS"]
[{"$f":"LEN(PUC[[#This Row],[AUXILIAR]])","v":6},540505,"IMPUESTO DE RENTA Y COMPLEMENTARIOS"]
[{"$f":"LEN(PUC[[#This Row],[AUXILIAR]])","v":6},540597,"RIESGO OPERATIVO"]
[{"$f":"LEN(PUC[[#This Row],[AUXILIAR]])","v":6},590000,"GANANCIAS (EXCEDENTES) Y PERDIDAS"]
[{"$f":"LEN(PUC[[#This Row],[AUXILIAR]])","v":6},600000,"CUENTAS CONTINGENTES"]
[{"$f":"LEN(PUC[[#This Row],[AUXILIAR]])","v":6},610000,"ACREEDORAS POR CONTRA"]
[{"$f":"LEN(PUC[[#This Row],[AUXILIAR]])","v":6},610500,"ACREEDORAS POR CONTRA (DB)"]
[{"$f":"LEN(PUC[[#This Row],[AUXILIAR]])","v":6},610600,"AVALES POR CONTRA"]
[{"$f":"LEN(PUC[[#This Row],[AUXILIAR]])","v":6},610605,"OBLIGACION ESTIPULADA EN M/L"]
[{"$f":"LEN(PUC[[#This Row],[AUXILIAR]])","v":6},610610,"OBLIGACION ESTIPULADA EN M/E"]
[{"$f":"LEN(PUC[[#This Row],[AUXILIAR]])","v":6},610800,"VALORES RECIBIDOS ENN OPERACIONES REPO Y"]
[{"$f":"LEN(PUC[[#This Row],[AUXILIAR]])","v":6},610805,"OPERACIONES REPO Y SIMULTANEAS"]
[{"$f":"LEN(PUC[[#This Row],[AUXILIAR]])","v":6},610900,"VALORES RECIBIDOS EN OPERACIONES DE TRAN"]
[{"$f":"LEN(PUC[[#This Row],[AUXILIAR]])","v":6},610905,"VALORES RECIBIDOS EN OPERACIO. DE TRANSF"]
[{"$f":"LEN(PUC[[#This Row],[AUXILIAR]])","v":6},611000,"GARANTIAS BANCARIAS POR CONTRA"]
[{"$f":"LEN(PUC[[#This Row],[AUXILIAR]])","v":6},611005,"OBLIGACION ESTIPULADA EN M/L"]
[{"$f":"LEN(PUC[[#This Row],[AUXILIAR]])","v":6},611010,"OBLIGACION ESTIPULADA EN M/E"]
[{"$f":"LEN(PUC[[#This Row],[AUXILIAR]])","v":6},611500,"CARTAS DE CREDITO POR CONTRA"]
[{"$f":"LEN(PUC[[#This Row],[AUXILIAR]])","v":6},611505,"EMITIDAS POR LA ENTIDAD EST EN M/L"]
[{"$f":"LEN(PUC[[#This Row],[AUXILIAR]])","v":6},611507,"EMITIDAS POR LA ENTIDAD EST EN M/E"]
[{"$f":"LEN(PUC[[#This Row],[AUXILIAR]])","v":6},611510,"CONFIRMADAS X LA ENTIDAD EST EN M/L"]
[{"$f":"LEN(PUC[[#This Row],[AUXILIAR]])","v":6},611512,"CONFIRMADAS X LA ENTIDAD EST EN M/E"]
[{"$f":"LEN(PUC[[#This Row],[AUXILIAR]])","v":6},612000,"CREDITOS APROB NO DESEMBOL X CONTRA"]
[{"$f":"LEN(PUC[[#This Row],[AUXILIAR]])","v":6},612005,"OBLIGACION ESTIPULADA EN M/L"]
[{"$f":"LEN(PUC[[#This Row],[AUXILIAR]])","v":6},612010,"OBLIGACION ESTIPULADA EN M/E"]
[{"$f":"LEN(PUC[[#This Row],[AUXILIAR]])","v":6},612500,"APERTURAS DE CREDITO POR CONTRA"]
[{"$f":"LEN(PUC[[#This Row],[AUXILIAR]])","v":6},612505,"CREDITOS ESTIPULADOS EN M/L"]
[{"$f":"LEN(PUC[[#This Row],[AUXILIAR]])","v":6},612507,"CREDITOS ESTIPULADOS EN M/E"]
[{"$f":"LEN(PUC[[#This Row],[AUXILIAR]])","v":6},612510,"TARJETAS DE CREDITO ESTIPULADAS EN M/L"]
[{"$f":"LEN(PUC[[#This Row],[AUXILIAR]])","v":6},612512,"TARJETAS DE CREDITO ESTIPULADAS EN M/E"]
[{"$f":"LEN(PUC[[#This Row],[AUXILIAR]])","v":6},613000,"RESPONSAB X CHEQUES DE VIAJERO X CONTRA"]
[{"$f":"LEN(PUC[[#This Row],[AUXILIAR]])","v":6},613005,"OBLIGACION ESTIPULADA EN M/L"]
[{"$f":"LEN(PUC[[#This Row],[AUXILIAR]])","v":6},613010,"OBLIGACION ESTIPULADA EN M/E"]
[{"$f":"LEN(PUC[[#This Row],[AUXILIAR]])","v":6},613200,"CUPOS DE CONTRAPARTE PARA TERCEROS POR O"]
[{"$f":"LEN(PUC[[#This Row],[AUXILIAR]])","v":6},613205,"INSTRUMENTOS FINANCIEROS  DERIVADOS Y PR"]
[{"$f":"LEN(PUC[[#This Row],[AUXILIAR]])","v":6},613500,"UNDERWRITING EN FIRME POR CONTRA"]
[{"$f":"LEN(PUC[[#This Row],[AUXILIAR]])","v":6},613505,"OBLIGACION ESTIPULADA EN M/L"]
[{"$f":"LEN(PUC[[#This Row],[AUXILIAR]])","v":6},613510,"OBLIGACION ESTIPULADA EN M/E"]
[{"$f":"LEN(PUC[[#This Row],[AUXILIAR]])","v":6},614000,"DIVID ACUMULADOS-ACCIONES PREF X CONTRA"]
[{"$f":"LEN(PUC[[#This Row],[AUXILIAR]])","v":6},614005,"OBLIGACION ESTIPULADA EN M/L"]
[{"$f":"LEN(PUC[[#This Row],[AUXILIAR]])","v":6},614010,"OBLIGACION ESTIPULADA EN M/E"]
[{"$f":"LEN(PUC[[#This Row],[AUXILIAR]])","v":6},619500,"OTRAS CONTINGENCIAS ACREEDORAS X CONTRA"]
[{"$f":"LEN(PUC[[#This Row],[AUXILIAR]])","v":6},619505,"POR LITIGIOS ESTIPULADOS EN M/L"]
[{"$f":"LEN(PUC[[#This Row],[AUXILIAR]])","v":6},619507,"POR LITIGIOS ESTIPULADOS EN M/E"]
[{"$f":"LEN(PUC[[#This Row],[AUXILIAR]])","v":6},619595,"OTRAS ESTIPULADAS EN M/L"]
[{"$f":"LEN(PUC[[#This Row],[AUXILIAR]])","v":6},619597,"OTRAS ESTIPULADAS EN M/E"]
[{"$f":"LEN(PUC[[#This Row],[AUXILIAR]])","v":6},620000,"ACREEDORAS"]
[{"$f":"LEN(PUC[[#This Row],[AUXILIAR]])","v":6},620500,"AVALES"]
[{"$f":"LEN(PUC[[#This Row],[AUXILIAR]])","v":6},620700,"GARANTIAS FONDO NAL. DE GARANTIAS"]
[{"$f":"LEN(PUC[[#This Row],[AUXILIAR]])","v":6},620705,"GARANTIAS OTORGADAS POR EL FNG."]
[{"$f":"LEN(PUC[[#This Row],[AUXILIAR]])","v":6},620800,"VALORES RECIBIDOS EN OPERACIONES REPO Y "]
[{"$f":"LEN(PUC[[#This Row],[AUXILIAR]])","v":6},620805,"VALORES EN OPERACIONES REPOS ABIERTOS SI"]
[{"$f":"LEN(PUC[[#This Row],[AUXILIAR]])","v":6},620810,"VALORES EN OPERACIONES REPOS ABIERTOS CO"]
[{"$f":"LEN(PUC[[#This Row],[AUXILIAR]])","v":6},620815,"VALORES EN OPERACIONES REPOS CERRADO SIN"]
[{"$f":"LEN(PUC[[#This Row],[AUXILIAR]])","v":6},620820,"OPERACIONES REPOS CERRADO-CON DESCUENTO "]
[{"$f":"LEN(PUC[[#This Row],[AUXILIAR]])","v":6},620825,"VALORES POR LLAMADO AL MARGEN EN OPERACI"]
[{"$f":"LEN(PUC[[#This Row],[AUXILIAR]])","v":6},620830,"VALORES EN OPERACIONES SIMULTANEAS"]
[{"$f":"LEN(PUC[[#This Row],[AUXILIAR]])","v":6},620835,"VALORES POR LLAMADO AL MARGEN EN OPERACI"]
[{"$f":"LEN(PUC[[#This Row],[AUXILIAR]])","v":6},620900,"VALORES RECIBIDOS EN OPERACIONES DE TRAN"]
[{"$f":"LEN(PUC[[#This Row],[AUXILIAR]])","v":6},620905,"VALORES PRINCIPALES EN OPERACIONES DE TR"]
[{"$f":"LEN(PUC[[#This Row],[AUXILIAR]])","v":6},620910,"VALORES SECUNDARIOS EN OPERACIONES DE TR"]
[{"$f":"LEN(PUC[[#This Row],[AUXILIAR]])","v":6},620915,"VALORES POR LLAMADO AL MARGEN EN OPERACI"]
[{"$f":"LEN(PUC[[#This Row],[AUXILIAR]])","v":6},621000,"GARANTIAS BANCARIAS"]
[{"$f":"LEN(PUC[[#This Row],[AUXILIAR]])","v":6},621500,"CARTAS DE CREDITO"]
[{"$f":"LEN(PUC[[#This Row],[AUXILIAR]])","v":6},621505,"EMITIDAS POR LA ENTIDAD"]
[{"$f":"LEN(PUC[[#This Row],[AUXILIAR]])","v":6},621510,"CONFIRMADAS POR LA ENTIDAD"]
[{"$f":"LEN(PUC[[#This Row],[AUXILIAR]])","v":6},622000,"CREDITOS APROBADOS NO DESEMBOLSADOS"]
[{"$f":"LEN(PUC[[#This Row],[AUXILIAR]])","v":6},622500,"APERTURAS DE CREDITO"]
[{"$f":"LEN(PUC[[#This Row],[AUXILIAR]])","v":6},622505,"CREDITOS"]
[{"$f":"LEN(PUC[[#This Row],[AUXILIAR]])","v":6},622510,"TARJETAS DE CREDITO"]
[{"$f":"LEN(PUC[[#This Row],[AUXILIAR]])","v":6},622700,"RESERVAS DE CUPOS DE GARANTIAS"]
[{"$f":"LEN(PUC[[#This Row],[AUXILIAR]])","v":6},622705,"ESTABLECIMIENTOS DE CREDITOS BANCARIOS"]
[{"$f":"LEN(PUC[[#This Row],[AUXILIAR]])","v":6},622710,"OTRAS ENTIDADES"]
[{"$f":"LEN(PUC[[#This Row],[AUXILIAR]])","v":6},623000,"RESPONSABILIDAD POR CHEQUES DE VIAJ"]
[{"$f":"LEN(PUC[[#This Row],[AUXILIAR]])","v":6},623200,"CUPOS DE CONTRAPARTE PARA TERCEROS POR O"]
[{"$f":"LEN(PUC[[#This Row],[AUXILIAR]])","v":6},623205,"INSTRUMENTOS FINANCIEROS  DERIVADOS Y PR"]
[{"$f":"LEN(PUC[[#This Row],[AUXILIAR]])","v":6},623500,"UNDERWRITING EN FIRME"]
[{"$f":"LEN(PUC[[#This Row],[AUXILIAR]])","v":6},624000,"DIVIDENDOS ACUMUL.-ACCIONES PREFERE"]
[{"$f":"LEN(PUC[[#This Row],[AUXILIAR]])","v":6},624500,"OBLIGACIONES EN OPCIONES ¿ DE ESPECULACI"]
[{"$f":"LEN(PUC[[#This Row],[AUXILIAR]])","v":6},624504,"EMITIDAS CALLS SOBRE DIVISAS"]
[{"$f":"LEN(PUC[[#This Row],[AUXILIAR]])","v":6},624508,"EMISIÓN O VENTA DE CALL SOBRE MONEDAS"]
[{"$f":"LEN(PUC[[#This Row],[AUXILIAR]])","v":6},624512,"EMITIDAS CALLS SOBRE TITULOS"]
[{"$f":"LEN(PUC[[#This Row],[AUXILIAR]])","v":6},624516,"EMISIÓN O VENTA DE CALL SOBRE TASAS DE I"]
[{"$f":"LEN(PUC[[#This Row],[AUXILIAR]])","v":6},624520,"EMITIDAS PUTS SOBRE DIVISAS"]
[{"$f":"LEN(PUC[[#This Row],[AUXILIAR]])","v":6},624524,"EMISIÓN O VENTA DE CALL SOBRE TITULOS"]
[{"$f":"LEN(PUC[[#This Row],[AUXILIAR]])","v":6},624528,"EMITIDAS PUTS SOBRE TITULOS"]
[{"$f":"LEN(PUC[[#This Row],[AUXILIAR]])","v":6},624532,"EMISIÓN O VENTA DE CALL SOBRE INDICES"]
[{"$f":"LEN(PUC[[#This Row],[AUXILIAR]])","v":6},624536,"EMITIDAS CAPS,FLOORS,COLL SOB DIVIS"]
[{"$f":"LEN(PUC[[#This Row],[AUXILIAR]])","v":6},624540,"EMISIÓN O VENTA DE CALL - OTRAS"]
[{"$f":"LEN(PUC[[#This Row],[AUXILIAR]])","v":6},624544,"EMITIDAS CAPS,FLOORS,COLL SOB TITUL"]
[{"$f":"LEN(PUC[[#This Row],[AUXILIAR]])","v":6},624548,"EMISIÓN O VENTA DE PUTS SOBRE MONEDAS"]
[{"$f":"LEN(PUC[[#This Row],[AUXILIAR]])","v":6},624552,"COMPRADAS CALLS SOBRE DIVISAS"]
[{"$f":"LEN(PUC[[#This Row],[AUXILIAR]])","v":6},624556,"EMISIÓN O VENTA DE PUTS SOBRE TASAS DE I"]
[{"$f":"LEN(PUC[[#This Row],[AUXILIAR]])","v":6},624560,"COMPRADAS CALLS SOBRE TITULOS"]
[{"$f":"LEN(PUC[[#This Row],[AUXILIAR]])","v":6},624564,"EMISIÓN O VENTA DE PUTS SOBRE TITULOS"]
[{"$f":"LEN(PUC[[#This Row],[AUXILIAR]])","v":6},624568,"COMPRADAS PUTS SOBRE DIVISAS"]
[{"$f":"LEN(PUC[[#This Row],[AUXILIAR]])","v":6},624572,"EMISIÓN O VENTA DE PUTS SOBRE INDICES"]
[{"$f":"LEN(PUC[[#This Row],[AUXILIAR]])","v":6},624576,"COMPRADAS PUTS SOBRE TITULOS"]
[{"$f":"LEN(PUC[[#This Row],[AUXILIAR]])","v":6},624580,"EMISIÓN O VENTA DE PUTS - OTRAS"]
[{"$f":"LEN(PUC[[#This Row],[AUXILIAR]])","v":6},624584,"COMPRADAS CAPS,FLOORS,COLL SOB DIVIS"]
[{"$f":"LEN(PUC[[#This Row],[AUXILIAR]])","v":6},624588,"EMISIÓN O VENTA DE OPCIONES ¿ OTRAS"]
[{"$f":"LEN(PUC[[#This Row],[AUXILIAR]])","v":6},625000,"OBLIGACIONES EN OPCIONES ¿ DE COBERTURA "]
[{"$f":"LEN(PUC[[#This Row],[AUXILIAR]])","v":6},625008,"EMISIÓN O VENTA DE CALL SOBRE MONEDAS"]
[{"$f":"LEN(PUC[[#This Row],[AUXILIAR]])","v":6},625016,"EMISIÓN O VENTA DE CALL SOBRE TASAS DE I"]
[{"$f":"LEN(PUC[[#This Row],[AUXILIAR]])","v":6},625024,"EMISIÓN O VENTA DE CALL SOBRE TITULOS"]
[{"$f":"LEN(PUC[[#This Row],[AUXILIAR]])","v":6},625032,"EMISIÓN O VENTA DE CALL SOBRE INDICES"]
[{"$f":"LEN(PUC[[#This Row],[AUXILIAR]])","v":6},625040,"EMISIÓN O VENTA DE CALL - OTRAS"]
[{"$f":"LEN(PUC[[#This Row],[AUXILIAR]])","v":6},625048,"EMISIÓN O VENTA DE PUTS SOBRE MONEDAS"]
[{"$f":"LEN(PUC[[#This Row],[AUXILIAR]])","v":6},625056,"EMISIÓN O VENTA DE PUTS SOBRE TASAS DE I"]
[{"$f":"LEN(PUC[[#This Row],[AUXILIAR]])","v":6},625064,"EMISIÓN O VENTA DE PUTS SOBRE TITULOS"]
[{"$f":"LEN(PUC[[#This Row],[AUXILIAR]])","v":6},625072,"EMISIÓN O VENTA DE PUTS SOBRE INDICES"]
[{"$f":"LEN(PUC[[#This Row],[AUXILIAR]])","v":6},625080,"EMISIÓN O VENTA DE PUTS - OTRAS"]
[{"$f":"LEN(PUC[[#This Row],[AUXILIAR]])","v":6},625088,"EMISIÓN O VENTA DE OPCIONES - OTRAS"]
[{"$f":"LEN(PUC[[#This Row],[AUXILIAR]])","v":6},625500,"CAPITAL GARANTIA"]
[{"$f":"LEN(PUC[[#This Row],[AUXILIAR]])","v":6},626000,"DEREC CEDIDOS POR AHORRAD EN ENTID EN LI"]
[{"$f":"LEN(PUC[[#This Row],[AUXILIAR]])","v":6},626200,"CUENTA POR PAGAR NACION LEY 546 DE 1999"]
[{"$f":"LEN(PUC[[#This Row],[AUXILIAR]])","v":6},626500,"INSTRUCCIONES DE PAGO DE GIROS"]
[{"$f":"LEN(PUC[[#This Row],[AUXILIAR]])","v":6},626505,"GIROS POR PAGAR"]
[{"$f":"LEN(PUC[[#This Row],[AUXILIAR]])","v":6},629500,"OTRAS CONTINGENCIAS ACREEDORAS"]
[{"$f":"LEN(PUC[[#This Row],[AUXILIAR]])","v":6},629505,"POR LITIGIOS"]
[{"$f":"LEN(PUC[[#This Row],[AUXILIAR]])","v":6},629510,"SUSTITUCION DE CARTERA"]
[{"$f":"LEN(PUC[[#This Row],[AUXILIAR]])","v":6},629515,"SEGURO DE CREDITO"]
[{"$f":"LEN(PUC[[#This Row],[AUXILIAR]])","v":6},629595,"OTRAS"]
[{"$f":"LEN(PUC[[#This Row],[AUXILIAR]])","v":6},630000,"DEUDORAS POR CONTRA"]
[{"$f":"LEN(PUC[[#This Row],[AUXILIAR]])","v":6},630500,"DEUDORAS POR CONTRA (CR)"]
[{"$f":"LEN(PUC[[#This Row],[AUXILIAR]])","v":6},630700,"VALORES ENTREGADOS EN OPERACIONES REPO Y"]
[{"$f":"LEN(PUC[[#This Row],[AUXILIAR]])","v":6},630705,"VALORES EN OPERACIONES REPO Y SIMULTANEA"]
[{"$f":"LEN(PUC[[#This Row],[AUXILIAR]])","v":6},630800,"VALORES ENTREGADOS EN OPERACIONES DE TRA"]
[{"$f":"LEN(PUC[[#This Row],[AUXILIAR]])","v":6},630805,"VALORES ENTREGADOS EN OPERACIONES DE TRA"]
[{"$f":"LEN(PUC[[#This Row],[AUXILIAR]])","v":6},630900,"VALORES ENTREGADOS EN OPERACIONES RELACI"]
[{"$f":"LEN(PUC[[#This Row],[AUXILIAR]])","v":6},630905,"VALORES ENTREGADOS EN OPERACIONES RELACI"]
[{"$f":"LEN(PUC[[#This Row],[AUXILIAR]])","v":6},631100,"TITUL. O VALORES ENDOSAD. EN PROPIED. AL"]
[{"$f":"LEN(PUC[[#This Row],[AUXILIAR]])","v":6},631105,"INVERSIONES FINANCIERAS"]
[{"$f":"LEN(PUC[[#This Row],[AUXILIAR]])","v":6},631110,"PAGARES DE CARTERA"]
[{"$f":"LEN(PUC[[#This Row],[AUXILIAR]])","v":6},631200,"VAL AL VENC ENTREG EN GARAN CRCC X CONTR"]
[{"$f":"LEN(PUC[[#This Row],[AUXILIAR]])","v":6},631205,"VAL AL VENC ENTREG EN GARAN CRCC X CONTR"]
[{"$f":"LEN(PUC[[#This Row],[AUXILIAR]])","v":6},633000,"INT CARTERA DE CREDITOS POR CONTRA"]
[{"$f":"LEN(PUC[[#This Row],[AUXILIAR]])","v":6},633005,"CREDITOS COMERCIALES ESTIPULADOS EN ML"]
[{"$f":"LEN(PUC[[#This Row],[AUXILIAR]])","v":6},633007,"CREDITOS COMERCIALES ESTIPULADOS EN ME"]
[{"$f":"LEN(PUC[[#This Row],[AUXILIAR]])","v":6},633010,"CREDITOS CONSUMO ESTIPULADOS ML"]
[{"$f":"LEN(PUC[[#This Row],[AUXILIAR]])","v":6},633012,"CREDITOS CONSUMO ESTIPULADOS ME"]
[{"$f":"LEN(PUC[[#This Row],[AUXILIAR]])","v":6},633015,"CREDITOS VIVIENDA ESTIPULADOS ML"]
[{"$f":"LEN(PUC[[#This Row],[AUXILIAR]])","v":6},633017,"CREDITOS VIVIENDA ESTIPULADOS ME"]
[{"$f":"LEN(PUC[[#This Row],[AUXILIAR]])","v":6},633019,"MICROCREDITOS ESTIPULADOS ML"]
[{"$f":"LEN(PUC[[#This Row],[AUXILIAR]])","v":6},633021,"MICROCREDITOS ESTIPULADOS ME"]
[{"$f":"LEN(PUC[[#This Row],[AUXILIAR]])","v":6},640000,"DEUDORAS"]
[{"$f":"LEN(PUC[[#This Row],[AUXILIAR]])","v":6},640700,"VALORES ENTREGADOS EN OPERACIONES REPO Y"]
[{"$f":"LEN(PUC[[#This Row],[AUXILIAR]])","v":6},640705,"VALORES EN OPERACIONES REPO ABIERTO (SIN"]
[{"$f":"LEN(PUC[[#This Row],[AUXILIAR]])","v":6},640710,"VALORES EN OPERACIONES REPO ABIERTO (CON"]
[{"$f":"LEN(PUC[[#This Row],[AUXILIAR]])","v":6},640715,"VALORES EN OPERACIONES REPO CERRADO (SIN"]
[{"$f":"LEN(PUC[[#This Row],[AUXILIAR]])","v":6},640720,"VALORES EN OPERACIONES REPO CERRADO (CON"]
[{"$f":"LEN(PUC[[#This Row],[AUXILIAR]])","v":6},640725,"VALORES POR LLAMADO AL MARGEN EN OPERACI"]
[{"$f":"LEN(PUC[[#This Row],[AUXILIAR]])","v":6},640730,"VALORES EN OPERACIONES SIMULTANEAS"]
[{"$f":"LEN(PUC[[#This Row],[AUXILIAR]])","v":6},640735,"VALORES POR LLAMADO AL MARGEN EN OPERACI"]
[{"$f":"LEN(PUC[[#This Row],[AUXILIAR]])","v":6},640800,"VALORES ENTREGADOS EN OPERACIONES DE TRA"]
[{"$f":"LEN(PUC[[#This Row],[AUXILIAR]])","v":6},640805,"VALORES PRINCIPALES ENTREGADOS EN OPERAC"]
[{"$f":"LEN(PUC[[#This Row],[AUXILIAR]])","v":6},640810,"VALORES SECUNDARIOS ENTREGADOS EN OPERAC"]
[{"$f":"LEN(PUC[[#This Row],[AUXILIAR]])","v":6},640815,"VALORES POR LLAMADO AL MARGEN EN OPERACI"]
[{"$f":"LEN(PUC[[#This Row],[AUXILIAR]])","v":6},640900,"VALORES ENTREGADOS EN OPERACIONES RELACI"]
[{"$f":"LEN(PUC[[#This Row],[AUXILIAR]])","v":6},640905,"VALORES EN OPERACIONES REPO SOBRE REPO"]
[{"$f":"LEN(PUC[[#This Row],[AUXILIAR]])","v":6},640910,"VALORES EN OPERACIONES REPO SOBRE SIMULT"]
[{"$f":"LEN(PUC[[#This Row],[AUXILIAR]])","v":6},640915,"VALORES EN OPERACIONES SIMULTANEAS SOBRE"]
[{"$f":"LEN(PUC[[#This Row],[AUXILIAR]])","v":6},640920,"VALORES EN OPERACIONES SIMULTANEAS SOBRE"]
[{"$f":"LEN(PUC[[#This Row],[AUXILIAR]])","v":6},640925,"VALORES EN OPERACIONES REPO SOBRE TRANSF"]
[{"$f":"LEN(PUC[[#This Row],[AUXILIAR]])","v":6},640930,"VALORES EN OPERACIONES SIMULTANEAS SOBRE"]
[{"$f":"LEN(PUC[[#This Row],[AUXILIAR]])","v":6},640935,"VALORES EN OTRAS OPERACIONES RELACIONADA"]
[{"$f":"LEN(PUC[[#This Row],[AUXILIAR]])","v":6},641100,"TITU.O VALOR.ENDOSA. EN PROPIED. AL BR"]
[{"$f":"LEN(PUC[[#This Row],[AUXILIAR]])","v":6},641105,"INVERSIONES FINANCIERAS"]
[{"$f":"LEN(PUC[[#This Row],[AUXILIAR]])","v":6},641110,"PAGARES DE CARTERA"]
[{"$f":"LEN(PUC[[#This Row],[AUXILIAR]])","v":6},641200,"VALORES AL VENC ENTREGAD EN GARANT CRCC "]
[{"$f":"LEN(PUC[[#This Row],[AUXILIAR]])","v":6},641205,"VALORES AL VENC ENTREGAD EN GARANT CRCC "]
[{"$f":"LEN(PUC[[#This Row],[AUXILIAR]])","v":6},641300,"COMISION RETIROS PARCIALES"]
[{"$f":"LEN(PUC[[#This Row],[AUXILIAR]])","v":6},643000,"INTERESES CARTERA DE CREDITOS"]
[{"$f":"LEN(PUC[[#This Row],[AUXILIAR]])","v":6},643020,"CATEGORIA A RIESGO NORMAL VIVIENDA"]
[{"$f":"LEN(PUC[[#This Row],[AUXILIAR]])","v":6},643022,"CATEGORIA B RIESGO ACEPTABLE  VIVIEND"]
[{"$f":"LEN(PUC[[#This Row],[AUXILIAR]])","v":6},643024,"CATEGORIA C RIESGO APRECIABLE  VIVIEN"]
[{"$f":"LEN(PUC[[#This Row],[AUXILIAR]])","v":6},643026,"CATEGORIA D RIESGO SIGNIFICATIVO VIVIEND"]
[{"$f":"LEN(PUC[[#This Row],[AUXILIAR]])","v":6},643028,"CATEGORIA E RIESGO INCOBRABILID  VIVIEND"]
[{"$f":"LEN(PUC[[#This Row],[AUXILIAR]])","v":6},643030,"CATEGORIA A RIESGO NORMAL  CONSUMO"]
[{"$f":"LEN(PUC[[#This Row],[AUXILIAR]])","v":6},643032,"CATEGORIA B RIESGO ACEPTABLE CONSUMO"]
[{"$f":"LEN(PUC[[#This Row],[AUXILIAR]])","v":6},643034,"CATEGORIA C RIESGO APRECIABLE CONSUMO"]
[{"$f":"LEN(PUC[[#This Row],[AUXILIAR]])","v":6},643036,"CATEGORIA D RIESGO SIGNIFICATIVO CONSUMO"]
[{"$f":"LEN(PUC[[#This Row],[AUXILIAR]])","v":6},643038,"CATEGORIA E RIESGO INCOBRABIL  CONSUMO"]
[{"$f":"LEN(PUC[[#This Row],[AUXILIAR]])","v":6},643040,"CATEGORIA A RIESGO NORMAL MICROCREDITOS"]
[{"$f":"LEN(PUC[[#This Row],[AUXILIAR]])","v":6},643042,"CATEGORIA B RIESGO ACEPTABLE MICROCREDIT"]
[{"$f":"LEN(PUC[[#This Row],[AUXILIAR]])","v":6},643044,"CATEGORIA C RIESGO APRECIABLE MICROCREDI"]
[{"$f":"LEN(PUC[[#This Row],[AUXILIAR]])","v":6},643046,"CATEGORIA D RIESGO SIGNIFICATIVO MICROCR"]
[{"$f":"LEN(PUC[[#This Row],[AUXILIAR]])","v":6},643048,"CATEGORIA E RIESGO INCOBRABILIDAD MICROC"]
[{"$f":"LEN(PUC[[#This Row],[AUXILIAR]])","v":6},643050,"CATEGORIA A RIESGO NORMAL COMERCIAL"]
[{"$f":"LEN(PUC[[#This Row],[AUXILIAR]])","v":6},643052,"CATEGORIA B RIESGO ACEPTABLE COMERCIAL"]
[{"$f":"LEN(PUC[[#This Row],[AUXILIAR]])","v":6},643054,"CATEGORIA C RIESGO APRECIABLE COMERCIAL"]
[{"$f":"LEN(PUC[[#This Row],[AUXILIAR]])","v":6},643056,"CATEGORIA D RIESGO SIGNIFICATIVO COMERCI"]
[{"$f":"LEN(PUC[[#This Row],[AUXILIAR]])","v":6},643058,"CATEGORIA E RIESGO INCOBRABILIDAD COMERC"]
[{"$f":"LEN(PUC[[#This Row],[AUXILIAR]])","v":6},643200,"INTERESES LEASING FINANCIERO"]
[{"$f":"LEN(PUC[[#This Row],[AUXILIAR]])","v":6},643230,"CATEG A RIESGO NORMAL CONSUMO"]
[{"$f":"LEN(PUC[[#This Row],[AUXILIAR]])","v":6},643232,"CATEG B RIESGO ACEPTABLE CONSUMO"]
[{"$f":"LEN(PUC[[#This Row],[AUXILIAR]])","v":6},643234,"CATEG C RIESGO APRECIABLE CONSUMO"]
[{"$f":"LEN(PUC[[#This Row],[AUXILIAR]])","v":6},643236,"CATEG D RIESGO SIGNIFICATIVO CONSUMO"]
[{"$f":"LEN(PUC[[#This Row],[AUXILIAR]])","v":6},643238,"CATEG E RIESGO INCOBRABILIDAD CONSUMO"]
[{"$f":"LEN(PUC[[#This Row],[AUXILIAR]])","v":6},643240,"CATEG A RIESGO NORMAL MICROCREDITOS"]
[{"$f":"LEN(PUC[[#This Row],[AUXILIAR]])","v":6},643242,"CATEG B RIESGO ACEPTABLE MICROCREDITOS"]
[{"$f":"LEN(PUC[[#This Row],[AUXILIAR]])","v":6},643244,"CATEG C RIESGO APRECIABLE MICROCREDITOS"]
[{"$f":"LEN(PUC[[#This Row],[AUXILIAR]])","v":6},643246,"CATEG D RIESGO SIGNIFICATIVO MICROCREDIT"]
[{"$f":"LEN(PUC[[#This Row],[AUXILIAR]])","v":6},643248,"CATEG E RIESGO INCOBRABILIDAD MICROCREDI"]
[{"$f":"LEN(PUC[[#This Row],[AUXILIAR]])","v":6},643250,"CATEG A RIESGO NORMAL COMERCIAL"]
[{"$f":"LEN(PUC[[#This Row],[AUXILIAR]])","v":6},643252,"CATEG B RIESGO ACEPTABLE COMERCIAL"]
[{"$f":"LEN(PUC[[#This Row],[AUXILIAR]])","v":6},643254,"CATEG C RIESGO APRECIABLE COMERCIAL"]
[{"$f":"LEN(PUC[[#This Row],[AUXILIAR]])","v":6},643256,"CATEG D RIESGO SIGNIFICATIVO COMERCIAL"]
[{"$f":"LEN(PUC[[#This Row],[AUXILIAR]])","v":6},643258,"CATEG E RIESGO INCOBRABILIDAD COMERCIAL"]
[{"$f":"LEN(PUC[[#This Row],[AUXILIAR]])","v":6},643500,"CORRECCION MONETARIA CARTERA DE CREDITOS"]
[{"$f":"LEN(PUC[[#This Row],[AUXILIAR]])","v":6},643505,"CREDITOS COMERCIALES"]
[{"$f":"LEN(PUC[[#This Row],[AUXILIAR]])","v":6},643515,"CREDITOS DE VIVIENDA"]
[{"$f":"LEN(PUC[[#This Row],[AUXILIAR]])","v":6},643600,"CORRECC MONETARIA OPERAC LEASING FINANC"]
[{"$f":"LEN(PUC[[#This Row],[AUXILIAR]])","v":6},643605,"COMERCIALES"]
[{"$f":"LEN(PUC[[#This Row],[AUXILIAR]])","v":6},643615,"HABITACIONALES"]
[{"$f":"LEN(PUC[[#This Row],[AUXILIAR]])","v":6},643700,"CANONES Y SANCIONES EN CONTRATOS DE LEAS"]
[{"$f":"LEN(PUC[[#This Row],[AUXILIAR]])","v":6},643710,"SANCIONES POR INCUMPLIMIENTO DE CON"]
[{"$f":"LEN(PUC[[#This Row],[AUXILIAR]])","v":6},643722,"CATEGORIA A CREDITO NORMAL CONSUM"]
[{"$f":"LEN(PUC[[#This Row],[AUXILIAR]])","v":6},643724,"CATEGORIA B CREDITO ACEPTABLE  CONSUM"]
[{"$f":"LEN(PUC[[#This Row],[AUXILIAR]])","v":6},643726,"CATEGORIA C CREDITO APRECIABLE CONSUMO"]
[{"$f":"LEN(PUC[[#This Row],[AUXILIAR]])","v":6},643732,"CATEG D CREDITO SIGNIFICATIVO CONSUMO"]
[{"$f":"LEN(PUC[[#This Row],[AUXILIAR]])","v":6},643734,"CATEG E CREDITO IRRECUPERABLE CONSUMO"]
[{"$f":"LEN(PUC[[#This Row],[AUXILIAR]])","v":6},643736,"CATEG A CREDITO NORMAL COMERCIAL"]
[{"$f":"LEN(PUC[[#This Row],[AUXILIAR]])","v":6},643738,"CATEG B CREDITO ACEPTABLE COMERCIAL"]
[{"$f":"LEN(PUC[[#This Row],[AUXILIAR]])","v":6},643742,"CATEG C CREDITO APRECIABLE COMERCIAL"]
[{"$f":"LEN(PUC[[#This Row],[AUXILIAR]])","v":6},643744,"CATEG D CREDITO SIGNIFICATIVO COMERCIAL"]
[{"$f":"LEN(PUC[[#This Row],[AUXILIAR]])","v":6},643746,"CATEG E CREDITO IRRECUPERABLE COMERCIAL"]
[{"$f":"LEN(PUC[[#This Row],[AUXILIAR]])","v":6},643748,"CATEG A CREDITO NORMAL MICROCREDITOS"]
[{"$f":"LEN(PUC[[#This Row],[AUXILIAR]])","v":6},643750,"CATEG B CREDITO ACEPTABLE MICROCREDITOS"]
[{"$f":"LEN(PUC[[#This Row],[AUXILIAR]])","v":6},643754,"CATEG C CREDITO APRECIABLE MICROCREDITOS"]
[{"$f":"LEN(PUC[[#This Row],[AUXILIAR]])","v":6},643756,"CATEG D CREDITO SIGNIFICATIVO MICROCREDI"]
[{"$f":"LEN(PUC[[#This Row],[AUXILIAR]])","v":6},643758,"CATEG E CREDITO IRRECUPERABLE MICROCREDI"]
[{"$f":"LEN(PUC[[#This Row],[AUXILIAR]])","v":6},644000,"CORRESPONSALES GIROS Y COMISIONES"]
[{"$f":"LEN(PUC[[#This Row],[AUXILIAR]])","v":6},644005,"GIROS"]
[{"$f":"LEN(PUC[[#This Row],[AUXILIAR]])","v":6},644010,"COMISIONES"]
[{"$f":"LEN(PUC[[#This Row],[AUXILIAR]])","v":6},644500,"DERECHOS EN OPCIONES ¿ DE ESPECULACIÓN "]
[{"$f":"LEN(PUC[[#This Row],[AUXILIAR]])","v":6},644504,"COMPRAS CALLS SOBRE MONEDAS"]
[{"$f":"LEN(PUC[[#This Row],[AUXILIAR]])","v":6},644508,"EMITIDAS CALLS SOBRE TASAS"]
[{"$f":"LEN(PUC[[#This Row],[AUXILIAR]])","v":6},644512,"COMPRAS DE CALL SOBRE TASAS DE INTERES"]
[{"$f":"LEN(PUC[[#This Row],[AUXILIAR]])","v":6},644516,"EMITIDAS CALLS OTRAS"]
[{"$f":"LEN(PUC[[#This Row],[AUXILIAR]])","v":6},644520,"COMPRAS DE CALL SOBRE TITULOS"]
[{"$f":"LEN(PUC[[#This Row],[AUXILIAR]])","v":6},644524,"EMITIDAS PUTS SOBRE TASAS"]
[{"$f":"LEN(PUC[[#This Row],[AUXILIAR]])","v":6},644528,"COMPRAS DE CALL SOBRE INDICES"]
[{"$f":"LEN(PUC[[#This Row],[AUXILIAR]])","v":6},644532,"EMITIDAS PUTS OTRAS"]
[{"$f":"LEN(PUC[[#This Row],[AUXILIAR]])","v":6},644536,"COMPRA DE CALL -OTRAS"]
[{"$f":"LEN(PUC[[#This Row],[AUXILIAR]])","v":6},644540,"EMITIDAS CALLS,FLOORS,COLL SOB TASAS"]
[{"$f":"LEN(PUC[[#This Row],[AUXILIAR]])","v":6},644544,"COMPRA DE PUTS SOBRE MONEDAS"]
[{"$f":"LEN(PUC[[#This Row],[AUXILIAR]])","v":6},644548,"EMITIDAS CAPS,FLOORS,COLL Y OTRAS"]
[{"$f":"LEN(PUC[[#This Row],[AUXILIAR]])","v":6},644552,"COMPRAS DE PUTS SOBRE TASAS DE INTERES"]
[{"$f":"LEN(PUC[[#This Row],[AUXILIAR]])","v":6},644556,"COMPRADAS CALLS SOBRE TASAS"]
[{"$f":"LEN(PUC[[#This Row],[AUXILIAR]])","v":6},644560,"COMPRAS DE PUTS SOBRE TITULOS"]
[{"$f":"LEN(PUC[[#This Row],[AUXILIAR]])","v":6},644564,"COMPRADAS CALLS OTRAS"]
[{"$f":"LEN(PUC[[#This Row],[AUXILIAR]])","v":6},644568,"COMPRAS DE PUTS SOBRE INDICES"]
[{"$f":"LEN(PUC[[#This Row],[AUXILIAR]])","v":6},644572,"COMPRADAS PUTS SOBRE TASAS"]
[{"$f":"LEN(PUC[[#This Row],[AUXILIAR]])","v":6},644576,"COMPRAS DE PUTS - OTRAS"]
[{"$f":"LEN(PUC[[#This Row],[AUXILIAR]])","v":6},644580,"COMPRADAS PUTS - OTRAS"]
[{"$f":"LEN(PUC[[#This Row],[AUXILIAR]])","v":6},644584,"COMPRAS DE OPCIONES - OTRAS"]
[{"$f":"LEN(PUC[[#This Row],[AUXILIAR]])","v":6},644588,"COMPRADAS CAPS,FLOORS,COLL SOB TASAS"]
[{"$f":"LEN(PUC[[#This Row],[AUXILIAR]])","v":6},645000,"DERECHOS EN OPCIONES ¿ DE COBERTURA "]
[{"$f":"LEN(PUC[[#This Row],[AUXILIAR]])","v":6},645004,"COMPRAS CALLS SOBRE MONEDAS"]
[{"$f":"LEN(PUC[[#This Row],[AUXILIAR]])","v":6},645012,"COMPRAS DE CALL SOBRE TASAS DE INTERES"]
[{"$f":"LEN(PUC[[#This Row],[AUXILIAR]])","v":6},645020,"COMPRAS DE CALL SOBRE TITULOS"]
[{"$f":"LEN(PUC[[#This Row],[AUXILIAR]])","v":6},645028,"COMPRAS DE CALL SOBRE INDICES"]
[{"$f":"LEN(PUC[[#This Row],[AUXILIAR]])","v":6},645036,"COMPRA DE CALL -OTRAS"]
[{"$f":"LEN(PUC[[#This Row],[AUXILIAR]])","v":6},645044,"COMPRA DE PUTS SOBRE MONEDAS"]
[{"$f":"LEN(PUC[[#This Row],[AUXILIAR]])","v":6},645052,"COMPRAS DE PUTS SOBRE TASAS DE INTERES"]
[{"$f":"LEN(PUC[[#This Row],[AUXILIAR]])","v":6},645060,"COMPRAS DE PUTS SOBRE TITULOS"]
[{"$f":"LEN(PUC[[#This Row],[AUXILIAR]])","v":6},645068,"COMPRAS DE PUTS SOBRE INDICES"]
[{"$f":"LEN(PUC[[#This Row],[AUXILIAR]])","v":6},645076,"COMPRAS DE PUTS - OTRAS"]
[{"$f":"LEN(PUC[[#This Row],[AUXILIAR]])","v":6},645084,"COMPRAS DE OPCIONES ¿ OTRAS"]
[{"$f":"LEN(PUC[[#This Row],[AUXILIAR]])","v":6},645500,"DERECHOS POR CAPITAL GARANTIA"]
[{"$f":"LEN(PUC[[#This Row],[AUXILIAR]])","v":6},646200,"CARTERA DE VIVIENDA ALIVIO LEY 546 DE 99"]
[{"$f":"LEN(PUC[[#This Row],[AUXILIAR]])","v":6},646205,"CAPITAL"]
[{"$f":"LEN(PUC[[#This Row],[AUXILIAR]])","v":6},646210,"INTERESES"]
[{"$f":"LEN(PUC[[#This Row],[AUXILIAR]])","v":6},646215,"SEGUROS"]
[{"$f":"LEN(PUC[[#This Row],[AUXILIAR]])","v":6},646220,"OTROS CONCEPTOS"]
[{"$f":"LEN(PUC[[#This Row],[AUXILIAR]])","v":6},646300,"CONTRIBUCIONES PENDIENTES DE RECAUDO"]
[{"$f":"LEN(PUC[[#This Row],[AUXILIAR]])","v":6},647500,"CANONES POR RECIBIR"]
[{"$f":"LEN(PUC[[#This Row],[AUXILIAR]])","v":6},647505,"PARTE CORRIENTE"]
[{"$f":"LEN(PUC[[#This Row],[AUXILIAR]])","v":6},647510,"PARTE NO CORRIENTE"]
[{"$f":"LEN(PUC[[#This Row],[AUXILIAR]])","v":6},648000,"OPCIONES DE COMPRA POR RECIBIR"]
[{"$f":"LEN(PUC[[#This Row],[AUXILIAR]])","v":6},648005,"PARTE CORRIENTE"]
[{"$f":"LEN(PUC[[#This Row],[AUXILIAR]])","v":6},648010,"PARTE NO CORRIENTE"]
[{"$f":"LEN(PUC[[#This Row],[AUXILIAR]])","v":6},648500,"GARANTIAS CEDIDAS POR EL FNG."]
[{"$f":"LEN(PUC[[#This Row],[AUXILIAR]])","v":6},649500,"OTRAS CONTINGENCIAS DEUDORAS"]
[{"$f":"LEN(PUC[[#This Row],[AUXILIAR]])","v":6},649505,"PERDIDAS FISCALES POR AMORTIZAR"]
[{"$f":"LEN(PUC[[#This Row],[AUXILIAR]])","v":6},649510,"EXCESO ENTRE RENTAS PRESUNTIVA Y LI"]
[{"$f":"LEN(PUC[[#This Row],[AUXILIAR]])","v":6},649595,"OTRAS"]
[{"$f":"LEN(PUC[[#This Row],[AUXILIAR]])","v":6},800000,"CUENTAS DE ORDEN"]
[{"$f":"LEN(PUC[[#This Row],[AUXILIAR]])","v":6},810000,"DEUDORAS"]
[{"$f":"LEN(PUC[[#This Row],[AUXILIAR]])","v":6},810100,"CAPITAL GARANTIA"]
[{"$f":"LEN(PUC[[#This Row],[AUXILIAR]])","v":6},810105,"GOBIERNO NACIONAL"]
[{"$f":"LEN(PUC[[#This Row],[AUXILIAR]])","v":6},810110,"FONDO DE GARANTIAS"]
[{"$f":"LEN(PUC[[#This Row],[AUXILIAR]])","v":6},810500,"BIENES Y VALORES ENTREGADOS EN CUST"]
[{"$f":"LEN(PUC[[#This Row],[AUXILIAR]])","v":6},810505,"BIENES Y VALORES ENTREGADOS EN CUST"]
[{"$f":"LEN(PUC[[#This Row],[AUXILIAR]])","v":6},810510,"Compensacion electronica"]
[{"$f":"LEN(PUC[[#This Row],[AUXILIAR]])","v":6},810700,"PRECIO JUSTO DE INTERCAMBIO DE POSICIONE"]
[{"$f":"LEN(PUC[[#This Row],[AUXILIAR]])","v":6},810705,"COBERTURAS DE FLUJOS DE EFECTIVO POSICIO"]
[{"$f":"LEN(PUC[[#This Row],[AUXILIAR]])","v":6},810710,"COBERTURAS DE OPERACIONES ACTIVAS EN MON"]
[{"$f":"LEN(PUC[[#This Row],[AUXILIAR]])","v":6},811000,"BIENES Y VALORES ENTREGADOS EN GARA"]
[{"$f":"LEN(PUC[[#This Row],[AUXILIAR]])","v":6},811005,"INMUEBLES"]
[{"$f":"LEN(PUC[[#This Row],[AUXILIAR]])","v":6},811010,"VALORES MOBILIARIOS"]
[{"$f":"LEN(PUC[[#This Row],[AUXILIAR]])","v":6},811020,"OTROS BIENES MUEBLES"]
[{"$f":"LEN(PUC[[#This Row],[AUXILIAR]])","v":6},811100,"VALORIZACION BIENES RECIBIDOS EN PAGO"]
[{"$f":"LEN(PUC[[#This Row],[AUXILIAR]])","v":6},811105,"BIENES MUEBLES"]
[{"$f":"LEN(PUC[[#This Row],[AUXILIAR]])","v":6},811110,"BIENES INMUEBLES DESTINADOS A VIVIENDA"]
[{"$f":"LEN(PUC[[#This Row],[AUXILIAR]])","v":6},811115,"BIENES INMUEBLES DIFERENTES A VIVIENDA"]
[{"$f":"LEN(PUC[[#This Row],[AUXILIAR]])","v":6},811200,"BIEN INMUEB DEST A VIVI REC PAGO DAD ARR"]
[{"$f":"LEN(PUC[[#This Row],[AUXILIAR]])","v":6},811205,"BIENES DADOS EN ARRENDAMIENTO"]
[{"$f":"LEN(PUC[[#This Row],[AUXILIAR]])","v":6},811210,"CANON DE ARRENDAMIENTO"]
[{"$f":"LEN(PUC[[#This Row],[AUXILIAR]])","v":6},811500,"REMESAS Y OTROS EFECTOS ENVIADO.AL COBRO"]
[{"$f":"LEN(PUC[[#This Row],[AUXILIAR]])","v":6},811505,"PAIS"]
[{"$f":"LEN(PUC[[#This Row],[AUXILIAR]])","v":6},811510,"EXTERIOR"]
[{"$f":"LEN(PUC[[#This Row],[AUXILIAR]])","v":6},811900,"CHEQUES NEGOCIADOS IMPAGADOS"]
[{"$f":"LEN(PUC[[#This Row],[AUXILIAR]])","v":6},812000,"ACTIVOS CASTIGADOS"]
[{"$f":"LEN(PUC[[#This Row],[AUXILIAR]])","v":6},812005,"INVERSIONES"]
[{"$f":"LEN(PUC[[#This Row],[AUXILIAR]])","v":6},812010,"CARTERA DE CREDITOS COMERCIAL"]
[{"$f":"LEN(PUC[[#This Row],[AUXILIAR]])","v":6},812011,"CARTERA DE CREDITOS DE CONSUMO"]
[{"$f":"LEN(PUC[[#This Row],[AUXILIAR]])","v":6},812012,"CARTERA DE CREDITOS DE VIVIENDA"]
[{"$f":"LEN(PUC[[#This Row],[AUXILIAR]])","v":6},812013,"CARTERA DE CREDITOS MICROCREDITO"]
[{"$f":"LEN(PUC[[#This Row],[AUXILIAR]])","v":6},812015,"CUENTAS POR COBRAR CREDITOS COMERCIAL"]
[{"$f":"LEN(PUC[[#This Row],[AUXILIAR]])","v":6},812016,"CUENTAS POR COBRAR CREDITOS DE CONSUMO"]
[{"$f":"LEN(PUC[[#This Row],[AUXILIAR]])","v":6},812017,"CUENTAS POR COBRAR CREDITOS DE VIVIENDA"]
[{"$f":"LEN(PUC[[#This Row],[AUXILIAR]])","v":6},812018,"CUENTAS POR COBRAR CREDITOS MICROCREDITO"]
[{"$f":"LEN(PUC[[#This Row],[AUXILIAR]])","v":6},812020,"OTROS ACTIVOS"]
[{"$f":"LEN(PUC[[#This Row],[AUXILIAR]])","v":6},812500,"CREDITOS A FAVOR NO UTILIZADOS"]
[{"$f":"LEN(PUC[[#This Row],[AUXILIAR]])","v":6},812505,"PAIS"]
[{"$f":"LEN(PUC[[#This Row],[AUXILIAR]])","v":6},812510,"EXTERIOR"]
[{"$f":"LEN(PUC[[#This Row],[AUXILIAR]])","v":6},812800,"LINEAS DE CREDITO DIRECTO"]
[{"$f":"LEN(PUC[[#This Row],[AUXILIAR]])","v":6},812805,"POR UTILIZAR"]
[{"$f":"LEN(PUC[[#This Row],[AUXILIAR]])","v":6},812810,"UTILIZADAS"]
[{"$f":"LEN(PUC[[#This Row],[AUXILIAR]])","v":6},813100,"INTERESES CAPITALIZ CARTERA DE CRED MORA"]
[{"$f":"LEN(PUC[[#This Row],[AUXILIAR]])","v":6},813105,"CARTERA COMERCIAL"]
[{"$f":"LEN(PUC[[#This Row],[AUXILIAR]])","v":6},813110,"CARTERA DE CONSUMO"]
[{"$f":"LEN(PUC[[#This Row],[AUXILIAR]])","v":6},813115,"CARTERA DE VIVIENDA"]
[{"$f":"LEN(PUC[[#This Row],[AUXILIAR]])","v":6},813200,"REAJ UNID VLOR REAL CONT CART CRED MORA"]
[{"$f":"LEN(PUC[[#This Row],[AUXILIAR]])","v":6},813205,"CARTERA COMERCIAL"]
[{"$f":"LEN(PUC[[#This Row],[AUXILIAR]])","v":6},813210,"CARTERA DE CONSUMO"]
[{"$f":"LEN(PUC[[#This Row],[AUXILIAR]])","v":6},813215,"CARTERA DE VIVIENDA"]
[{"$f":"LEN(PUC[[#This Row],[AUXILIAR]])","v":6},813300,"AJUSTE POR DIF.EN CAMB.X REEXPRES.DE CAR"]
[{"$f":"LEN(PUC[[#This Row],[AUXILIAR]])","v":6},813900,"CREDITOS FINANCIADOS CON BONOS HIPOTECAR"]
[{"$f":"LEN(PUC[[#This Row],[AUXILIAR]])","v":6},814000,"TITULOS DE INVERSION NO COLOCADOS"]
[{"$f":"LEN(PUC[[#This Row],[AUXILIAR]])","v":6},814005,"ACCIONES"]
[{"$f":"LEN(PUC[[#This Row],[AUXILIAR]])","v":6},814010,"BONOS"]
[{"$f":"LEN(PUC[[#This Row],[AUXILIAR]])","v":6},814015,"CEDULAS"]
[{"$f":"LEN(PUC[[#This Row],[AUXILIAR]])","v":6},814095,"OTROS TITULOS DE INVERSION"]
[{"$f":"LEN(PUC[[#This Row],[AUXILIAR]])","v":6},814500,"TITULOS DE INVERSION AMORTIZADOS"]
[{"$f":"LEN(PUC[[#This Row],[AUXILIAR]])","v":6},814505,"BONOS"]
[{"$f":"LEN(PUC[[#This Row],[AUXILIAR]])","v":6},814510,"CEDULAS"]
[{"$f":"LEN(PUC[[#This Row],[AUXILIAR]])","v":6},814595,"OTROS TITULOS DE INVERSION"]
[{"$f":"LEN(PUC[[#This Row],[AUXILIAR]])","v":6},814600,"AJUSTES POR INFLACION ACTIVOS"]
[{"$f":"LEN(PUC[[#This Row],[AUXILIAR]])","v":6},814614,"INV DISPON XA VTA EN TITULOS PARTICIPATI"]
[{"$f":"LEN(PUC[[#This Row],[AUXILIAR]])","v":6},814617,"BIENES REALIZABLES Y RECIB.EN PAGO"]
[{"$f":"LEN(PUC[[#This Row],[AUXILIAR]])","v":6},814618,"PROPIEDADES Y EQUIPO"]
[{"$f":"LEN(PUC[[#This Row],[AUXILIAR]])","v":6},814619,"OTROS ACTIVOS"]
[{"$f":"LEN(PUC[[#This Row],[AUXILIAR]])","v":6},814700,"DISTRIBUCION DEL CAPITAL SUSCRITO Y PAG."]
[{"$f":"LEN(PUC[[#This Row],[AUXILIAR]])","v":6},814705,"ACCIONES CON DIVIDENDO PREFERENCIAL"]
[{"$f":"LEN(PUC[[#This Row],[AUXILIAR]])","v":6},814710,"ACCIONES ORDINARIAS"]
[{"$f":"LEN(PUC[[#This Row],[AUXILIAR]])","v":6},815100,"FONDO DE LIQUIDEZ"]
[{"$f":"LEN(PUC[[#This Row],[AUXILIAR]])","v":6},815105,"DEPOSITOS DE AHORRO"]
[{"$f":"LEN(PUC[[#This Row],[AUXILIAR]])","v":6},815110,"DEP AHORRO CON CERTIFICADO A TERMINO"]
[{"$f":"LEN(PUC[[#This Row],[AUXILIAR]])","v":6},815115,"CERTIFICADOS DE DEPOSITO A TERMINO"]
[{"$f":"LEN(PUC[[#This Row],[AUXILIAR]])","v":6},815120,"OTROS DEPOSITOS"]
[{"$f":"LEN(PUC[[#This Row],[AUXILIAR]])","v":6},815300,"SEMOVIENTES EN PARTICIPACION"]
[{"$f":"LEN(PUC[[#This Row],[AUXILIAR]])","v":6},815305,"GANADO EN CRIA"]
[{"$f":"LEN(PUC[[#This Row],[AUXILIAR]])","v":6},815315,"GANADO DE LEVANTE"]
[{"$f":"LEN(PUC[[#This Row],[AUXILIAR]])","v":6},815325,"GANADO DE CEBA"]
[{"$f":"LEN(PUC[[#This Row],[AUXILIAR]])","v":6},815395,"OTROS"]
[{"$f":"LEN(PUC[[#This Row],[AUXILIAR]])","v":6},815400,"VALOR A APROPIAR PARA REPOSICION DE SEM"]
[{"$f":"LEN(PUC[[#This Row],[AUXILIAR]])","v":6},815500,"CREDITOS A ACCIONISTAS Y VINCULADOS"]
[{"$f":"LEN(PUC[[#This Row],[AUXILIAR]])","v":6},815600,"C X C RENDIM INV NEG EN TITULOS DE DEUDA"]
[{"$f":"LEN(PUC[[#This Row],[AUXILIAR]])","v":6},815605,"INTERESES"]
[{"$f":"LEN(PUC[[#This Row],[AUXILIAR]])","v":6},815610,"UNIDAD VLOR REAL UVR"]
[{"$f":"LEN(PUC[[#This Row],[AUXILIAR]])","v":6},815615,"TITULOS MIXTOS"]
[{"$f":"LEN(PUC[[#This Row],[AUXILIAR]])","v":6},815800,"C X C DIVID DEC TIT PART ALTA Y MIN BURS"]
[{"$f":"LEN(PUC[[#This Row],[AUXILIAR]])","v":6},815900,"INTER Y K INV EN TIT DEUDA VENC Y NO COB"]
[{"$f":"LEN(PUC[[#This Row],[AUXILIAR]])","v":6},815905,"INTERESES"]
[{"$f":"LEN(PUC[[#This Row],[AUXILIAR]])","v":6},815910,"CAPITAL"]
[{"$f":"LEN(PUC[[#This Row],[AUXILIAR]])","v":6},816000,"CREDITOS A MATRIZ,FILIALES Y SUBSID"]
[{"$f":"LEN(PUC[[#This Row],[AUXILIAR]])","v":6},816005,"ENTIDADES SECTOR FINANCIERO"]
[{"$f":"LEN(PUC[[#This Row],[AUXILIAR]])","v":6},816010,"ENTIDADES SECTOR ASEGURADOR"]
[{"$f":"LEN(PUC[[#This Row],[AUXILIAR]])","v":6},816015,"ENTIDADES SECTOR REAL"]
[{"$f":"LEN(PUC[[#This Row],[AUXILIAR]])","v":6},816020,"ENTIDADE SECTOR BURSATIL"]
[{"$f":"LEN(PUC[[#This Row],[AUXILIAR]])","v":6},816025,"ENTIDADES SECTOR PREVISIONAL"]
[{"$f":"LEN(PUC[[#This Row],[AUXILIAR]])","v":6},816200,"NUEVOS PRESTAMOS CARTERA AGROPECUAR"]
[{"$f":"LEN(PUC[[#This Row],[AUXILIAR]])","v":6},816205,"PEQUE#OS PRODUCTORES"]
[{"$f":"LEN(PUC[[#This Row],[AUXILIAR]])","v":6},816210,"DIFERENTE PEQUE#OS PRODUCTORES"]
[{"$f":"LEN(PUC[[#This Row],[AUXILIAR]])","v":6},816215,"PEQUE#OS PRODUCT.CULTIVOS DE SUBSIS"]
[{"$f":"LEN(PUC[[#This Row],[AUXILIAR]])","v":6},816500,"MERCANCIA ENTREGADA A OTROS ALMACEN"]
[{"$f":"LEN(PUC[[#This Row],[AUXILIAR]])","v":6},816505,"MERCANCIAS ENTREGADAS OTROS ALMACEN"]
[{"$f":"LEN(PUC[[#This Row],[AUXILIAR]])","v":6},816600,"DIVID EN ESPECIE X REVALOR DEL PATRIMONI"]
[{"$f":"LEN(PUC[[#This Row],[AUXILIAR]])","v":6},816615,"INV NEGOC EN TITULOS PARTICIPATIVOS"]
[{"$f":"LEN(PUC[[#This Row],[AUXILIAR]])","v":6},816620,"INV DISPON XA VTA TITULOS PARTICIPATIVOS"]
[{"$f":"LEN(PUC[[#This Row],[AUXILIAR]])","v":6},817000,"PROPIEDADES Y EQUIPO TOTALMENTE DEP"]
[{"$f":"LEN(PUC[[#This Row],[AUXILIAR]])","v":6},817005,"EDIFICIOS"]
[{"$f":"LEN(PUC[[#This Row],[AUXILIAR]])","v":6},817010,"EQUIPO MUEBLES Y ENSERES DE OFICINA"]
[{"$f":"LEN(PUC[[#This Row],[AUXILIAR]])","v":6},817015,"EQUIPO DE COMPUTACION"]
[{"$f":"LEN(PUC[[#This Row],[AUXILIAR]])","v":6},817020,"VEHICULOS"]
[{"$f":"LEN(PUC[[#This Row],[AUXILIAR]])","v":6},817025,"EQUIPO DE MOVILIZACION Y MAQUINARIA"]
[{"$f":"LEN(PUC[[#This Row],[AUXILIAR]])","v":6},817030,"SILOS"]
[{"$f":"LEN(PUC[[#This Row],[AUXILIAR]])","v":6},817035,"BODEGAS"]
[{"$f":"LEN(PUC[[#This Row],[AUXILIAR]])","v":6},817045,"BIENES RURALES"]
[{"$f":"LEN(PUC[[#This Row],[AUXILIAR]])","v":6},817100,"VALOR FISCAL DE LOS ACTIVOS"]
[{"$f":"LEN(PUC[[#This Row],[AUXILIAR]])","v":6},817300,"PROVISION PERSONAS EN SITUACION CONCORDA"]
[{"$f":"LEN(PUC[[#This Row],[AUXILIAR]])","v":6},817400,"INV NEG EN TITULOS DE DEUDA"]
[{"$f":"LEN(PUC[[#This Row],[AUXILIAR]])","v":6},817405,"GARANT POR LA NACION"]
[{"$f":"LEN(PUC[[#This Row],[AUXILIAR]])","v":6},817410,"GARANT POR BANCO REPUBLICA"]
[{"$f":"LEN(PUC[[#This Row],[AUXILIAR]])","v":6},817415,"ACEPTADOS X ESTAB DE CREDITO"]
[{"$f":"LEN(PUC[[#This Row],[AUXILIAR]])","v":6},817600,"INV XA MANTENER HASTA EL VENCIMIENTO"]
[{"$f":"LEN(PUC[[#This Row],[AUXILIAR]])","v":6},817605,"GARANTIZADOS POR LA NACION"]
[{"$f":"LEN(PUC[[#This Row],[AUXILIAR]])","v":6},817610,"GARANTIZADOS POR BANCO REPUBLICA"]
[{"$f":"LEN(PUC[[#This Row],[AUXILIAR]])","v":6},817615,"ACEPTADOS POR ESTABL DE CREDITO"]
[{"$f":"LEN(PUC[[#This Row],[AUXILIAR]])","v":6},817700,"INV DISP XA VTA EN TITULOS DE DEUDA"]
[{"$f":"LEN(PUC[[#This Row],[AUXILIAR]])","v":6},817705,"GARANTIZADOS POR LA NACION"]
[{"$f":"LEN(PUC[[#This Row],[AUXILIAR]])","v":6},817710,"GARANTIZADOS POR BANCO REPUBLICA"]
[{"$f":"LEN(PUC[[#This Row],[AUXILIAR]])","v":6},817715,"ACEPTADOS POR ESTABL DE CREDITO"]
[{"$f":"LEN(PUC[[#This Row],[AUXILIAR]])","v":6},819000,"OPER RECIP ACTIV CON MATRICES Y SUBORD"]
[{"$f":"LEN(PUC[[#This Row],[AUXILIAR]])","v":6},819002,"DISPONIBLE"]
[{"$f":"LEN(PUC[[#This Row],[AUXILIAR]])","v":6},819004,"OPERACIONES DEL MERCADO MONETARIO Y RELA"]
[{"$f":"LEN(PUC[[#This Row],[AUXILIAR]])","v":6},819006,"INV NEGOC EN TITULOS DE DEUDA"]
[{"$f":"LEN(PUC[[#This Row],[AUXILIAR]])","v":6},819008,"INV NEGOC EN TITULOS PARTICIPATIVOS"]
[{"$f":"LEN(PUC[[#This Row],[AUXILIAR]])","v":6},819009,"INV XA MANTENER HASTA EL VENCIMIENTO"]
[{"$f":"LEN(PUC[[#This Row],[AUXILIAR]])","v":6},819010,"INV DISPON XA VTA EN TITULOS DE DEUDA"]
[{"$f":"LEN(PUC[[#This Row],[AUXILIAR]])","v":6},819012,"INV DISPON XA VTA TITULOS PARTICIPATIVO"]
[{"$f":"LEN(PUC[[#This Row],[AUXILIAR]])","v":6},819020,"DERECHOS DE TRANSFERENCIA DE INVERSIONES"]
[{"$f":"LEN(PUC[[#This Row],[AUXILIAR]])","v":6},819021,"DERECHOS DE TRANSFERENCIA DE INVERSIONES"]
[{"$f":"LEN(PUC[[#This Row],[AUXILIAR]])","v":6},819022,"DERECHOS DE TRANSFERENCIA DE INVERSIONES"]
[{"$f":"LEN(PUC[[#This Row],[AUXILIAR]])","v":6},819026,"PROVISION INVERSIONES"]
[{"$f":"LEN(PUC[[#This Row],[AUXILIAR]])","v":6},819028,"PROVISION CREDITOS COMERCIALES"]
[{"$f":"LEN(PUC[[#This Row],[AUXILIAR]])","v":6},819030,"PROVISION CREDITOS DE CONSUMO"]
[{"$f":"LEN(PUC[[#This Row],[AUXILIAR]])","v":6},819032,"PROVISION CREDITOS DE VIVIENDA"]
[{"$f":"LEN(PUC[[#This Row],[AUXILIAR]])","v":6},819033,"PROVISION MICROCREDITOS"]
[{"$f":"LEN(PUC[[#This Row],[AUXILIAR]])","v":6},819036,"PROVISION GENERAL"]
[{"$f":"LEN(PUC[[#This Row],[AUXILIAR]])","v":6},819038,"ACEPTACIONES Y DERIVADOS"]
[{"$f":"LEN(PUC[[#This Row],[AUXILIAR]])","v":6},819040,"CUENTAS POR COBRAR"]
[{"$f":"LEN(PUC[[#This Row],[AUXILIAR]])","v":6},819042,"PROVISION CUENTAS POR COBRAR"]
[{"$f":"LEN(PUC[[#This Row],[AUXILIAR]])","v":6},819044,"BIENES REALIZABLES Y RECIBIDOS EN PAGO"]
[{"$f":"LEN(PUC[[#This Row],[AUXILIAR]])","v":6},819046,"PROVISION BIENES REALIZ RECIB EN PAGO"]
[{"$f":"LEN(PUC[[#This Row],[AUXILIAR]])","v":6},819048,"PROPIEDADES Y EQUIPO"]
[{"$f":"LEN(PUC[[#This Row],[AUXILIAR]])","v":6},819050,"DEPRECIACION ACUMULADA"]
[{"$f":"LEN(PUC[[#This Row],[AUXILIAR]])","v":6},819052,"DEPRECIACION DIFERIDA"]
[{"$f":"LEN(PUC[[#This Row],[AUXILIAR]])","v":6},819054,"PROVISION PROPIEDADES Y EQUIPO"]
[{"$f":"LEN(PUC[[#This Row],[AUXILIAR]])","v":6},819056,"BIENES DADOS EN LEASING"]
[{"$f":"LEN(PUC[[#This Row],[AUXILIAR]])","v":6},819058,"PROVISION BIENES DADOS EN LEASING"]
[{"$f":"LEN(PUC[[#This Row],[AUXILIAR]])","v":6},819060,"SUCURSALES Y AGENCIAS"]
[{"$f":"LEN(PUC[[#This Row],[AUXILIAR]])","v":6},819062,"APORTES PERMANENTES"]
[{"$f":"LEN(PUC[[#This Row],[AUXILIAR]])","v":6},819064,"GASTOS ANTICIPADOS"]
[{"$f":"LEN(PUC[[#This Row],[AUXILIAR]])","v":6},819066,"CARGOS DIFERIDOS"]
[{"$f":"LEN(PUC[[#This Row],[AUXILIAR]])","v":6},819068,"CERTIF DE CAMBIO EN ADMON"]
[{"$f":"LEN(PUC[[#This Row],[AUXILIAR]])","v":6},819070,"DEPOSITOS"]
[{"$f":"LEN(PUC[[#This Row],[AUXILIAR]])","v":6},819072,"BIENES POR COLOCAR EN CONTRATOS LEASING"]
[{"$f":"LEN(PUC[[#This Row],[AUXILIAR]])","v":6},819074,"BIENES ENTREGADOS EN COMODATO"]
[{"$f":"LEN(PUC[[#This Row],[AUXILIAR]])","v":6},819076,"DERECHOS EN FIDEICOMISO"]
[{"$f":"LEN(PUC[[#This Row],[AUXILIAR]])","v":6},819078,"DIVERSOS"]
[{"$f":"LEN(PUC[[#This Row],[AUXILIAR]])","v":6},819080,"VALORIZACIONES"]
[{"$f":"LEN(PUC[[#This Row],[AUXILIAR]])","v":6},819082,"DESVALORIZACIONES (CR)"]
[{"$f":"LEN(PUC[[#This Row],[AUXILIAR]])","v":6},819084,"PROVISION OTROS ACTIVOS"]
[{"$f":"LEN(PUC[[#This Row],[AUXILIAR]])","v":6},819200,"OPERAC RECIP AFECT GTOS Y CTOS MATR Y SU"]
[{"$f":"LEN(PUC[[#This Row],[AUXILIAR]])","v":6},819201,"OPERACIONALES"]
[{"$f":"LEN(PUC[[#This Row],[AUXILIAR]])","v":6},819202,"NO OPERACIONALES"]
[{"$f":"LEN(PUC[[#This Row],[AUXILIAR]])","v":6},819500,"OTRAS CUENTAS DE ORDEN DEUDORAS"]
[{"$f":"LEN(PUC[[#This Row],[AUXILIAR]])","v":6},819502,"CHEQUES POSTFECHADOS"]
[{"$f":"LEN(PUC[[#This Row],[AUXILIAR]])","v":6},819515,"VALOR ASIGNADO BIENES EN FIDEICOMIS"]
[{"$f":"LEN(PUC[[#This Row],[AUXILIAR]])","v":6},819520,"SERVICIOS FACTURADOS POR ANTICIPADO"]
[{"$f":"LEN(PUC[[#This Row],[AUXILIAR]])","v":6},819595,"OTRAS"]
[{"$f":"LEN(PUC[[#This Row],[AUXILIAR]])","v":6},820000,"ACREEDORAS"]
[{"$f":"LEN(PUC[[#This Row],[AUXILIAR]])","v":6},820500,"BIENES Y VALORES RECIBIDOS EN CUSTODIA"]
[{"$f":"LEN(PUC[[#This Row],[AUXILIAR]])","v":6},820505,"BIENES Y VALORES RECIBIDOS EN CUSTODIA"]
[{"$f":"LEN(PUC[[#This Row],[AUXILIAR]])","v":6},820510,"Compensacion electronica"]
[{"$f":"LEN(PUC[[#This Row],[AUXILIAR]])","v":6},820700,"PRECIO JUSTO DE INTERCAMBIO DE POSICIONE"]
[{"$f":"LEN(PUC[[#This Row],[AUXILIAR]])","v":6},820705,"COBERTURAS DE FLUJOS DE EFECTIVO POSICIO"]
[{"$f":"LEN(PUC[[#This Row],[AUXILIAR]])","v":6},820710,"COBERTURAS DE OPERACIONES PASIVAS EN MON"]
[{"$f":"LEN(PUC[[#This Row],[AUXILIAR]])","v":6},821100,"BIENES,VLRES RECIB.EN GAR.PARA FUT.CRED."]
[{"$f":"LEN(PUC[[#This Row],[AUXILIAR]])","v":6},821105,"INMUEBLES"]
[{"$f":"LEN(PUC[[#This Row],[AUXILIAR]])","v":6},821110,"VALORES MOBILIARIOS"]
[{"$f":"LEN(PUC[[#This Row],[AUXILIAR]])","v":6},821115,"OTROS BIENES MUEBLES"]
[{"$f":"LEN(PUC[[#This Row],[AUXILIAR]])","v":6},821120,"EQUIPARABLES A GARANTIA ADMISIBLE"]
[{"$f":"LEN(PUC[[#This Row],[AUXILIAR]])","v":6},821200,"GARANTIAS PENDIENTES DE CANCELAR"]
[{"$f":"LEN(PUC[[#This Row],[AUXILIAR]])","v":6},821205,"INMUEBLES"]
[{"$f":"LEN(PUC[[#This Row],[AUXILIAR]])","v":6},821210,"VALORES MOBILIARIOS"]
[{"$f":"LEN(PUC[[#This Row],[AUXILIAR]])","v":6},821215,"OTROS BIENES MUEBLES"]
[{"$f":"LEN(PUC[[#This Row],[AUXILIAR]])","v":6},821220,"EQUIPARABLES A GARANTIA IDONEA"]
[{"$f":"LEN(PUC[[#This Row],[AUXILIAR]])","v":6},821300,"BIENES Y VLRES RECIBIDOS GTIA OTRAS GTIA"]
[{"$f":"LEN(PUC[[#This Row],[AUXILIAR]])","v":6},821305,"CREDITOS COMERCIALES"]
[{"$f":"LEN(PUC[[#This Row],[AUXILIAR]])","v":6},821310,"CREDITOS DE CONSUMO"]
[{"$f":"LEN(PUC[[#This Row],[AUXILIAR]])","v":6},821315,"CREDITOS DE VIVIENDA"]
[{"$f":"LEN(PUC[[#This Row],[AUXILIAR]])","v":6},821320,"MICROCREDITOS"]
[{"$f":"LEN(PUC[[#This Row],[AUXILIAR]])","v":6},821395,"DE OTROS ACTIVOS"]
[{"$f":"LEN(PUC[[#This Row],[AUXILIAR]])","v":6},821400,"BIENES Y VALOR.RECIBIDOS EN GR.-OTRAS GR"]
[{"$f":"LEN(PUC[[#This Row],[AUXILIAR]])","v":6},821405,"CREDITOS COMERCIALES"]
[{"$f":"LEN(PUC[[#This Row],[AUXILIAR]])","v":6},821410,"CREDITOS DE CONSUMO"]
[{"$f":"LEN(PUC[[#This Row],[AUXILIAR]])","v":6},821415,"CREDITOS DE VIVIENDA"]
[{"$f":"LEN(PUC[[#This Row],[AUXILIAR]])","v":6},821420,"MICROCREDITOS"]
[{"$f":"LEN(PUC[[#This Row],[AUXILIAR]])","v":6},821495,"DE OTROS ACTIVOS"]
[{"$f":"LEN(PUC[[#This Row],[AUXILIAR]])","v":6},821500,"COBRANZAS RECIBIDAS"]
[{"$f":"LEN(PUC[[#This Row],[AUXILIAR]])","v":6},821505,"PAIS"]
[{"$f":"LEN(PUC[[#This Row],[AUXILIAR]])","v":6},821510,"EXTERIOR"]
[{"$f":"LEN(PUC[[#This Row],[AUXILIAR]])","v":6},821900,"BIENES Y VALORES RECIBIDOS EN ADMON"]
[{"$f":"LEN(PUC[[#This Row],[AUXILIAR]])","v":6},821905,"CARTERA FOGAFIN"]
[{"$f":"LEN(PUC[[#This Row],[AUXILIAR]])","v":6},822000,"UNDERWRITING AL MEJOR ESFUERZO"]
[{"$f":"LEN(PUC[[#This Row],[AUXILIAR]])","v":6},822100,"CONVENIOS SUSC TERCEROS XA ADMIN PROYECT"]
[{"$f":"LEN(PUC[[#This Row],[AUXILIAR]])","v":6},822103,"VLOR TOT CONVENIOS SUSCR Y ADICIONES"]
[{"$f":"LEN(PUC[[#This Row],[AUXILIAR]])","v":6},822105,"VLOR PENDIENTE EJECUCION DE LOS CONVENIO"]
[{"$f":"LEN(PUC[[#This Row],[AUXILIAR]])","v":6},822110,"VLOR EJECUTADO DE LOS CONVENIOS"]
[{"$f":"LEN(PUC[[#This Row],[AUXILIAR]])","v":6},822400,"RECUPERACIONES ACTIVOS CASTIGADOS"]
[{"$f":"LEN(PUC[[#This Row],[AUXILIAR]])","v":6},822405,"INVERSIONES"]
[{"$f":"LEN(PUC[[#This Row],[AUXILIAR]])","v":6},822410,"CARTERA DE CREDITOS COMERCIAL"]
[{"$f":"LEN(PUC[[#This Row],[AUXILIAR]])","v":6},822411,"CARTERA DE CREDITOS DE CONSUMO"]
[{"$f":"LEN(PUC[[#This Row],[AUXILIAR]])","v":6},822412,"CARTERA DE CREDITOS DE VIVIENDA"]
[{"$f":"LEN(PUC[[#This Row],[AUXILIAR]])","v":6},822413,"CARTERA DE CREDITOS DE MICROCREDITO"]
[{"$f":"LEN(PUC[[#This Row],[AUXILIAR]])","v":6},822415,"CUENTAS POR COBRAR CREDITOS COMERCIAL"]
[{"$f":"LEN(PUC[[#This Row],[AUXILIAR]])","v":6},822416,"CUENTAS POR COBRAR CREDITOS DE CONSUMO"]
[{"$f":"LEN(PUC[[#This Row],[AUXILIAR]])","v":6},822417,"CUENTAS POR COBRAR CREDITOS DE VIVIENDA"]
[{"$f":"LEN(PUC[[#This Row],[AUXILIAR]])","v":6},822418,"CUENTAS POR COBRAR CREDITOS MICROCREDITO"]
[{"$f":"LEN(PUC[[#This Row],[AUXILIAR]])","v":6},822420,"OTROS ACTIVOS"]
[{"$f":"LEN(PUC[[#This Row],[AUXILIAR]])","v":6},822500,"MERCANCIAS EN DEPOSITO -BODEGAS PRO"]
[{"$f":"LEN(PUC[[#This Row],[AUXILIAR]])","v":6},822505,"CON CERTIFICADO DE DEPOSITO"]
[{"$f":"LEN(PUC[[#This Row],[AUXILIAR]])","v":6},822510,"CON CERTIFICADO Y BONO DE PRENDA"]
[{"$f":"LEN(PUC[[#This Row],[AUXILIAR]])","v":6},822515,"DEPOSITO SIMPLE"]
[{"$f":"LEN(PUC[[#This Row],[AUXILIAR]])","v":6},822520,"DEPOSITO PROVISIONAL"]
[{"$f":"LEN(PUC[[#This Row],[AUXILIAR]])","v":6},822525,"CON RETENCION A FAVOR DE TERCEROS"]
[{"$f":"LEN(PUC[[#This Row],[AUXILIAR]])","v":6},822530,"OBLIGACION PRENDARIA"]
[{"$f":"LEN(PUC[[#This Row],[AUXILIAR]])","v":6},822535,"MANEJO Y DISTRIBUCION"]
[{"$f":"LEN(PUC[[#This Row],[AUXILIAR]])","v":6},823000,"MERCANCIAS EN BODEGAS PARTICULARES"]
[{"$f":"LEN(PUC[[#This Row],[AUXILIAR]])","v":6},823005,"CON CERTIFICADO DE DEPOSITO"]
[{"$f":"LEN(PUC[[#This Row],[AUXILIAR]])","v":6},823010,"CON CERTIFICADO Y BONO DE PRENDA"]
[{"$f":"LEN(PUC[[#This Row],[AUXILIAR]])","v":6},823015,"DEPOSITO SIMPLE"]
[{"$f":"LEN(PUC[[#This Row],[AUXILIAR]])","v":6},823020,"DEPOSITO PROVISIONAL"]
[{"$f":"LEN(PUC[[#This Row],[AUXILIAR]])","v":6},823025,"CON RETENCION A FAVOR DE TERCEROS"]
[{"$f":"LEN(PUC[[#This Row],[AUXILIAR]])","v":6},823030,"OBLIGACION PRENDARIA"]
[{"$f":"LEN(PUC[[#This Row],[AUXILIAR]])","v":6},823035,"MANEJO Y DISTRIBUCION"]
[{"$f":"LEN(PUC[[#This Row],[AUXILIAR]])","v":6},823500,"MERCANCIAS EN TRANSITO"]
[{"$f":"LEN(PUC[[#This Row],[AUXILIAR]])","v":6},823505,"CON CERTIFICADO DE DEPOSITO"]
[{"$f":"LEN(PUC[[#This Row],[AUXILIAR]])","v":6},823510,"CON CERTIFICADO Y BONO DE PRENDA"]
[{"$f":"LEN(PUC[[#This Row],[AUXILIAR]])","v":6},823515,"DEPOSITO SIMPLE"]
[{"$f":"LEN(PUC[[#This Row],[AUXILIAR]])","v":6},823525,"CON RETENCION A FAVOR DE TERCEROS"]
[{"$f":"LEN(PUC[[#This Row],[AUXILIAR]])","v":6},823530,"OBLIGACION PRENDARIA"]
[{"$f":"LEN(PUC[[#This Row],[AUXILIAR]])","v":6},823535,"MANEJO Y DISTRIBUCION"]
[{"$f":"LEN(PUC[[#This Row],[AUXILIAR]])","v":6},824000,"MERCANCIAS EN SILOS PROPIOS"]
[{"$f":"LEN(PUC[[#This Row],[AUXILIAR]])","v":6},824005,"CON CERTIFICADO DE DEPOSITO"]
[{"$f":"LEN(PUC[[#This Row],[AUXILIAR]])","v":6},824010,"CON CERTIFICADO Y BONO DE PRENDA"]
[{"$f":"LEN(PUC[[#This Row],[AUXILIAR]])","v":6},824015,"DEPOSITO SIMPLE"]
[{"$f":"LEN(PUC[[#This Row],[AUXILIAR]])","v":6},824020,"DEPOSITO PROVISIONAL"]
[{"$f":"LEN(PUC[[#This Row],[AUXILIAR]])","v":6},824025,"CON RETENCION A FAVOR DE TERCEROS"]
[{"$f":"LEN(PUC[[#This Row],[AUXILIAR]])","v":6},824030,"OBLIGACION PRENDARIA"]
[{"$f":"LEN(PUC[[#This Row],[AUXILIAR]])","v":6},824035,"MANEJO Y DISTRIBUCION"]
[{"$f":"LEN(PUC[[#This Row],[AUXILIAR]])","v":6},824200,"MERCANCIAS EN SILOS PARTICULARES"]
[{"$f":"LEN(PUC[[#This Row],[AUXILIAR]])","v":6},824205,"CON CERTIFICADO DE DEPOSITO"]
[{"$f":"LEN(PUC[[#This Row],[AUXILIAR]])","v":6},824210,"CON CERTIFICADO Y BONO DE PRENDA"]
[{"$f":"LEN(PUC[[#This Row],[AUXILIAR]])","v":6},824215,"DEPOSITO SIMPLE"]
[{"$f":"LEN(PUC[[#This Row],[AUXILIAR]])","v":6},824220,"DEPOSITO PROVISIONAL"]
[{"$f":"LEN(PUC[[#This Row],[AUXILIAR]])","v":6},824225,"CON RETENCION A FAVOR DE TERCEROS"]
[{"$f":"LEN(PUC[[#This Row],[AUXILIAR]])","v":6},824230,"OBLIGACION PRENDARIA"]
[{"$f":"LEN(PUC[[#This Row],[AUXILIAR]])","v":6},824235,"MANEJO Y DISTRIBUCION"]
[{"$f":"LEN(PUC[[#This Row],[AUXILIAR]])","v":6},824300,"MERCANCIA RECIBIDA DE OTROS ALMACEN"]
[{"$f":"LEN(PUC[[#This Row],[AUXILIAR]])","v":6},824305,"MERCANCIAS RECIBIDAS DE OTROS ALMAC"]
[{"$f":"LEN(PUC[[#This Row],[AUXILIAR]])","v":6},824600,"AJUSTES POR INFLACION PATRIMONIO"]
[{"$f":"LEN(PUC[[#This Row],[AUXILIAR]])","v":6},824631,"CAPITAL SOCIAL"]
[{"$f":"LEN(PUC[[#This Row],[AUXILIAR]])","v":6},824632,"RESERVAS"]
[{"$f":"LEN(PUC[[#This Row],[AUXILIAR]])","v":6},824633,"FONDOS DE DESTINACION ESPECIFICA"]
[{"$f":"LEN(PUC[[#This Row],[AUXILIAR]])","v":6},824634,"SUPERAVIT"]
[{"$f":"LEN(PUC[[#This Row],[AUXILIAR]])","v":6},824635,"RESULTADOS DE EJERCICIOS ANTERIORES"]
[{"$f":"LEN(PUC[[#This Row],[AUXILIAR]])","v":6},824637,"DIVIDENDOS DECRETADOS EN ACCIONES"]
[{"$f":"LEN(PUC[[#This Row],[AUXILIAR]])","v":6},824700,"CORRECCION MONETARIA FISCAL"]
[{"$f":"LEN(PUC[[#This Row],[AUXILIAR]])","v":6},824900,"CAPITALIZ.POR REVALORIZ. DEL PATRIM"]
[{"$f":"LEN(PUC[[#This Row],[AUXILIAR]])","v":6},825000,"MERCANC.CONSIGNAD.EN TRAM.DE NACION"]
[{"$f":"LEN(PUC[[#This Row],[AUXILIAR]])","v":6},825004,"MERCANC.CONSIGN.EN TRAMITE DE NACIO"]
[{"$f":"LEN(PUC[[#This Row],[AUXILIAR]])","v":6},825500,"BONOS DE PRENDA DESCONTADOS"]
[{"$f":"LEN(PUC[[#This Row],[AUXILIAR]])","v":6},825505,"ENTIDADES FINANCIERAS"]
[{"$f":"LEN(PUC[[#This Row],[AUXILIAR]])","v":6},825510,"PARTICULARES"]
[{"$f":"LEN(PUC[[#This Row],[AUXILIAR]])","v":6},826100,"RENDIMIENTOS Y UTILIDAD O PERDIDA EN VE"]
[{"$f":"LEN(PUC[[#This Row],[AUXILIAR]])","v":6},826105,"RENDIMIENTOS EN TITULOS DE DEUDA"]
[{"$f":"LEN(PUC[[#This Row],[AUXILIAR]])","v":6},826110,"RENDIMIENTOS EN TITULOS EN UVR"]
[{"$f":"LEN(PUC[[#This Row],[AUXILIAR]])","v":6},826112,"RENDIMIENTOS EN TITULOS EN MONEDA EXTRAJ"]
[{"$f":"LEN(PUC[[#This Row],[AUXILIAR]])","v":6},826115,"UTILIDAD VTA TITULOS EN PESOS"]
[{"$f":"LEN(PUC[[#This Row],[AUXILIAR]])","v":6},826120,"UTILIDAD EN VTA TITULOS EN UVR"]
[{"$f":"LEN(PUC[[#This Row],[AUXILIAR]])","v":6},826125,"UTILIDAD EN VTA TITULOS EN MONEDA EXTR"]
[{"$f":"LEN(PUC[[#This Row],[AUXILIAR]])","v":6},826130,"PERDIDA EN VTA DE TITULOS EN PESOS"]
[{"$f":"LEN(PUC[[#This Row],[AUXILIAR]])","v":6},826135,"PERDIDA EN VTA DE TITULOS EN UVR"]
[{"$f":"LEN(PUC[[#This Row],[AUXILIAR]])","v":6},826140,"PERDIDA EN VTA DE TITULOS EN MONEDA EXTR"]
[{"$f":"LEN(PUC[[#This Row],[AUXILIAR]])","v":6},826200,"RENDIM INVER NEGOC EN TITULOS PARTICIP"]
[{"$f":"LEN(PUC[[#This Row],[AUXILIAR]])","v":6},826215,"TITULOS DE PARTICIPACION"]
[{"$f":"LEN(PUC[[#This Row],[AUXILIAR]])","v":6},826300,"DIVID DECRET INVER NEGOC TIT PARTICIPATI"]
[{"$f":"LEN(PUC[[#This Row],[AUXILIAR]])","v":6},826400,"RENDIM RECIB X ANTIC INV NEG TIT DE DEUD"]
[{"$f":"LEN(PUC[[#This Row],[AUXILIAR]])","v":6},826405,"INTERESES"]
[{"$f":"LEN(PUC[[#This Row],[AUXILIAR]])","v":6},826410,"UNIDAD VLOR REAL UVR"]
[{"$f":"LEN(PUC[[#This Row],[AUXILIAR]])","v":6},826415,"DERECHOS TITULOS MIXTOS"]
[{"$f":"LEN(PUC[[#This Row],[AUXILIAR]])","v":6},827100,"VALOR FISCAL DEL PATRIMONIO"]
[{"$f":"LEN(PUC[[#This Row],[AUXILIAR]])","v":6},827400,"CALIF OPERAC LEASING FINANCIERO"]
[{"$f":"LEN(PUC[[#This Row],[AUXILIAR]])","v":6},827402,"CONSUMO CAPITAL VIGENTE Y MORA HASTA 1 M"]
[{"$f":"LEN(PUC[[#This Row],[AUXILIAR]])","v":6},827404,"CONSUMO CAPITAL MORA >1M HASTA 2M"]
[{"$f":"LEN(PUC[[#This Row],[AUXILIAR]])","v":6},827406,"CONSUMO CAPITAL MORA >2M HASTA 3M"]
[{"$f":"LEN(PUC[[#This Row],[AUXILIAR]])","v":6},827408,"CONSUMO CAPITAL MORA >3M HASTA 6M"]
[{"$f":"LEN(PUC[[#This Row],[AUXILIAR]])","v":6},827410,"CONSUMO CAPITAL > 6 MESES"]
[{"$f":"LEN(PUC[[#This Row],[AUXILIAR]])","v":6},827412,"CONSUMO INTERS VIGENTE Y MORA HASTA 1M"]
[{"$f":"LEN(PUC[[#This Row],[AUXILIAR]])","v":6},827414,"CONSUMO INTER MORA > 1M HASTA 2M"]
[{"$f":"LEN(PUC[[#This Row],[AUXILIAR]])","v":6},827416,"CONSUMO INTER MORA >2M HASTA 3M"]
[{"$f":"LEN(PUC[[#This Row],[AUXILIAR]])","v":6},827418,"CONSUMO INTER MORA >3M HASTA 6M"]
[{"$f":"LEN(PUC[[#This Row],[AUXILIAR]])","v":6},827420,"CONSUMO INTER MORA > 6M"]
[{"$f":"LEN(PUC[[#This Row],[AUXILIAR]])","v":6},827422,"CONSUM OTROS CONC VIGEN Y MORA HASTA 1M"]
[{"$f":"LEN(PUC[[#This Row],[AUXILIAR]])","v":6},827424,"CONSUM OTROS CONC MORA >1M HASTA 2M"]
[{"$f":"LEN(PUC[[#This Row],[AUXILIAR]])","v":6},827426,"CONSUM OTROS CONC MORA >2M HASTA 3M"]
[{"$f":"LEN(PUC[[#This Row],[AUXILIAR]])","v":6},827428,"CONSUM OTROS CONC MORA >3M HASTA 6M"]
[{"$f":"LEN(PUC[[#This Row],[AUXILIAR]])","v":6},827430,"CONSUM OTROS CONC MORA >6M"]
[{"$f":"LEN(PUC[[#This Row],[AUXILIAR]])","v":6},827432,"MICROCRED CAPITAL VIGENTE Y MORA HASTA 1"]
[{"$f":"LEN(PUC[[#This Row],[AUXILIAR]])","v":6},827434,"MICROCRED CAPITAL MORA >1M HASTA 2M"]
[{"$f":"LEN(PUC[[#This Row],[AUXILIAR]])","v":6},827436,"MICROCRED CAPITAL MORA >2M HASTA 3M"]
[{"$f":"LEN(PUC[[#This Row],[AUXILIAR]])","v":6},827438,"MICROCRED CAPITAL MORA >3M HASTA 4M"]
[{"$f":"LEN(PUC[[#This Row],[AUXILIAR]])","v":6},827440,"MICROCRED CAPITAL MORA >4M"]
[{"$f":"LEN(PUC[[#This Row],[AUXILIAR]])","v":6},827442,"MICROCRED INTER VIGENT Y MORA HASTA 1M"]
[{"$f":"LEN(PUC[[#This Row],[AUXILIAR]])","v":6},827444,"MICROCRED INTERESES MORA >1M HASTA 2M"]
[{"$f":"LEN(PUC[[#This Row],[AUXILIAR]])","v":6},827446,"MICROCRED INTERESES MORA >2M HASTA 3M"]
[{"$f":"LEN(PUC[[#This Row],[AUXILIAR]])","v":6},827448,"MICROCRED INTERESES MORA >3M HASTA 4M"]
[{"$f":"LEN(PUC[[#This Row],[AUXILIAR]])","v":6},827450,"MICROCRED INTERESES MORA > 4MESES"]
[{"$f":"LEN(PUC[[#This Row],[AUXILIAR]])","v":6},827452,"MICROCR OTROS CONCEP VIG Y MORA HASTA  1"]
[{"$f":"LEN(PUC[[#This Row],[AUXILIAR]])","v":6},827454,"MICROCR OTROS CONCEP MORA >1M HASTA 2M"]
[{"$f":"LEN(PUC[[#This Row],[AUXILIAR]])","v":6},827456,"MICROCR OTROS CONCEP MORA >2M HASTA 3M"]
[{"$f":"LEN(PUC[[#This Row],[AUXILIAR]])","v":6},827458,"MICROCR OTROS CONCEP MORA >3M HASTA 4M"]
[{"$f":"LEN(PUC[[#This Row],[AUXILIAR]])","v":6},827460,"MICROCR OTROS CONCEP MORA >4M"]
[{"$f":"LEN(PUC[[#This Row],[AUXILIAR]])","v":6},827462,"CIAL CAPITAL VIGENTE Y MORA HASTA 1 M"]
[{"$f":"LEN(PUC[[#This Row],[AUXILIAR]])","v":6},827464,"CIAL CAPITAL MORA > 1M HASTA 3M"]
[{"$f":"LEN(PUC[[#This Row],[AUXILIAR]])","v":6},827466,"CIAL CAPITAL MORA > 3M HASTA 6M"]
[{"$f":"LEN(PUC[[#This Row],[AUXILIAR]])","v":6},827468,"CIAL CAPITAL MORA > 6M HASTA 12M"]
[{"$f":"LEN(PUC[[#This Row],[AUXILIAR]])","v":6},827470,"CIAL CAPITAL MORA > 12M"]
[{"$f":"LEN(PUC[[#This Row],[AUXILIAR]])","v":6},827472,"CIAL INTERESES VIGENTE Y MORA HASTA 1M"]
[{"$f":"LEN(PUC[[#This Row],[AUXILIAR]])","v":6},827474,"CIAL INTERESES MORA > 1M HASTA 3M"]
[{"$f":"LEN(PUC[[#This Row],[AUXILIAR]])","v":6},827476,"CIAL INTERESES MORA > 3M HASTA 6M"]
[{"$f":"LEN(PUC[[#This Row],[AUXILIAR]])","v":6},827478,"CIAL INTERESES MORA > 6M HASTA 12M"]
[{"$f":"LEN(PUC[[#This Row],[AUXILIAR]])","v":6},827480,"CIAL INTERESES MORA > 12M"]
[{"$f":"LEN(PUC[[#This Row],[AUXILIAR]])","v":6},827482,"CIAL OTROS CONCEP VIG Y MORA HASTA 1M"]
[{"$f":"LEN(PUC[[#This Row],[AUXILIAR]])","v":6},827484,"CIAL OTROS CONCEP MORA > 1M HASTA 3M"]
[{"$f":"LEN(PUC[[#This Row],[AUXILIAR]])","v":6},827486,"CIAL OTROS CONCEP MORA >3 HASTA 6M"]
[{"$f":"LEN(PUC[[#This Row],[AUXILIAR]])","v":6},827488,"CIAL OTROS CONCEP MORA >6 HASTA 12M"]
[{"$f":"LEN(PUC[[#This Row],[AUXILIAR]])","v":6},827490,"CIAL OTROS CONCEP MORA > 12M"]
[{"$f":"LEN(PUC[[#This Row],[AUXILIAR]])","v":6},828000,"CALIF DE CONTRATOS DE LEASING"]
[{"$f":"LEN(PUC[[#This Row],[AUXILIAR]])","v":6},828005,"COMERCIAL,VIGENTE Y MORA HASTA 1 MES"]
[{"$f":"LEN(PUC[[#This Row],[AUXILIAR]])","v":6},828010,"COMERCIAL,MORA > 1 MES HASTA 3 MESES"]
[{"$f":"LEN(PUC[[#This Row],[AUXILIAR]])","v":6},828015,"COMERCIAL,MORA > 3 MESES HASTA 6 MESES"]
[{"$f":"LEN(PUC[[#This Row],[AUXILIAR]])","v":6},828020,"COMERCIAL,MORA > 6 MESES HASTA 12 MESES"]
[{"$f":"LEN(PUC[[#This Row],[AUXILIAR]])","v":6},828025,"COMERCIAL,MORA > 12 MESES"]
[{"$f":"LEN(PUC[[#This Row],[AUXILIAR]])","v":6},828030,"CONSUMO,VIGENTE Y MORA HASTA 1 MES"]
[{"$f":"LEN(PUC[[#This Row],[AUXILIAR]])","v":6},828035,"CONSUMO,MORA > 1 MES HASTA 2 MESES"]
[{"$f":"LEN(PUC[[#This Row],[AUXILIAR]])","v":6},828040,"CONSUMO,MORA > 2 MESES HASTA 3 MESES"]
[{"$f":"LEN(PUC[[#This Row],[AUXILIAR]])","v":6},828045,"CONSUMO,MORA > 3 MESES HASTA 6 MESES"]
[{"$f":"LEN(PUC[[#This Row],[AUXILIAR]])","v":6},828050,"CONSUMO,MORA MAYOR A 6 MESES"]
[{"$f":"LEN(PUC[[#This Row],[AUXILIAR]])","v":6},828055,"MICROCREDITOS VIGENTE Y MORA HASTA 1 MES"]
[{"$f":"LEN(PUC[[#This Row],[AUXILIAR]])","v":6},828060,"MICROCREDITOS MORA > 1MES HASTA 2 MESES"]
[{"$f":"LEN(PUC[[#This Row],[AUXILIAR]])","v":6},828065,"MICROCREDITOS MORA > 2 MESES HASTA 3 MES"]
[{"$f":"LEN(PUC[[#This Row],[AUXILIAR]])","v":6},828070,"MICROCREDITOS MORA > 3 MESES HASTA 4 MES"]
[{"$f":"LEN(PUC[[#This Row],[AUXILIAR]])","v":6},828075,"MICROCREDITOS MORA > 4 MESES"]
[{"$f":"LEN(PUC[[#This Row],[AUXILIAR]])","v":6},828100,"CALIFICACION CREDITOS VIVIENDA GTIA IDON"]
[{"$f":"LEN(PUC[[#This Row],[AUXILIAR]])","v":6},828102,"CAPITAL VIGENTE Y MORA HASTA 1 MES"]
[{"$f":"LEN(PUC[[#This Row],[AUXILIAR]])","v":6},828103,"CAPITAL MORA MAYOR A 1 MES HASTA 4 MESES"]
[{"$f":"LEN(PUC[[#This Row],[AUXILIAR]])","v":6},828104,"CUOTA EN MORA MAYOR A 1 MES HASTA 4 MESE"]
[{"$f":"LEN(PUC[[#This Row],[AUXILIAR]])","v":6},828105,"CAPITAL MORA MAYOR A 4 MESES HASTA 6"]
[{"$f":"LEN(PUC[[#This Row],[AUXILIAR]])","v":6},828106,"CAPITAL MORA MAYOR A 6 MESES HASTA 12 ME"]
[{"$f":"LEN(PUC[[#This Row],[AUXILIAR]])","v":6},828108,"CAPITAL MORA MAYOR A 12 MESES HASTA 18 M"]
[{"$f":"LEN(PUC[[#This Row],[AUXILIAR]])","v":6},828110,"CAPITAL MORA MAYOR A 18 MESES"]
[{"$f":"LEN(PUC[[#This Row],[AUXILIAR]])","v":6},828112,"INTERESES VIGENTE Y MORA HASTA 1 MESES"]
[{"$f":"LEN(PUC[[#This Row],[AUXILIAR]])","v":6},828113,"INTERESES MORA MAYOR 1 MES HASTA 4 MESES"]
[{"$f":"LEN(PUC[[#This Row],[AUXILIAR]])","v":6},828114,"INTERESES MORA MAYOR A 4 MESES HASTA 6"]
[{"$f":"LEN(PUC[[#This Row],[AUXILIAR]])","v":6},828116,"INTERESES MORA MAYOR A 6 MESES HASTA 12"]
[{"$f":"LEN(PUC[[#This Row],[AUXILIAR]])","v":6},828118,"INTERESES MORA MAYOR A 12 MESES HASTA 18"]
[{"$f":"LEN(PUC[[#This Row],[AUXILIAR]])","v":6},828120,"INTERESES MORA MAYOR A 18 MESES"]
[{"$f":"LEN(PUC[[#This Row],[AUXILIAR]])","v":6},828122,"OTROS CONCEP VIGENTE Y MORA HASTA 1 MES"]
[{"$f":"LEN(PUC[[#This Row],[AUXILIAR]])","v":6},828123,"OTROS CONCEPTOS MORA MAYOR 1 MES HASTA 4"]
[{"$f":"LEN(PUC[[#This Row],[AUXILIAR]])","v":6},828124,"OTROS CONCEP MORA MAYOR 4 MESES HASTA 6"]
[{"$f":"LEN(PUC[[#This Row],[AUXILIAR]])","v":6},828126,"OTROS CONCEP MORA MAYOR 6 MESES HASTA 12"]
[{"$f":"LEN(PUC[[#This Row],[AUXILIAR]])","v":6},828128,"OTROS CONCEP MORA MAYOR 12 MESES HAST 18"]
[{"$f":"LEN(PUC[[#This Row],[AUXILIAR]])","v":6},828130,"OTROS CONCEP MORA MAYOR A 18 MESES"]
[{"$f":"LEN(PUC[[#This Row],[AUXILIAR]])","v":6},828200,"CALIFIC CREDITOS VIVIENDA OTRAS GTIAS"]
[{"$f":"LEN(PUC[[#This Row],[AUXILIAR]])","v":6},828202,"CAPITAL VIGENTE Y MORA HASTA 1 MES"]
[{"$f":"LEN(PUC[[#This Row],[AUXILIAR]])","v":6},828203,"CAPITAL MORA MAYOR 1 MES HASTA 4 MESES"]
[{"$f":"LEN(PUC[[#This Row],[AUXILIAR]])","v":6},828204,"CAPITAL MORA MAYOR A 4 MESES HASTA 6 MES"]
[{"$f":"LEN(PUC[[#This Row],[AUXILIAR]])","v":6},828206,"CAPITAL MORA MAYOR A 6 MESES HASTA 12 ME"]
[{"$f":"LEN(PUC[[#This Row],[AUXILIAR]])","v":6},828208,"CAPITAL MORA MAYOR A 12 MESES HASTA 18 M"]
[{"$f":"LEN(PUC[[#This Row],[AUXILIAR]])","v":6},828210,"CAPITAL MORA MAYOR A 18 MESES"]
[{"$f":"LEN(PUC[[#This Row],[AUXILIAR]])","v":6},828212,"INTERESES VIGENTE Y MORA HASTA 1 MESES"]
[{"$f":"LEN(PUC[[#This Row],[AUXILIAR]])","v":6},828213,"INTERESES MORA MAYOR 1 MES HASTA 4 MESES"]
[{"$f":"LEN(PUC[[#This Row],[AUXILIAR]])","v":6},828214,"INTERESES MORA MAYOR A 4 MESES HASTA 6"]
[{"$f":"LEN(PUC[[#This Row],[AUXILIAR]])","v":6},828216,"INTERESES MORA MAYOR A 6 MESES HASTA 12"]
[{"$f":"LEN(PUC[[#This Row],[AUXILIAR]])","v":6},828218,"INTERESES MORA MAYOR A 12 MESES HASTA 18"]
[{"$f":"LEN(PUC[[#This Row],[AUXILIAR]])","v":6},828220,"INTERESES MORA MAYOR A 18 MESES"]
[{"$f":"LEN(PUC[[#This Row],[AUXILIAR]])","v":6},828222,"OTROS CONCEP VIGENTE Y MORA HASTA 1 MES"]
[{"$f":"LEN(PUC[[#This Row],[AUXILIAR]])","v":6},828223,"OTROS CONCEPTOS MORA MAYOR 1 MES HASTA 4"]
[{"$f":"LEN(PUC[[#This Row],[AUXILIAR]])","v":6},828224,"OTROS CONCEP MORA MAYOR 4 MESES HASTA 6"]
[{"$f":"LEN(PUC[[#This Row],[AUXILIAR]])","v":6},828226,"OTROS CONCEP MORA MAYOR 6 MESES HASTA 12"]
[{"$f":"LEN(PUC[[#This Row],[AUXILIAR]])","v":6},828228,"OTROS CONCEP MORA MAYOR 12 MESES HAST 18"]
[{"$f":"LEN(PUC[[#This Row],[AUXILIAR]])","v":6},828230,"OTROS CONCEP MORA MAYOR A 18 MESES"]
[{"$f":"LEN(PUC[[#This Row],[AUXILIAR]])","v":6},828300,"CALIFICACION CREDITOS CONSUMO GTIA IDON"]
[{"$f":"LEN(PUC[[#This Row],[AUXILIAR]])","v":6},828302,"CAPITAL VIGENTE Y MORA HASTA 1 MESES"]
[{"$f":"LEN(PUC[[#This Row],[AUXILIAR]])","v":6},828304,"CAPITAL MORA MAYOR A 1 MESES HASTA 2 MES"]
[{"$f":"LEN(PUC[[#This Row],[AUXILIAR]])","v":6},828306,"CAPITAL MORA MAYOR A 2 MESES HASTA 3 ME"]
[{"$f":"LEN(PUC[[#This Row],[AUXILIAR]])","v":6},828308,"CAPITAL MORA MAYOR A 3 MESES HASTA 6 M"]
[{"$f":"LEN(PUC[[#This Row],[AUXILIAR]])","v":6},828310,"CAPITAL MORA MAYOR A 6 MESES"]
[{"$f":"LEN(PUC[[#This Row],[AUXILIAR]])","v":6},828312,"INTERESES VIGENTE Y MORA HASTA 1 MESES"]
[{"$f":"LEN(PUC[[#This Row],[AUXILIAR]])","v":6},828314,"INTERESES MORA MAYOR A 1 MESES HASTA 2"]
[{"$f":"LEN(PUC[[#This Row],[AUXILIAR]])","v":6},828316,"INTERESES MORA MAYOR A 2 MESES HASTA 3"]
[{"$f":"LEN(PUC[[#This Row],[AUXILIAR]])","v":6},828318,"INTERESES MORA MAYOR A 3 MESES HASTA 6"]
[{"$f":"LEN(PUC[[#This Row],[AUXILIAR]])","v":6},828320,"INTERESES MORA MAYOR A 6 MESES"]
[{"$f":"LEN(PUC[[#This Row],[AUXILIAR]])","v":6},828322,"OTROS CONCEP VIGENTE Y MORA HASTA 1 MESE"]
[{"$f":"LEN(PUC[[#This Row],[AUXILIAR]])","v":6},828324,"OTROS CONCEP MORA MAYOR 1 MESES HASTA 2"]
[{"$f":"LEN(PUC[[#This Row],[AUXILIAR]])","v":6},828326,"OTROS CONCEP MORA MAYOR 2 MESES HASTA 3"]
[{"$f":"LEN(PUC[[#This Row],[AUXILIAR]])","v":6},828328,"OTROS CONCEP MORA MAYOR 3 MESES HAST 6"]
[{"$f":"LEN(PUC[[#This Row],[AUXILIAR]])","v":6},828330,"OTROS CONCEP MORA MAYOR A 6 MESES"]
[{"$f":"LEN(PUC[[#This Row],[AUXILIAR]])","v":6},828400,"CALIFICACION CREDITOS  CONSUMO OTRASGTIA"]
[{"$f":"LEN(PUC[[#This Row],[AUXILIAR]])","v":6},828402,"CAPITAL VIGENTE Y MORA HASTA 1 MESES"]
[{"$f":"LEN(PUC[[#This Row],[AUXILIAR]])","v":6},828404,"CAPITAL MORA MAYOR A 1 MESES HASTA 2 MES"]
[{"$f":"LEN(PUC[[#This Row],[AUXILIAR]])","v":6},828406,"CAPITAL MORA MAYOR A 2 MESES HASTA 3 ME"]
[{"$f":"LEN(PUC[[#This Row],[AUXILIAR]])","v":6},828408,"CAPITAL MORA MAYOR A 3 MESES HASTA 6 M"]
[{"$f":"LEN(PUC[[#This Row],[AUXILIAR]])","v":6},828410,"CAPITAL MORA MAYOR A 6 MESES"]
[{"$f":"LEN(PUC[[#This Row],[AUXILIAR]])","v":6},828412,"INTERESES VIGENTE Y MORA HASTA 1 MESES"]
[{"$f":"LEN(PUC[[#This Row],[AUXILIAR]])","v":6},828414,"INTERESES MORA MAYOR A 1 MESES HASTA 2"]
[{"$f":"LEN(PUC[[#This Row],[AUXILIAR]])","v":6},828416,"INTERESES MORA MAYOR A 2 MESES HASTA 3"]
[{"$f":"LEN(PUC[[#This Row],[AUXILIAR]])","v":6},828418,"INTERESES MORA MAYOR A 3 MESES HASTA 6"]
[{"$f":"LEN(PUC[[#This Row],[AUXILIAR]])","v":6},828420,"INTERESES MORA MAYOR A 6 MESES"]
[{"$f":"LEN(PUC[[#This Row],[AUXILIAR]])","v":6},828422,"OTROS CONCEP VIGENTE Y MORA HASTA 1 MESE"]
[{"$f":"LEN(PUC[[#This Row],[AUXILIAR]])","v":6},828424,"OTROS CONCEP MORA MAYOR 1 MESES HASTA 2"]
[{"$f":"LEN(PUC[[#This Row],[AUXILIAR]])","v":6},828426,"OTROS CONCEP MORA MAYOR 2 MESES HASTA 3"]
[{"$f":"LEN(PUC[[#This Row],[AUXILIAR]])","v":6},828428,"OTROS CONCEP MORA MAYOR 3 MESES HAST 6"]
[{"$f":"LEN(PUC[[#This Row],[AUXILIAR]])","v":6},828430,"OTROS CONCEP MORA MAYOR A 6 MESES"]
[{"$f":"LEN(PUC[[#This Row],[AUXILIAR]])","v":6},828500,"CALIFICACION MICROCREDITOS  GTIA IDON"]
[{"$f":"LEN(PUC[[#This Row],[AUXILIAR]])","v":6},828502,"CAPITAL VIGENTE Y MORA HASTA 1 MESES"]
[{"$f":"LEN(PUC[[#This Row],[AUXILIAR]])","v":6},828504,"CAPITAL MORA MAYOR A 1 MESES HASTA 2 MES"]
[{"$f":"LEN(PUC[[#This Row],[AUXILIAR]])","v":6},828506,"CAPITAL MORA MAYOR A 2 MESES HASTA 3 ME"]
[{"$f":"LEN(PUC[[#This Row],[AUXILIAR]])","v":6},828508,"CAPITAL MORA MAYOR A 3 MESES HASTA 4 M"]
[{"$f":"LEN(PUC[[#This Row],[AUXILIAR]])","v":6},828510,"CAPITAL MORA MAYOR A 4 MESES"]
[{"$f":"LEN(PUC[[#This Row],[AUXILIAR]])","v":6},828512,"INTERESES VIGENTE Y MORA HASTA 1 MESES"]
[{"$f":"LEN(PUC[[#This Row],[AUXILIAR]])","v":6},828514,"INTERESES MORA MAYOR A 1 MESES HASTA 2"]
[{"$f":"LEN(PUC[[#This Row],[AUXILIAR]])","v":6},828516,"INTERESES MORA MAYOR A 2 MESES HASTA 3"]
[{"$f":"LEN(PUC[[#This Row],[AUXILIAR]])","v":6},828518,"INTERESES MORA MAYOR A 3 MESES HASTA 4"]
[{"$f":"LEN(PUC[[#This Row],[AUXILIAR]])","v":6},828520,"INTERESES MORA MAYOR A 4 MESES"]
[{"$f":"LEN(PUC[[#This Row],[AUXILIAR]])","v":6},828522,"OTROS CONCEP VIGENTE Y MORA HASTA 1 MESE"]
[{"$f":"LEN(PUC[[#This Row],[AUXILIAR]])","v":6},828524,"OTROS CONCEP MORA MAYOR 1 MESES HASTA 2"]
[{"$f":"LEN(PUC[[#This Row],[AUXILIAR]])","v":6},828526,"OTROS CONCEP MORA MAYOR 2 MESES HASTA 3"]
[{"$f":"LEN(PUC[[#This Row],[AUXILIAR]])","v":6},828528,"OTROS CONCEP MORA MAYOR 3 MESES HAST 4"]
[{"$f":"LEN(PUC[[#This Row],[AUXILIAR]])","v":6},828530,"OTROS CONCEP MORA MAYOR A 4 MESES"]
[{"$f":"LEN(PUC[[#This Row],[AUXILIAR]])","v":6},828600,"CALIFICACION MICRICREDITOS OTRAS GARANTI"]
[{"$f":"LEN(PUC[[#This Row],[AUXILIAR]])","v":6},828602,"CAPITAL VIGENTE Y MORA HASTA 1 MESES"]
[{"$f":"LEN(PUC[[#This Row],[AUXILIAR]])","v":6},828604,"CAPITAL MORA MAYOR A 1 MESES HASTA 2 MES"]
[{"$f":"LEN(PUC[[#This Row],[AUXILIAR]])","v":6},828606,"CAPITAL MORA MAYOR A 2 MESES HASTA 3 ME"]
[{"$f":"LEN(PUC[[#This Row],[AUXILIAR]])","v":6},828608,"CAPITAL MORA MAYOR A 3 MESES HASTA 4 M"]
[{"$f":"LEN(PUC[[#This Row],[AUXILIAR]])","v":6},828610,"CAPITAL MORA MAYOR A 4 MESES"]
[{"$f":"LEN(PUC[[#This Row],[AUXILIAR]])","v":6},828612,"INTERESES VIGENTE Y MORA HASTA 1 MESES"]
[{"$f":"LEN(PUC[[#This Row],[AUXILIAR]])","v":6},828614,"INTERESES MORA MAYOR A 1 MESES HASTA 2"]
[{"$f":"LEN(PUC[[#This Row],[AUXILIAR]])","v":6},828616,"INTERESES MORA MAYOR A 2 MESES HASTA 3"]
[{"$f":"LEN(PUC[[#This Row],[AUXILIAR]])","v":6},828618,"INTERESES MORA MAYOR A 3 MESES HASTA 4"]
[{"$f":"LEN(PUC[[#This Row],[AUXILIAR]])","v":6},828620,"INTERESES MORA MAYOR A 4 MESES"]
[{"$f":"LEN(PUC[[#This Row],[AUXILIAR]])","v":6},828622,"OTROS CONCEP VIGENTE Y MORA HASTA 1 MESE"]
[{"$f":"LEN(PUC[[#This Row],[AUXILIAR]])","v":6},828624,"OTROS CONCEP MORA MAYOR 1 MESES HASTA 2"]
[{"$f":"LEN(PUC[[#This Row],[AUXILIAR]])","v":6},828626,"OTROS CONCEP MORA MAYOR 2 MESES HASTA 3"]
[{"$f":"LEN(PUC[[#This Row],[AUXILIAR]])","v":6},828628,"OTROS CONCEP MORA MAYOR 3 MESES HAST 4"]
[{"$f":"LEN(PUC[[#This Row],[AUXILIAR]])","v":6},828630,"OTROS CONCEP MORA MAYOR A 4 MESES"]
[{"$f":"LEN(PUC[[#This Row],[AUXILIAR]])","v":6},828700,"CALIFICACION CREDITOS COMERCIA GTIA IDON"]
[{"$f":"LEN(PUC[[#This Row],[AUXILIAR]])","v":6},828702,"CAPITAL VIGENTE Y MORA HASTA 1 MESES"]
[{"$f":"LEN(PUC[[#This Row],[AUXILIAR]])","v":6},828704,"CAPITAL MORA MAYOR A 1 MESES HASTA 3 MES"]
[{"$f":"LEN(PUC[[#This Row],[AUXILIAR]])","v":6},828706,"CAPITAL MORA MAYOR A 3 MESES HASTA 6 ME"]
[{"$f":"LEN(PUC[[#This Row],[AUXILIAR]])","v":6},828708,"CAPITAL MORA MAYOR A 6 MESES HASTA 12 M"]
[{"$f":"LEN(PUC[[#This Row],[AUXILIAR]])","v":6},828710,"CAPITAL MORA MAYOR A 12 MESES"]
[{"$f":"LEN(PUC[[#This Row],[AUXILIAR]])","v":6},828712,"INTERESES VIGENTE Y MORA HASTA 1 MESES"]
[{"$f":"LEN(PUC[[#This Row],[AUXILIAR]])","v":6},828714,"INTERESES MORA MAYOR A 1 MESES HASTA 3"]
[{"$f":"LEN(PUC[[#This Row],[AUXILIAR]])","v":6},828716,"INTERESES MORA MAYOR A 3 MESES HASTA 6"]
[{"$f":"LEN(PUC[[#This Row],[AUXILIAR]])","v":6},828718,"INTERESES MORA MAYOR A 6 MESES HASTA 12"]
[{"$f":"LEN(PUC[[#This Row],[AUXILIAR]])","v":6},828720,"INTERESES MORA MAYOR A 12 MESES"]
[{"$f":"LEN(PUC[[#This Row],[AUXILIAR]])","v":6},828722,"OTROS CONCEP VIGENTE Y MORA HASTA 1 MESE"]
[{"$f":"LEN(PUC[[#This Row],[AUXILIAR]])","v":6},828724,"OTROS CONCEP MORA MAYOR 1 MESES HASTA 3"]
[{"$f":"LEN(PUC[[#This Row],[AUXILIAR]])","v":6},828726,"OTROS CONCEP MORA MAYOR 3 MESES HASTA 6"]
[{"$f":"LEN(PUC[[#This Row],[AUXILIAR]])","v":6},828728,"OTROS CONCEP MORA MAYOR 6 MESES HAST 12"]
[{"$f":"LEN(PUC[[#This Row],[AUXILIAR]])","v":6},828730,"OTROS CONCEP MORA MAYOR A 12 MESES"]
[{"$f":"LEN(PUC[[#This Row],[AUXILIAR]])","v":6},828800,"CALIFICACION CREDITOS CIALES OTRAS GTIA"]
[{"$f":"LEN(PUC[[#This Row],[AUXILIAR]])","v":6},828802,"CAPITAL VIGENTE Y MORA HASTA 1 MESES"]
[{"$f":"LEN(PUC[[#This Row],[AUXILIAR]])","v":6},828804,"CAPITAL MORA MAYOR A 1 MESES HASTA 3 MES"]
[{"$f":"LEN(PUC[[#This Row],[AUXILIAR]])","v":6},828806,"CAPITAL MORA MAYOR A 3 MESES HASTA 6 ME"]
[{"$f":"LEN(PUC[[#This Row],[AUXILIAR]])","v":6},828808,"CAPITAL MORA MAYOR A 6 MESES HASTA 12 M"]
[{"$f":"LEN(PUC[[#This Row],[AUXILIAR]])","v":6},828810,"CAPITAL MORA MAYOR A 12 MESES"]
[{"$f":"LEN(PUC[[#This Row],[AUXILIAR]])","v":6},828812,"INTERESES VIGENTE Y MORA HASTA 1 MESES"]
[{"$f":"LEN(PUC[[#This Row],[AUXILIAR]])","v":6},828814,"INTERESES MORA MAYOR A 1 MESES HASTA 3"]
[{"$f":"LEN(PUC[[#This Row],[AUXILIAR]])","v":6},828816,"INTERESES MORA MAYOR A 3 MESES HASTA 6"]
[{"$f":"LEN(PUC[[#This Row],[AUXILIAR]])","v":6},828818,"INTERESES MORA MAYOR A 6 MESES HASTA 12"]
[{"$f":"LEN(PUC[[#This Row],[AUXILIAR]])","v":6},828820,"INTERESES MORA MAYOR A 12 MESES"]
[{"$f":"LEN(PUC[[#This Row],[AUXILIAR]])","v":6},828822,"OTROS CONCEP VIGENTE Y MORA HASTA 1 MESE"]
[{"$f":"LEN(PUC[[#This Row],[AUXILIAR]])","v":6},828824,"OTROS CONCEP MORA MAYOR 1 MESES HASTA 3"]
[{"$f":"LEN(PUC[[#This Row],[AUXILIAR]])","v":6},828826,"OTROS CONCEP MORA MAYOR 3 MESES HASTA 6"]
[{"$f":"LEN(PUC[[#This Row],[AUXILIAR]])","v":6},828828,"OTROS CONCEP MORA MAYOR 6 MESES HAST 12"]
[{"$f":"LEN(PUC[[#This Row],[AUXILIAR]])","v":6},828830,"OTROS CONCEP MORA MAYOR A 12 MESES"]
[{"$f":"LEN(PUC[[#This Row],[AUXILIAR]])","v":6},829000,"OPERAC RECIP PASIV CON MATRICES Y SUBORD"]
[{"$f":"LEN(PUC[[#This Row],[AUXILIAR]])","v":6},829005,"DEPOSITOS Y EXIGIBILIDADES"]
[{"$f":"LEN(PUC[[#This Row],[AUXILIAR]])","v":6},829010,"OPERACIONES DEL MERCADO MONETARIO Y RELA"]
[{"$f":"LEN(PUC[[#This Row],[AUXILIAR]])","v":6},829015,"ACEPTACIONES BANCARIAS EN CIRCULACION"]
[{"$f":"LEN(PUC[[#This Row],[AUXILIAR]])","v":6},829020,"CREDITOS BCOS Y OTRAS OBLIG FINANCI"]
[{"$f":"LEN(PUC[[#This Row],[AUXILIAR]])","v":6},829025,"CUENTAS POR PAGAR"]
[{"$f":"LEN(PUC[[#This Row],[AUXILIAR]])","v":6},829030,"TITULOS DE INVERSION EN CIRCULACION"]
[{"$f":"LEN(PUC[[#This Row],[AUXILIAR]])","v":6},829035,"PASIVOS ESTIMADOS Y PROVISONES"]
[{"$f":"LEN(PUC[[#This Row],[AUXILIAR]])","v":6},829040,"BONOS OBLIG CONVERT EN ACCIONES"]
[{"$f":"LEN(PUC[[#This Row],[AUXILIAR]])","v":6},829045,"OTROS PASIVOS"]
[{"$f":"LEN(PUC[[#This Row],[AUXILIAR]])","v":6},829200,"OPER RECIP AFECT PATRIM MATRICES Y SUBOR"]
[{"$f":"LEN(PUC[[#This Row],[AUXILIAR]])","v":6},829205,"CAPITAL SOCIAL"]
[{"$f":"LEN(PUC[[#This Row],[AUXILIAR]])","v":6},829210,"APORTES SOCIALES"]
[{"$f":"LEN(PUC[[#This Row],[AUXILIAR]])","v":6},829215,"RESERVAS"]
[{"$f":"LEN(PUC[[#This Row],[AUXILIAR]])","v":6},829217,"GAN O PERD ACUM NO REALIZADAS EN INV DIS"]
[{"$f":"LEN(PUC[[#This Row],[AUXILIAR]])","v":6},829220,"REVALORIZACION DEL PATRIMONIO"]
[{"$f":"LEN(PUC[[#This Row],[AUXILIAR]])","v":6},829225,"SUPERAVIT POR VALORIZACION"]
[{"$f":"LEN(PUC[[#This Row],[AUXILIAR]])","v":6},829230,"DESVALORIZACIONES"]
[{"$f":"LEN(PUC[[#This Row],[AUXILIAR]])","v":6},829235,"RESULTADOS EJERCICIOS ANTERIORES"]
[{"$f":"LEN(PUC[[#This Row],[AUXILIAR]])","v":6},829240,"RESULTADOS DEL EJERCICIO"]
[{"$f":"LEN(PUC[[#This Row],[AUXILIAR]])","v":6},829245,"DIVIDENDOS DECRETADOS EN ACCIONES"]
[{"$f":"LEN(PUC[[#This Row],[AUXILIAR]])","v":6},829295,"OTROS CONCEPTOS"]
[{"$f":"LEN(PUC[[#This Row],[AUXILIAR]])","v":6},829400,"OPER RECIP AFECT INGRESOS CON MATR Y SUB"]
[{"$f":"LEN(PUC[[#This Row],[AUXILIAR]])","v":6},829401,"OPERACIONALES"]
[{"$f":"LEN(PUC[[#This Row],[AUXILIAR]])","v":6},829402,"NO OPERACIONALES"]
[{"$f":"LEN(PUC[[#This Row],[AUXILIAR]])","v":6},829500,"OTRAS CUENTAS DE ORDEN ACREEDORAS"]
[{"$f":"LEN(PUC[[#This Row],[AUXILIAR]])","v":6},829595,"OTRAS CUENTAS DE ORDEN ACREEDORAS"]
[{"$f":"LEN(PUC[[#This Row],[AUXILIAR]])","v":6},830000,"DEUDORAS POR CONTRA"]
[{"$f":"LEN(PUC[[#This Row],[AUXILIAR]])","v":6},830500,"DEUDORAS POR CONTRA (CR)"]
[{"$f":"LEN(PUC[[#This Row],[AUXILIAR]])","v":6},830700,"PRECIO JUSTO DE INTERCAMBIO DE POSICIONE"]
[{"$f":"LEN(PUC[[#This Row],[AUXILIAR]])","v":6},830705,"COBERTURAS DE FLUJOS DE EFECTIVO POSICIO"]
[{"$f":"LEN(PUC[[#This Row],[AUXILIAR]])","v":6},830710,"COBERTURAS DE OPERACIONES ACTIVAS EN MON"]
[{"$f":"LEN(PUC[[#This Row],[AUXILIAR]])","v":6},840000,"ACREEDORAS POR CONTRA"]
[{"$f":"LEN(PUC[[#This Row],[AUXILIAR]])","v":6},840500,"ACREEDORAS POR CONTRA (DB)"]
[{"$f":"LEN(PUC[[#This Row],[AUXILIAR]])","v":6},840700,"PRECIO JUSTO DE INTERCAMBIO DE POSICIONE"]
[{"$f":"LEN(PUC[[#This Row],[AUXILIAR]])","v":6},840705,"COBERTURAS DE FLUJOS DE EFECTIVO POSICIO"]
[{"$f":"LEN(PUC[[#This Row],[AUXILIAR]])","v":6},840710,"COBERTURAS DE OPERACIONES ACTIVAS EN MON"]

{"sheet":"CENTRO DE COSTOS","index":3,"n_rows":22,"n_cols":18,"rows_kept":22,"cut":false,"hidden":false,"merged":[[0,0,0,4],[0,5,0,8],[0,12,0,17],[0,9,0,11]]}
["INFORMACION DEL PREDIO",null,null,null,null,"INFORMACION DE TERRENO",null,null,null,"PLANTACION",null,null,"VALOR PREDIO"]
["CENTRO DE COSTOS","DESTINACIÓN","SITUACIÓN (CON - SIN EXTINCIÓN)","PREDIO","UBICACIÓN (MUNICIPIO)","HECTÁREAS SEMBRADAS PRODUCTIVA","HECTÁREAS SEMBRADAS NO PRODUCTIVA","HECTÁREAS NO CONTROLADA","ÁREA TOTAL","TIPO","EDAD PLANTACIÓN","VIDA ÚTIL RESTANTE (AÑOS)","ÁREA DE CULTIVO","ÁREA FORESTAL","VÍAS DE ACCESO","CONSTRUCCIONES","ACTIVO BIOLÓGICO","TOTAL PREDIO"]
["CONSOLIDADO",null,null,null,null,null,null,null,{"$f":"+Tabla4[[#This Row],[HECTÁREAS SEMBRADAS PRODUCTIVA]]+Tabla4[[#This Row],[HECTÁREAS SEMBRADAS NO PRODUCTIVA]]+Tabla4[[#This Row],[HECTÁREAS NO CONTROLADA]]","v":0},null,null,null,null,null,null,null,null,{"$f":"+Tabla4[[#This Row],[ÁREA DE CULTIVO]]+Tabla4[[#This Row],[CONSTRUCCIONES]]+Tabla4[[#This Row],[ACTIVO BIOLÓGICO]]","v":0}]
["Asesores de campo","MISIONALIDAD FRV",null,null,null,null,null,null,{"$f":"+Tabla4[[#This Row],[HECTÁREAS SEMBRADAS PRODUCTIVA]]+Tabla4[[#This Row],[HECTÁREAS SEMBRADAS NO PRODUCTIVA]]+Tabla4[[#This Row],[HECTÁREAS NO CONTROLADA]]","v":0},null,null,null,null,null,null,null,null,{"$f":"+Tabla4[[#This Row],[ÁREA DE CULTIVO]]+Tabla4[[#This Row],[CONSTRUCCIONES]]+Tabla4[[#This Row],[ACTIVO BIOLÓGICO]]","v":0}]
["Equipo Auxiliares de Mantenimiento","MISIONALIDAD FRV",null,null,null,null,null,null,{"$f":"+Tabla4[[#This Row],[HECTÁREAS SEMBRADAS PRODUCTIVA]]+Tabla4[[#This Row],[HECTÁREAS SEMBRADAS NO PRODUCTIVA]]+Tabla4[[#This Row],[HECTÁREAS NO CONTROLADA]]","v":0},null,null,null,null,null,null,null,null,{"$f":"+Tabla4[[#This Row],[ÁREA DE CULTIVO]]+Tabla4[[#This Row],[CONSTRUCCIONES]]+Tabla4[[#This Row],[ACTIVO BIOLÓGICO]]","v":0}]
["Equipo BAAF Proyectos Productivos","MISIONALIDAD FRV",null,null,null,null,null,null,{"$f":"+Tabla4[[#This Row],[HECTÁREAS SEMBRADAS PRODUCTIVA]]+Tabla4[[#This Row],[HECTÁREAS SEMBRADAS NO PRODUCTIVA]]+Tabla4[[#This Row],[HECTÁREAS NO CONTROLADA]]","v":0},null,null,null,null,null,null,null,null,{"$f":"+Tabla4[[#This Row],[ÁREA DE CULTIVO]]+Tabla4[[#This Row],[CONSTRUCCIONES]]+Tabla4[[#This Row],[ACTIVO BIOLÓGICO]]","v":0}]
["Equipo Catastal y Cartográfico Btá","MISIONALIDAD FRV",null,null,null,null,null,null,{"$f":"+Tabla4[[#This Row],[HECTÁREAS SEMBRADAS PRODUCTIVA]]+Tabla4[[#This Row],[HECTÁREAS SEMBRADAS NO PRODUCTIVA]]+Tabla4[[#This Row],[HECTÁREAS NO CONTROLADA]]","v":0},null,null,null,null,null,null,null,null,{"$f":"+Tabla4[[#This Row],[ÁREA DE CULTIVO]]+Tabla4[[#This Row],[CONSTRUCCIONES]]+Tabla4[[#This Row],[ACTIVO BIOLÓGICO]]","v":0}]
["Equipo de Administración de Inmuebles","MISIONALIDAD FRV",null,null,null,null,null,null,{"$f":"+Tabla4[[#This Row],[HECTÁREAS SEMBRADAS PRODUCTIVA]]+Tabla4[[#This Row],[HECTÁREAS SEMBRADAS NO PRODUCTIVA]]+Tabla4[[#This Row],[HECTÁREAS NO CONTROLADA]]","v":0},null,null,null,null,null,null,null,null,{"$f":"+Tabla4[[#This Row],[ÁREA DE CULTIVO]]+Tabla4[[#This Row],[CONSTRUCCIONES]]+Tabla4[[#This Row],[ACTIVO BIOLÓGICO]]","v":0}]
["Equipo de Admón Muebles y Vocación Social Reparadora","MISIONALIDAD FRV",null,null,null,null,null,null,{"$f":"+Tabla4[[#This Row],[HECTÁREAS SEMBRADAS PRODUCTIVA]]+Tabla4[[#This Row],[HECTÁREAS SEMBRADAS NO PRODUCTIVA]]+Tabla4[[#This Row],[HECTÁREAS NO CONTROLADA]]","v":0},null,null,null,null,null,null,null,null,{"$f":"+Tabla4[[#This Row],[ÁREA DE CULTIVO]]+Tabla4[[#This Row],[CONSTRUCCIONES]]+Tabla4[[#This Row],[ACTIVO BIOLÓGICO]]","v":0}]
["Equipo de BAAF","MISIONALIDAD FRV",null,null,null,null,null,null,{"$f":"+Tabla4[[#This Row],[HECTÁREAS SEMBRADAS PRODUCTIVA]]+Tabla4[[#This Row],[HECTÁREAS SEMBRADAS NO PRODUCTIVA]]+Tabla4[[#This Row],[HECTÁREAS NO CONTROLADA]]","v":0},null,null,null,null,null,null,null,null,{"$f":"+Tabla4[[#This Row],[ÁREA DE CULTIVO]]+Tabla4[[#This Row],[CONSTRUCCIONES]]+Tabla4[[#This Row],[ACTIVO BIOLÓGICO]]","v":0}]
["Equipo Financiero Bogotá","MISIONALIDAD FRV",null,null,null,null,null,null,{"$f":"+Tabla4[[#This Row],[HECTÁREAS SEMBRADAS PRODUCTIVA]]+Tabla4[[#This Row],[HECTÁREAS SEMBRADAS NO PRODUCTIVA]]+Tabla4[[#This Row],[HECTÁREAS NO CONTROLADA]]","v":0},null,null,null,null,null,null,null,null,{"$f":"+Tabla4[[#This Row],[ÁREA DE CULTIVO]]+Tabla4[[#This Row],[CONSTRUCCIONES]]+Tabla4[[#This Row],[ACTIVO BIOLÓGICO]]","v":0}]
["Equipo Gestión de la Información","MISIONALIDAD FRV",null,null,null,null,null,null,{"$f":"+Tabla4[[#This Row],[HECTÁREAS SEMBRADAS PRODUCTIVA]]+Tabla4[[#This Row],[HECTÁREAS SEMBRADAS NO PRODUCTIVA]]+Tabla4[[#This Row],[HECTÁREAS NO CONTROLADA]]","v":0},null,null,null,null,null,null,null,null,{"$f":"+Tabla4[[#This Row],[ÁREA DE CULTIVO]]+Tabla4[[#This Row],[CONSTRUCCIONES]]+Tabla4[[#This Row],[ACTIVO BIOLÓGICO]]","v":0}]
["Equipo Indeminizaciones Judiciales","MISIONALIDAD FRV",null,null,null,null,null,null,{"$f":"+Tabla4[[#This Row],[HECTÁREAS SEMBRADAS PRODUCTIVA]]+Tabla4[[#This Row],[HECTÁREAS SEMBRADAS NO PRODUCTIVA]]+Tabla4[[#This Row],[HECTÁREAS NO CONTROLADA]]","v":0},null,null,null,null,null,null,null,null,{"$f":"+Tabla4[[#This Row],[ÁREA DE CULTIVO]]+Tabla4[[#This Row],[CONSTRUCCIONES]]+Tabla4[[#This Row],[ACTIVO BIOLÓGICO]]","v":0}]
["Equipo JurÍdico Bogotá","MISIONALIDAD FRV",null,null,null,null,null,null,{"$f":"+Tabla4[[#This Row],[HECTÁREAS SEMBRADAS PRODUCTIVA]]+Tabla4[[#This Row],[HECTÁREAS SEMBRADAS NO PRODUCTIVA]]+Tabla4[[#This Row],[HECTÁREAS NO CONTROLADA]]","v":0},null,null,null,null,null,null,null,null,{"$f":"+Tabla4[[#This Row],[ÁREA DE CULTIVO]]+Tabla4[[#This Row],[CONSTRUCCIONES]]+Tabla4[[#This Row],[ACTIVO BIOLÓGICO]]","v":0}]
["Equipo Nuevas Fuentes","MISIONALIDAD FRV",null,null,null,null,null,null,{"$f":"+Tabla4[[#This Row],[HECTÁREAS SEMBRADAS PRODUCTIVA]]+Tabla4[[#This Row],[HECTÁREAS SEMBRADAS NO PRODUCTIVA]]+Tabla4[[#This Row],[HECTÁREAS NO CONTROLADA]]","v":0},null,null,null,null,null,null,null,null,{"$f":"+Tabla4[[#This Row],[ÁREA DE CULTIVO]]+Tabla4[[#This Row],[CONSTRUCCIONES]]+Tabla4[[#This Row],[ACTIVO BIOLÓGICO]]","v":0}]
["FRV","MISIONALIDAD FRV",null,null,null,null,null,null,{"$f":"+Tabla4[[#This Row],[HECTÁREAS SEMBRADAS PRODUCTIVA]]+Tabla4[[#This Row],[HECTÁREAS SEMBRADAS NO PRODUCTIVA]]+Tabla4[[#This Row],[HECTÁREAS NO CONTROLADA]]","v":0},null,null,null,null,null,null,null,null,{"$f":"+Tabla4[[#This Row],[ÁREA DE CULTIVO]]+Tabla4[[#This Row],[CONSTRUCCIONES]]+Tabla4[[#This Row],[ACTIVO BIOLÓGICO]]","v":0}]
["Caucheros Frutos del Perdón","PLANTACIONES",null,12345,null,15,285,700,{"$f":"+Tabla4[[#This Row],[HECTÁREAS SEMBRADAS PRODUCTIVA]]+Tabla4[[#This Row],[HECTÁREAS SEMBRADAS NO PRODUCTIVA]]+Tabla4[[#This Row],[HECTÁREAS NO CONTROLADA]]","v":1000},null,null,null,null,null,null,null,null,{"$f":"+Tabla4[[#This Row],[ÁREA DE CULTIVO]]+Tabla4[[#This Row],[CONSTRUCCIONES]]+Tabla4[[#This Row],[ACTIVO BIOLÓGICO]]","v":0}]
["Maderero Sembremos Pais","PLANTACIONES",null,null,null,null,null,null,{"$f":"+Tabla4[[#This Row],[HECTÁREAS SEMBRADAS PRODUCTIVA]]+Tabla4[[#This Row],[HECTÁREAS SEMBRADAS NO PRODUCTIVA]]+Tabla4[[#This Row],[HECTÁREAS NO CONTROLADA]]","v":0},null,null,null,null,null,null,null,null,{"$f":"+Tabla4[[#This Row],[ÁREA DE CULTIVO]]+Tabla4[[#This Row],[CONSTRUCCIONES]]+Tabla4[[#This Row],[ACTIVO BIOLÓGICO]]","v":0}]
["Palmar Cosechando Paz","PLANTACIONES",null,null,null,null,null,null,{"$f":"+Tabla4[[#This Row],[HECTÁREAS SEMBRADAS PRODUCTIVA]]+Tabla4[[#This Row],[HECTÁREAS SEMBRADAS NO PRODUCTIVA]]+Tabla4[[#This Row],[HECTÁREAS NO CONTROLADA]]","v":0},null,null,null,null,null,null,null,null,{"$f":"+Tabla4[[#This Row],[ÁREA DE CULTIVO]]+Tabla4[[#This Row],[CONSTRUCCIONES]]+Tabla4[[#This Row],[ACTIVO BIOLÓGICO]]","v":0}]
["Palmar Renacer de Esperanza","PLANTACIONES",null,null,null,null,null,null,{"$f":"+Tabla4[[#This Row],[HECTÁREAS SEMBRADAS PRODUCTIVA]]+Tabla4[[#This Row],[HECTÁREAS SEMBRADAS NO PRODUCTIVA]]+Tabla4[[#This Row],[HECTÁREAS NO CONTROLADA]]","v":0},null,null,null,null,null,null,null,null,{"$f":"+Tabla4[[#This Row],[ÁREA DE CULTIVO]]+Tabla4[[#This Row],[CONSTRUCCIONES]]+Tabla4[[#This Row],[ACTIVO BIOLÓGICO]]","v":0}]
["Palmar Semillas de Reconciliación","PLANTACIONES",null,null,null,null,null,null,{"$f":"+Tabla4[[#This Row],[HECTÁREAS SEMBRADAS PRODUCTIVA]]+Tabla4[[#This Row],[HECTÁREAS SEMBRADAS NO PRODUCTIVA]]+Tabla4[[#This Row],[HECTÁREAS NO CONTROLADA]]","v":0},null,null,null,null,null,null,null,null,{"$f":"+Tabla4[[#This Row],[ÁREA DE CULTIVO]]+Tabla4[[#This Row],[CONSTRUCCIONES]]+Tabla4[[#This Row],[ACTIVO BIOLÓGICO]]","v":0}]
["Palmar Rancho Santa Teresa","PLANTACIONES",null,null,null,null,null,null,{"$f":"+Tabla4[[#This Row],[HECTÁREAS SEMBRADAS PRODUCTIVA]]+Tabla4[[#This Row],[HECTÁREAS SEMBRADAS NO PRODUCTIVA]]+Tabla4[[#This Row],[HECTÁREAS NO CONTROLADA]]","v":0},null,null,null,null,null,null,null,null,{"$f":"+Tabla4[[#This Row],[ÁREA DE CULTIVO]]+Tabla4[[#This Row],[CONSTRUCCIONES]]+Tabla4[[#This Row],[ACTIVO BIOLÓGICO]]","v":0}]

{"sheet":"REGISTRO","index":4,"n_rows":47,"n_cols":12,"rows_kept":47,"cut":false,"hidden":false,"merged":[[27,6,27,7],[27,4,27,5],[14,1,15,1],[31,4,31,5],[31,6,31,7],[27,1,27,3],[1,6,2,7],[3,6,4,6],[3,7,4,7],[1,3,1,5],[2,3,4,5],[6,4,6,5],[26,2,26,5],[23,2,25,7],[8,2,8,7],[12,6,12,7],[14,2,15,7],[10,6,10,7],[10,2,10,3],[10,4,10,5]]}
[]
[null,null,null,"PROYECTOS PRODUCTIVOS",null,null,{"$f":"IFERROR(VLOOKUP($E$13,$K$2:$L$34,2,FALSE),\"\")","v":"DEPRECIACION"},null,null,{"$f":"IFERROR(VLOOKUP(C13,Diario[DOCUMENTO],1,0),\"\")","v":""},"ING","COMPROBANTE DE INGRESO"]
[null,null,null,"FONDO DE REPARACION A LAS VICTIMAS",null,null,null,null,null,null,"EG","COMPROBANTE DE EGRESO"]
[null,null,null,null,null,null,"No.",{"$f":"COUNT(Diario[Contar])+1","v":1},null,null,"DEP","DEPRECIACION"]
[null,null,null,null,null,null,null,null,null,null,"INV","MOVIMIENTO DE INVENTARIO"]
[]
[null,"Contrato:",null,"NIT",{"$f":"IFERROR(VLOOKUP($C$7,TERCEROS[],2,0),\"NIT\")","v":"NIT"},null,"fecha:",null,null,null,"SAL","SALDOS INICIALES"]
[]
[null,"Tercero:",{"$f":"IFERROR(VLOOKUP($C$7,TERCEROS[],3,0),\"\")","v":""}]
[]
[null,"Concepto",null,null,"Centro de costos:"]
[]
[null,"Documento:",null,"Tipo","DEP","Valor:"]
[]
[null,"Valor en letras:",{"$f":"LETRAS($G$13)","v":"Cero Pesos"}]
[]
[]
[null,"Columna1","Columna2","Columna3","Columna4","Columna5","Columna6","Columna7"]
[null,"CÓDIGO","CUENTA CONTABLE",null,"CENTRO DE COSTOS",null,"DÉBITO","CRÉDITO"]
[]
[]
[null,null,null,"SUMAS IGUALES",null,null,{"$f":"SUBTOTAL(109,G19:G21)","v":0},{"$f":"SUBTOTAL(109,H19:H21)","v":0}]
[]
[null,"DESCRIPCION"]
[]
[]
[]
[null,"CONTROL",null,null,"ELABORO",null,"APROBO"]
[]
[null,{"$f":"C7&C13","v":""},"TOTAL FACTURA",{"$f":"SUMIF(Diario[D&I],REGISTRO!$B$30,Diario[VALOR])","v":0}]
[0,{"$f":"C7&C13&G11","v":""},{"$f":"IFERROR(IF(VLOOKUP(B31,Diario[D&F&K],1,0)=REGISTRO!$B$31,\"DOCUMENTO DUPLICADO\",\"\"),\"\")","v":"DOCUMENTO DUPLICADO"}]
[null,null,null,null,"LORENA CORDOBA",null,"LIZA BOTELLO"]
[]
[]
[null,null,{"$f":"+G4","v":"No."},{"$f":"+H4","v":1}]
[null,null,{"$f":"+B7","v":"Contrato:"},{"$f":"+C7","v":0}]
[null,null,{"$f":"+G7","v":"fecha:"},{"$f":"+H7","v":"00:00:00"}]
[null,null,{"$f":"+B13","v":"Documento:"},{"$f":"+C13","v":0}]
[null,null,{"$f":"+D7","v":"NIT"},{"$f":"+E7","v":"NIT"}]
[null,null,{"$f":"+D13","v":"Tipo"},{"$f":"+E13","v":"DEP"}]
[null,null,{"$f":"+F13","v":"Valor:"},{"$f":"+G13","v":0}]
[null,null,{"$f":"+B11","v":"Concepto"},{"$f":"+C11","v":0}]
[null,null,{"$f":"+E11","v":"Centro de costos:"},{"$f":"+G11","v":0}]
[null,null,{"$f":"+G19","v":"DÉBITO"},{"$f":"+B20","v":0}]
[null,null,{"$f":"+H19","v":"CRÉDITO"},{"$f":"+B21","v":0}]
[null,null,{"$f":"+B24","v":"DESCRIPCION"},{"$f":"+C24","v":0}]
[null,null,{"$f":"+E28","v":"ELABORO"},{"$f":"+E32","v":"LORENA CORDOBA"}]

{"sheet":"ACTIVOS","index":5,"n_rows":25,"n_cols":7,"rows_kept":25,"cut":false,"hidden":false,"merged":[]}
["FECHA COMPRA - AVALÚO","CENTRO DE COSTOS","DESCRIPCIÓN","CANTIDAD","VALOR DE COMPRA - AVALÚO UNITARIO","VALOR DE COMPRA - AVALÚO TOTAL","VIDA ÚTIL RESTANTE (MESES)"]
[]
[]
[]
[]
[]
[]
[]
[]
[]
[]
[]
[]
[]
[]
[]
[]
[]
[]
[]
[]
[]
[]
[]
["Total",null,null,null,{"$f":"SUBTOTAL(109,ACTIVOSFIJOS[VALOR DE COMPRA - AVALÚO UNITARIO])","v":0}]

{"sheet":"Libro Diario","index":6,"n_rows":31,"n_cols":18,"rows_kept":31,"cut":false,"hidden":false,"merged":[]}
["D&I","Contar","No.","CONTRATO","FECHA","DOCUMENTO","NIT","TIPO","VALOR","CONCEPTO","CENTRO DE COSTOS","DEBITO","CREDITO","DESCRIPCION","ELABORO","BAL_PRUEBA_DEB","BAL_PRUEBA_CRE","D&F&K"]
[{"$f":"Diario[[#This Row],[CONTRATO]]&Diario[[#This Row],[DOCUMENTO]]","v":""},{"$f":"IF(Diario[[#This Row],[TIPO]]=REGISTRO!$E$13,COUNTIF($C$1:C2,\">0\"),\"\")","v":""},null,null,null,null,null,null,null,null,null,null,null,null,null,{"$f":"IF('BALANCE DE PRUEBA UNITARIO'!$C$1=\"CONSOLIDADO\",Diario[[#This Row],[DEBITO]],IF(Diario[[#This Row],[CENTRO DE COSTOS]]='BALANCE DE PRUEBA UNITARIO'!$C$1,Diario[[#This Row],[DEBITO]],\"\"))","v":""},{"$f":"IF('BALANCE DE PRUEBA UNITARIO'!$C$1=\"CONSOLIDADO\",Diario[[#This Row],[CREDITO]],IF(Diario[[#This Row],[CENTRO DE COSTOS]]='BALANCE DE PRUEBA UNITARIO'!$C$1,Diario[[#This Row],[CREDITO]],\"\"))","v":""},{"$f":"Diario[[#This Row],[CONTRATO]]&Diario[[#This Row],[DOCUMENTO]]&Diario[[#This Row],[CENTRO DE COSTOS]]","v":""}]
[{"$f":"Diario[[#This Row],[CONTRATO]]&Diario[[#This Row],[DOCUMENTO]]","v":""},{"$f":"IF(Diario[[#This Row],[TIPO]]=REGISTRO!$E$13,COUNTIF($C$1:C3,\">0\"),\"\")","v":""},null,null,null,null,null,null,null,null,null,null,null,null,null,{"$f":"IF('BALANCE DE PRUEBA UNITARIO'!$C$1=\"CONSOLIDADO\",Diario[[#This Row],[DEBITO]],IF(Diario[[#This Row],[CENTRO DE COSTOS]]='BALANCE DE PRUEBA UNITARIO'!$C$1,Diario[[#This Row],[DEBITO]],\"\"))","v":""},{"$f":"IF('BALANCE DE PRUEBA UNITARIO'!$C$1=\"CONSOLIDADO\",Diario[[#This Row],[CREDITO]],IF(Diario[[#This Row],[CENTRO DE COSTOS]]='BALANCE DE PRUEBA UNITARIO'!$C$1,Diario[[#This Row],[CREDITO]],\"\"))","v":""},{"$f":"Diario[[#This Row],[CONTRATO]]&Diario[[#This Row],[DOCUMENTO]]&Diario[[#This Row],[CENTRO DE COSTOS]]","v":""}]
["Total",null,null,null,null,null,null,null,{"$f":"SUBTOTAL(109,Diario[VALOR])","v":0},null,null,null,null,null,null,null,{"$f":"SUBTOTAL(103,Diario[BAL_PRUEBA_CRE])","v":2}]
[]
[null,null,null,null,null,null,null,null,1321811501.648684,{"$f":"+Diario[[#Totals],[VALOR]]-I6","v":-1321811501.648684}]
[null,null,null,null,null,null,null,null,{"$f":"CONCEPTO","v":"CONCEPTO"},{"$f":"costos","v":"CENTRO DE COSTOS"}]
[null,null,null,null,null,null,null,null,"Avaluo Comercial","CONSOLIDADO"]
[null,null,null,null,null,null,null,null,"Combustibles y lubricantes","Asesores de campo"]
[null,null,null,null,null,null,null,null,"Comisiones","Equipo Auxiliares de Mantenimiento"]
[null,null,null,null,null,null,null,null,"Compra de papeleria","Equipo BAAF Proyectos Productivos"]
[null,null,null,null,null,null,null,null,"Dotacion","Equipo Catastal y Cartográfico Btá"]
[null,null,null,null,null,null,null,null,"Equipo de computación","Equipo de Administración de Inmuebles"]
[null,null,null,null,null,null,null,null,"Herramientas y equipos","Equipo de Admón Muebles y Vocación Social Reparadora"]
[null,null,null,null,null,null,null,null,"Kits de seguridad personal y familiar","Equipo de BAAF"]
[null,null,null,null,null,null,null,null,"Mantenimiento de PPyE","Equipo Financiero Bogotá"]
[null,null,null,null,null,null,null,null,"Nomina","Equipo Gestión de la Información"]
[null,null,null,null,null,null,null,null,"Pago Exámenes Médicos de Ingreso Personal","Equipo Indeminizaciones Judiciales"]
[null,null,null,null,null,null,null,null,"Pago Final Implementación del SGSST","Equipo JurÍdico Bogotá"]
[null,null,null,null,null,null,null,null,"Seguros","Equipo Nuevas Fuentes"]
[null,null,null,null,null,null,null,null,"Servicio de Vigilancia","FRV"]
[null,null,null,null,null,null,null,null,"Servicios agrícolas y ganaderos","Caucheros Frutos del Perdón"]
[null,null,null,null,null,null,null,null,"Transporte","Maderero Sembremos Pais"]
[null,null,null,null,null,null,null,null,"Viáticos","Palmar Cosechando Paz"]
[null,null,null,null,null,null,null,null,"Servicios de comercialización","Palmar Renacer de Esperanza"]
[null,null,null,null,null,null,null,null,"Interventoría","Palmar Semillas de Reconciliación"]
[null,null,null,null,null,null,null,null,"Activos Biológicos","Palmar Rancho Santa Teresa"]
[null,null,null,null,null,null,null,null,"Ingresos Agrícolas"]
[null,null,null,null,null,null,null,null,"Agroinsumos"]
[null,null,null,null,null,null,null,null,"Bodegas portátiles"]
[null,null,null,null,null,null,null,null,0]

{"sheet":"BALANCE DE PRUEBA UNITARIO","index":7,"n_rows":29,"n_cols":5,"rows_kept":29,"cut":false,"hidden":false,"merged":[[1,3,1,4]]}
["CENTRO DE COSTOS",null,"Palmar Renacer de Esperanza"]
[]
["CUENTA","AUXILIAR","DESCRIPCION","DEB","CRE"]
[{"$f":"IF(LEN(PUC_3[[#This Row],[AUXILIAR]])=1,PUC_3[[#This Row],[AUXILIAR]]*100000,IF(LEN(PUC_3[[#This Row],[AUXILIAR]])=2,PUC_3[[#This Row],[AUXILIAR]]*10000,IF(LEN(PUC_3[[#This Row],[AUXILIAR]])=4,PUC_3[[#This Row],[AUXILIAR]]*100,PUC_3[[#This Row],[AUXILIAR]])))","v":130505},130505,{"$f":"VLOOKUP(PUC_3[[#This Row],[AUXILIAR]],PUC[[AUXILIAR]:[CUENTA]],2,0)","v":"NACIONALES "},{"$f":"SUMIF(Diario[BAL_PRUEBA_DEB],PUC_3[[#This Row],[CUENTA]],Diario[VALOR])","v":0},{"$f":"SUMIF(Diario[BAL_PRUEBA_CRE],PUC_3[[#This Row],[CUENTA]],Diario[VALOR])","v":0}]
[{"$f":"IF(LEN(PUC_3[[#This Row],[AUXILIAR]])=1,PUC_3[[#This Row],[AUXILIAR]]*100000,IF(LEN(PUC_3[[#This Row],[AUXILIAR]])=2,PUC_3[[#This Row],[AUXILIAR]]*10000,IF(LEN(PUC_3[[#This Row],[AUXILIAR]])=4,PUC_3[[#This Row],[AUXILIAR]]*100,PUC_3[[#This Row],[AUXILIAR]])))","v":143015},143015,{"$f":"VLOOKUP(PUC_3[[#This Row],[AUXILIAR]],PUC[[AUXILIAR]:[CUENTA]],2,0)","v":"PRODUCTOS AGRICOLAS Y FORESTALES "},{"$f":"SUMIF(Diario[BAL_PRUEBA_DEB],PUC_3[[#This Row],[CUENTA]],Diario[VALOR])","v":0},{"$f":"SUMIF(Diario[BAL_PRUEBA_CRE],PUC_3[[#This Row],[CUENTA]],Diario[VALOR])","v":0}]
[{"$f":"IF(LEN(PUC_3[[#This Row],[AUXILIAR]])=1,PUC_3[[#This Row],[AUXILIAR]]*100000,IF(LEN(PUC_3[[#This Row],[AUXILIAR]])=2,PUC_3[[#This Row],[AUXILIAR]]*10000,IF(LEN(PUC_3[[#This Row],[AUXILIAR]])=4,PUC_3[[#This Row],[AUXILIAR]]*100,PUC_3[[#This Row],[AUXILIAR]])))","v":151680},151680,{"$f":"VLOOKUP(PUC_3[[#This Row],[AUXILIAR]],PUC[[AUXILIAR]:[CUENTA]],2,0)","v":"BODEGAS "},{"$f":"SUMIF(Diario[BAL_PRUEBA_DEB],PUC_3[[#This Row],[CUENTA]],Diario[VALOR])","v":0},{"$f":"SUMIF(Diario[BAL_PRUEBA_CRE],PUC_3[[#This Row],[CUENTA]],Diario[VALOR])","v":0}]
[{"$f":"IF(LEN(PUC_3[[#This Row],[AUXILIAR]])=1,PUC_3[[#This Row],[AUXILIAR]]*100000,IF(LEN(PUC_3[[#This Row],[AUXILIAR]])=2,PUC_3[[#This Row],[AUXILIAR]]*10000,IF(LEN(PUC_3[[#This Row],[AUXILIAR]])=4,PUC_3[[#This Row],[AUXILIAR]]*100,PUC_3[[#This Row],[AUXILIAR]])))","v":152000},152000,{"$f":"VLOOKUP(PUC_3[[#This Row],[AUXILIAR]],PUC[[AUXILIAR]:[CUENTA]],2,0)","v":"MAQUINARIA Y EQUIPO "},{"$f":"SUMIF(Diario[BAL_PRUEBA_DEB],PUC_3[[#This Row],[CUENTA]],Diario[VALOR])","v":0},{"$f":"SUMIF(Diario[BAL_PRUEBA_CRE],PUC_3[[#This Row],[CUENTA]],Diario[VALOR])","v":0}]
[{"$f":"IF(LEN(PUC_3[[#This Row],[AUXILIAR]])=1,PUC_3[[#This Row],[AUXILIAR]]*100000,IF(LEN(PUC_3[[#This Row],[AUXILIAR]])=2,PUC_3[[#This Row],[AUXILIAR]]*10000,IF(LEN(PUC_3[[#This Row],[AUXILIAR]])=4,PUC_3[[#This Row],[AUXILIAR]]*100,PUC_3[[#This Row],[AUXILIAR]])))","v":158405},158405,{"$f":"VLOOKUP(PUC_3[[#This Row],[AUXILIAR]],PUC[[AUXILIAR]:[CUENTA]],2,0)","v":"ESPECIES MENORES "},{"$f":"SUMIF(Diario[BAL_PRUEBA_DEB],PUC_3[[#This Row],[CUENTA]],Diario[VALOR])","v":0},{"$f":"SUMIF(Diario[BAL_PRUEBA_CRE],PUC_3[[#This Row],[CUENTA]],Diario[VALOR])","v":0}]
[{"$f":"IF(LEN(PUC_3[[#This Row],[AUXILIAR]])=1,PUC_3[[#This Row],[AUXILIAR]]*100000,IF(LEN(PUC_3[[#This Row],[AUXILIAR]])=2,PUC_3[[#This Row],[AUXILIAR]]*10000,IF(LEN(PUC_3[[#This Row],[AUXILIAR]])=4,PUC_3[[#This Row],[AUXILIAR]]*100,PUC_3[[#This Row],[AUXILIAR]])))","v":158815},158815,{"$f":"VLOOKUP(PUC_3[[#This Row],[AUXILIAR]],PUC[[AUXILIAR]:[CUENTA]],2,0)","v":"EQUIPO DE COMPUTACION Y COMUNICACION "},{"$f":"SUMIF(Diario[BAL_PRUEBA_DEB],PUC_3[[#This Row],[CUENTA]],Diario[VALOR])","v":0},{"$f":"SUMIF(Diario[BAL_PRUEBA_CRE],PUC_3[[#This Row],[CUENTA]],Diario[VALOR])","v":0}]
[{"$f":"IF(LEN(PUC_3[[#This Row],[AUXILIAR]])=1,PUC_3[[#This Row],[AUXILIAR]]*100000,IF(LEN(PUC_3[[#This Row],[AUXILIAR]])=2,PUC_3[[#This Row],[AUXILIAR]]*10000,IF(LEN(PUC_3[[#This Row],[AUXILIAR]])=4,PUC_3[[#This Row],[AUXILIAR]]*100,PUC_3[[#This Row],[AUXILIAR]])))","v":250505},250505,{"$f":"VLOOKUP(PUC_3[[#This Row],[AUXILIAR]],PUC[[AUXILIAR]:[CUENTA]],2,0)","v":"PROVEEDORES NACIONALES"},{"$f":"SUMIF(Diario[BAL_PRUEBA_DEB],PUC_3[[#This Row],[CUENTA]],Diario[VALOR])","v":0},{"$f":"SUMIF(Diario[BAL_PRUEBA_CRE],PUC_3[[#This Row],[CUENTA]],Diario[VALOR])","v":0}]
[{"$f":"IF(LEN(PUC_3[[#This Row],[AUXILIAR]])=1,PUC_3[[#This Row],[AUXILIAR]]*100000,IF(LEN(PUC_3[[#This Row],[AUXILIAR]])=2,PUC_3[[#This Row],[AUXILIAR]]*10000,IF(LEN(PUC_3[[#This Row],[AUXILIAR]])=4,PUC_3[[#This Row],[AUXILIAR]]*100,PUC_3[[#This Row],[AUXILIAR]])))","v":410545},410545,{"$f":"VLOOKUP(PUC_3[[#This Row],[AUXILIAR]],PUC[[AUXILIAR]:[CUENTA]],2,0)","v":"OTROS CULTIVOS AGRICOLAS "},{"$f":"SUMIF(Diario[BAL_PRUEBA_DEB],PUC_3[[#This Row],[CUENTA]],Diario[VALOR])","v":0},{"$f":"SUMIF(Diario[BAL_PRUEBA_CRE],PUC_3[[#This Row],[CUENTA]],Diario[VALOR])","v":0}]
[{"$f":"IF(LEN(PUC_3[[#This Row],[AUXILIAR]])=1,PUC_3[[#This Row],[AUXILIAR]]*100000,IF(LEN(PUC_3[[#This Row],[AUXILIAR]])=2,PUC_3[[#This Row],[AUXILIAR]]*10000,IF(LEN(PUC_3[[#This Row],[AUXILIAR]])=4,PUC_3[[#This Row],[AUXILIAR]]*100,PUC_3[[#This Row],[AUXILIAR]])))","v":510506},510506,{"$f":"VLOOKUP(PUC_3[[#This Row],[AUXILIAR]],PUC[[AUXILIAR]:[CUENTA]],2,0)","v":"SUELDOS "},{"$f":"SUMIF(Diario[BAL_PRUEBA_DEB],PUC_3[[#This Row],[CUENTA]],Diario[VALOR])","v":0},{"$f":"SUMIF(Diario[BAL_PRUEBA_CRE],PUC_3[[#This Row],[CUENTA]],Diario[VALOR])","v":0}]
[{"$f":"IF(LEN(PUC_3[[#This Row],[AUXILIAR]])=1,PUC_3[[#This Row],[AUXILIAR]]*100000,IF(LEN(PUC_3[[#This Row],[AUXILIAR]])=2,PUC_3[[#This Row],[AUXILIAR]]*10000,IF(LEN(PUC_3[[#This Row],[AUXILIAR]])=4,PUC_3[[#This Row],[AUXILIAR]]*100,PUC_3[[#This Row],[AUXILIAR]])))","v":510551},510551,{"$f":"VLOOKUP(PUC_3[[#This Row],[AUXILIAR]],PUC[[AUXILIAR]:[CUENTA]],2,0)","v":"DOTACION Y SUMINISTRO A TRABAJADORES "},{"$f":"SUMIF(Diario[BAL_PRUEBA_DEB],PUC_3[[#This Row],[CUENTA]],Diario[VALOR])","v":0},{"$f":"SUMIF(Diario[BAL_PRUEBA_CRE],PUC_3[[#This Row],[CUENTA]],Diario[VALOR])","v":0}]
[{"$f":"IF(LEN(PUC_3[[#This Row],[AUXILIAR]])=1,PUC_3[[#This Row],[AUXILIAR]]*100000,IF(LEN(PUC_3[[#This Row],[AUXILIAR]])=2,PUC_3[[#This Row],[AUXILIAR]]*10000,IF(LEN(PUC_3[[#This Row],[AUXILIAR]])=4,PUC_3[[#This Row],[AUXILIAR]]*100,PUC_3[[#This Row],[AUXILIAR]])))","v":510554},510554,{"$f":"VLOOKUP(PUC_3[[#This Row],[AUXILIAR]],PUC[[AUXILIAR]:[CUENTA]],2,0)","v":"SEGUROS "},{"$f":"SUMIF(Diario[BAL_PRUEBA_DEB],PUC_3[[#This Row],[CUENTA]],Diario[VALOR])","v":0},{"$f":"SUMIF(Diario[BAL_PRUEBA_CRE],PUC_3[[#This Row],[CUENTA]],Diario[VALOR])","v":0}]
[{"$f":"IF(LEN(PUC_3[[#This Row],[AUXILIAR]])=1,PUC_3[[#This Row],[AUXILIAR]]*100000,IF(LEN(PUC_3[[#This Row],[AUXILIAR]])=2,PUC_3[[#This Row],[AUXILIAR]]*10000,IF(LEN(PUC_3[[#This Row],[AUXILIAR]])=4,PUC_3[[#This Row],[AUXILIAR]]*100,PUC_3[[#This Row],[AUXILIAR]])))","v":510584},510584,{"$f":"VLOOKUP(PUC_3[[#This Row],[AUXILIAR]],PUC[[AUXILIAR]:[CUENTA]],2,0)","v":"GASTOS MEDICOS Y DROGAS "},{"$f":"SUMIF(Diario[BAL_PRUEBA_DEB],PUC_3[[#This Row],[CUENTA]],Diario[VALOR])","v":0},{"$f":"SUMIF(Diario[BAL_PRUEBA_CRE],PUC_3[[#This Row],[CUENTA]],Diario[VALOR])","v":0}]
[{"$f":"IF(LEN(PUC_3[[#This Row],[AUXILIAR]])=1,PUC_3[[#This Row],[AUXILIAR]]*100000,IF(LEN(PUC_3[[#This Row],[AUXILIAR]])=2,PUC_3[[#This Row],[AUXILIAR]]*10000,IF(LEN(PUC_3[[#This Row],[AUXILIAR]])=4,PUC_3[[#This Row],[AUXILIAR]]*100,PUC_3[[#This Row],[AUXILIAR]])))","v":511035},511035,{"$f":"VLOOKUP(PUC_3[[#This Row],[AUXILIAR]],PUC[[AUXILIAR]:[CUENTA]],2,0)","v":"ASESORIA TECNICA "},{"$f":"SUMIF(Diario[BAL_PRUEBA_DEB],PUC_3[[#This Row],[CUENTA]],Diario[VALOR])","v":0},{"$f":"SUMIF(Diario[BAL_PRUEBA_CRE],PUC_3[[#This Row],[CUENTA]],Diario[VALOR])","v":0}]
[{"$f":"IF(LEN(PUC_3[[#This Row],[AUXILIAR]])=1,PUC_3[[#This Row],[AUXILIAR]]*100000,IF(LEN(PUC_3[[#This Row],[AUXILIAR]])=2,PUC_3[[#This Row],[AUXILIAR]]*10000,IF(LEN(PUC_3[[#This Row],[AUXILIAR]])=4,PUC_3[[#This Row],[AUXILIAR]]*100,PUC_3[[#This Row],[AUXILIAR]])))","v":512080},512080,{"$f":"VLOOKUP(PUC_3[[#This Row],[AUXILIAR]],PUC[[AUXILIAR]:[CUENTA]],2,0)","v":"VIATICOS"},{"$f":"SUMIF(Diario[BAL_PRUEBA_DEB],PUC_3[[#This Row],[CUENTA]],Diario[VALOR])","v":0},{"$f":"SUMIF(Diario[BAL_PRUEBA_CRE],PUC_3[[#This Row],[CUENTA]],Diario[VALOR])","v":0}]
[{"$f":"IF(LEN(PUC_3[[#This Row],[AUXILIAR]])=1,PUC_3[[#This Row],[AUXILIAR]]*100000,IF(LEN(PUC_3[[#This Row],[AUXILIAR]])=2,PUC_3[[#This Row],[AUXILIAR]]*10000,IF(LEN(PUC_3[[#This Row],[AUXILIAR]])=4,PUC_3[[#This Row],[AUXILIAR]]*100,PUC_3[[#This Row],[AUXILIAR]])))","v":513015},513015,{"$f":"VLOOKUP(PUC_3[[#This Row],[AUXILIAR]],PUC[[AUXILIAR]:[CUENTA]],2,0)","v":"AVALUOS"},{"$f":"SUMIF(Diario[BAL_PRUEBA_DEB],PUC_3[[#This Row],[CUENTA]],Diario[VALOR])","v":0},{"$f":"SUMIF(Diario[BAL_PRUEBA_CRE],PUC_3[[#This Row],[CUENTA]],Diario[VALOR])","v":0}]
[{"$f":"IF(LEN(PUC_3[[#This Row],[AUXILIAR]])=1,PUC_3[[#This Row],[AUXILIAR]]*100000,IF(LEN(PUC_3[[#This Row],[AUXILIAR]])=2,PUC_3[[#This Row],[AUXILIAR]]*10000,IF(LEN(PUC_3[[#This Row],[AUXILIAR]])=4,PUC_3[[#This Row],[AUXILIAR]]*100,PUC_3[[#This Row],[AUXILIAR]])))","v":513595},513595,{"$f":"VLOOKUP(PUC_3[[#This Row],[AUXILIAR]],PUC[[AUXILIAR]:[CUENTA]],2,0)","v":"IMPLEMENTACION SSGT"},{"$f":"SUMIF(Diario[BAL_PRUEBA_DEB],PUC_3[[#This Row],[CUENTA]],Diario[VALOR])","v":0},{"$f":"SUMIF(Diario[BAL_PRUEBA_CRE],PUC_3[[#This Row],[CUENTA]],Diario[VALOR])","v":0}]
[{"$f":"IF(LEN(PUC_3[[#This Row],[AUXILIAR]])=1,PUC_3[[#This Row],[AUXILIAR]]*100000,IF(LEN(PUC_3[[#This Row],[AUXILIAR]])=2,PUC_3[[#This Row],[AUXILIAR]]*10000,IF(LEN(PUC_3[[#This Row],[AUXILIAR]])=4,PUC_3[[#This Row],[AUXILIAR]]*100,PUC_3[[#This Row],[AUXILIAR]])))","v":514515},514515,{"$f":"VLOOKUP(PUC_3[[#This Row],[AUXILIAR]],PUC[[AUXILIAR]:[CUENTA]],2,0)","v":"MANTENIMIENTO MAQUINARIA Y EQUIPO "},{"$f":"SUMIF(Diario[BAL_PRUEBA_DEB],PUC_3[[#This Row],[CUENTA]],Diario[VALOR])","v":0},{"$f":"SUMIF(Diario[BAL_PRUEBA_CRE],PUC_3[[#This Row],[CUENTA]],Diario[VALOR])","v":0}]
[{"$f":"IF(LEN(PUC_3[[#This Row],[AUXILIAR]])=1,PUC_3[[#This Row],[AUXILIAR]]*100000,IF(LEN(PUC_3[[#This Row],[AUXILIAR]])=2,PUC_3[[#This Row],[AUXILIAR]]*10000,IF(LEN(PUC_3[[#This Row],[AUXILIAR]])=4,PUC_3[[#This Row],[AUXILIAR]]*100,PUC_3[[#This Row],[AUXILIAR]])))","v":519005},519005,{"$f":"VLOOKUP(PUC_3[[#This Row],[AUXILIAR]],PUC[[AUXILIAR]:[CUENTA]],2,0)","v":"SERVICIOS DE ASEO Y VIGILANCIA"},{"$f":"SUMIF(Diario[BAL_PRUEBA_DEB],PUC_3[[#This Row],[CUENTA]],Diario[VALOR])","v":0},{"$f":"SUMIF(Diario[BAL_PRUEBA_CRE],PUC_3[[#This Row],[CUENTA]],Diario[VALOR])","v":0}]
[{"$f":"IF(LEN(PUC_3[[#This Row],[AUXILIAR]])=1,PUC_3[[#This Row],[AUXILIAR]]*100000,IF(LEN(PUC_3[[#This Row],[AUXILIAR]])=2,PUC_3[[#This Row],[AUXILIAR]]*10000,IF(LEN(PUC_3[[#This Row],[AUXILIAR]])=4,PUC_3[[#This Row],[AUXILIAR]]*100,PUC_3[[#This Row],[AUXILIAR]])))","v":519040},519040,{"$f":"VLOOKUP(PUC_3[[#This Row],[AUXILIAR]],PUC[[AUXILIAR]:[CUENTA]],2,0)","v":"TRANSPORTE"},{"$f":"SUMIF(Diario[BAL_PRUEBA_DEB],PUC_3[[#This Row],[CUENTA]],Diario[VALOR])","v":0},{"$f":"SUMIF(Diario[BAL_PRUEBA_CRE],PUC_3[[#This Row],[CUENTA]],Diario[VALOR])","v":0}]
[{"$f":"IF(LEN(PUC_3[[#This Row],[AUXILIAR]])=1,PUC_3[[#This Row],[AUXILIAR]]*100000,IF(LEN(PUC_3[[#This Row],[AUXILIAR]])=2,PUC_3[[#This Row],[AUXILIAR]]*10000,IF(LEN(PUC_3[[#This Row],[AUXILIAR]])=4,PUC_3[[#This Row],[AUXILIAR]]*100,PUC_3[[#This Row],[AUXILIAR]])))","v":519505},519505,{"$f":"VLOOKUP(PUC_3[[#This Row],[AUXILIAR]],PUC[[AUXILIAR]:[CUENTA]],2,0)","v":"COMISIONES "},{"$f":"SUMIF(Diario[BAL_PRUEBA_DEB],PUC_3[[#This Row],[CUENTA]],Diario[VALOR])","v":0},{"$f":"SUMIF(Diario[BAL_PRUEBA_CRE],PUC_3[[#This Row],[CUENTA]],Diario[VALOR])","v":0}]
[{"$f":"IF(LEN(PUC_3[[#This Row],[AUXILIAR]])=1,PUC_3[[#This Row],[AUXILIAR]]*100000,IF(LEN(PUC_3[[#This Row],[AUXILIAR]])=2,PUC_3[[#This Row],[AUXILIAR]]*10000,IF(LEN(PUC_3[[#This Row],[AUXILIAR]])=4,PUC_3[[#This Row],[AUXILIAR]]*100,PUC_3[[#This Row],[AUXILIAR]])))","v":519530},519530,{"$f":"VLOOKUP(PUC_3[[#This Row],[AUXILIAR]],PUC[[AUXILIAR]:[CUENTA]],2,0)","v":"UTILES, PAPELERIA Y FOTOCOPIAS "},{"$f":"SUMIF(Diario[BAL_PRUEBA_DEB],PUC_3[[#This Row],[CUENTA]],Diario[VALOR])","v":0},{"$f":"SUMIF(Diario[BAL_PRUEBA_CRE],PUC_3[[#This Row],[CUENTA]],Diario[VALOR])","v":0}]
[{"$f":"IF(LEN(PUC_3[[#This Row],[AUXILIAR]])=1,PUC_3[[#This Row],[AUXILIAR]]*100000,IF(LEN(PUC_3[[#This Row],[AUXILIAR]])=2,PUC_3[[#This Row],[AUXILIAR]]*10000,IF(LEN(PUC_3[[#This Row],[AUXILIAR]])=4,PUC_3[[#This Row],[AUXILIAR]]*100,PUC_3[[#This Row],[AUXILIAR]])))","v":519535},519535,{"$f":"VLOOKUP(PUC_3[[#This Row],[AUXILIAR]],PUC[[AUXILIAR]:[CUENTA]],2,0)","v":"COMBUSTIBLES Y LUBRICANTES "},{"$f":"SUMIF(Diario[BAL_PRUEBA_DEB],PUC_3[[#This Row],[CUENTA]],Diario[VALOR])","v":0},{"$f":"SUMIF(Diario[BAL_PRUEBA_CRE],PUC_3[[#This Row],[CUENTA]],Diario[VALOR])","v":0}]
[{"$f":"IF(LEN(PUC_3[[#This Row],[AUXILIAR]])=1,PUC_3[[#This Row],[AUXILIAR]]*100000,IF(LEN(PUC_3[[#This Row],[AUXILIAR]])=2,PUC_3[[#This Row],[AUXILIAR]]*10000,IF(LEN(PUC_3[[#This Row],[AUXILIAR]])=4,PUC_3[[#This Row],[AUXILIAR]]*100,PUC_3[[#This Row],[AUXILIAR]])))","v":523595},523595,{"$f":"VLOOKUP(PUC_3[[#This Row],[AUXILIAR]],PUC[[AUXILIAR]:[CUENTA]],2,0)","v":"SERVICIOS DE COMERCIALIZACION"},{"$f":"SUMIF(Diario[BAL_PRUEBA_DEB],PUC_3[[#This Row],[CUENTA]],Diario[VALOR])","v":0},{"$f":"SUMIF(Diario[BAL_PRUEBA_CRE],PUC_3[[#This Row],[CUENTA]],Diario[VALOR])","v":0}]
[{"$f":"IF(LEN(PUC_3[[#This Row],[AUXILIAR]])=1,PUC_3[[#This Row],[AUXILIAR]]*100000,IF(LEN(PUC_3[[#This Row],[AUXILIAR]])=2,PUC_3[[#This Row],[AUXILIAR]]*10000,IF(LEN(PUC_3[[#This Row],[AUXILIAR]])=4,PUC_3[[#This Row],[AUXILIAR]]*100,PUC_3[[#This Row],[AUXILIAR]])))","v":610570},610570,{"$f":"VLOOKUP(PUC_3[[#This Row],[AUXILIAR]],PUC[[AUXILIAR]:[CUENTA]],2,0)","v":"SERVICIOS AGRICOLAS Y GANADEROS "},{"$f":"SUMIF(Diario[BAL_PRUEBA_DEB],PUC_3[[#This Row],[CUENTA]],Diario[VALOR])","v":0},{"$f":"SUMIF(Diario[BAL_PRUEBA_CRE],PUC_3[[#This Row],[CUENTA]],Diario[VALOR])","v":0}]
[null,null,null,{"$f":"SUBTOTAL(109,PUC_3[DEB])","v":0},{"$f":"SUBTOTAL(109,PUC_3[CRE])","v":0}]
[null,null,null,null,{"$f":"+PUC_3[[#Totals],[DEB]]-PUC_3[[#Totals],[CRE]]","v":0}]

{"sheet":"BALANCE DE PRUEBA CONSOLIDADO","index":8,"n_rows":28,"n_cols":63,"rows_kept":28,"cut":false,"hidden":false,"merged":[[0,54,0,56],[0,60,0,62],[0,57,0,59],[0,36,0,38],[0,39,0,41],[0,42,0,44],[0,45,0,47],[0,48,0,50],[0,51,0,53],[0,33,0,35],[0,3,0,5],[0,6,0,8],[0,9,0,11],[0,12,0,14],[0,15,0,17],[0,18,0,20],[0,21,0,23],[0,24,0,26],[0,27,0,29],[0,30,0,32]]}
[null,null,null,{"$f":"+D2","v":"Asesores de campo"},null,null,{"$f":"+G2","v":"Caucheros Frutos del Perdón"},null,null,{"$f":"+J2","v":"Equipo Auxiliares de Mantenimiento"},null,null,{"$f":"+M2","v":"Equipo BAAF Proyectos Productivos"},null,null,{"$f":"+P2","v":"Equipo Catastal y Cartográfico Btá"},null,null,{"$f":"+S2","v":"Equipo de Administración de Inmuebles"},null,null,{"$f":"+V2","v":"Equipo de BAAF"},null,null,{"$f":"+Y2","v":"Equipo Financiero Bogotá"},null,null,{"$f":"+AB2","v":"Equipo Gestión de la Información"},null,null,{"$f":"+AE2","v":"Equipo Indeminizaciones Judiciales"},null,null,{"$f":"+AH2","v":"Equipo Juridico Bogotá"},null,null,{"$f":"+AK2","v":"Equipo Nuevas Fuentes"},null,null,{"$f":"+AN2","v":"FRV"},null,null,{"$f":"+AQ2","v":"Maderero Sembremos Pais"},null,null,{"$f":"+AT2","v":"Palmar Cosechando Paz"},null,null,{"$f":"+AW2","v":"Palmar Renacer de Esperanza"},null,null,{"$f":"+AZ2","v":"Palmar Semillas de Reconciliación"},null,null,{"$f":"+BC2","v":"Rancho Santa Teresa"},null,null,{"$f":"+BF2","v":"Equipo de Admón Muebles y Vocación Social Reparadora"},null,null,{"$f":"+BI2","v":"CONSOLIDADO"}]
[null,null,null,"Asesores de campo","Asesores de campo","Asesores de campo","Caucheros Frutos del Perdón","Caucheros Frutos del Perdón","Caucheros Frutos del Perdón","Equipo Auxiliares de Mantenimiento","Equipo Auxiliares de Mantenimiento","Equipo Auxiliares de Mantenimiento","Equipo BAAF Proyectos Productivos","Equipo BAAF Proyectos Productivos","Equipo BAAF Proyectos Productivos","Equipo Catastal y Cartográfico Btá","Equipo Catastal y Cartográfico Btá","Equipo Catastal y Cartográfico Btá","Equipo de Administración de Inmuebles","Equipo de Administración de Inmuebles","Equipo de Administración de Inmuebles","Equipo de BAAF","Equipo de BAAF","Equipo de BAAF","Equipo Financiero Bogotá","Equipo Financiero Bogotá","Equipo Financiero Bogotá","Equipo Gestión de la Información","Equipo Gestión de la Información","Equipo Gestión de la Información","Equipo Indeminizaciones Judiciales","Equipo Indeminizaciones Judiciales","Equipo Indeminizaciones Judiciales","Equipo Juridico Bogotá","Equipo Juridico Bogotá","Equipo Juridico Bogotá","Equipo Nuevas Fuentes","Equipo Nuevas Fuentes","Equipo Nuevas Fuentes","FRV","FRV","FRV","Maderero Sembremos Pais","Maderero Sembremos Pais","Maderero Sembremos Pais","Palmar Cosechando Paz","Palmar Cosechando Paz","Palmar Cosechando Paz","Palmar Renacer de Esperanza","Palmar Renacer de Esperanza","Palmar Renacer de Esperanza","Palmar Semillas de Reconciliación","Palmar Semillas de Reconciliación","Palmar Semillas de Reconciliación","Rancho Santa Teresa","Rancho Santa Teresa","Rancho Santa Teresa","Equipo de Admón Muebles y Vocación Social Reparadora","Equipo de Admón Muebles y Vocación Social Reparadora","Equipo de Admón Muebles y Vocación Social Reparadora","CONSOLIDADO","CONSOLIDADO","CONSOLIDADO"]
[null,"CUENTA CONTABLE","DESCRIPCIÓN","DEBITO","CREDITO","TOTAL","DEBITO","CREDITO","TOTAL","DEBITO","CREDITO","TOTAL","DEBITO","CREDITO","TOTAL","DEBITO","CREDITO","TOTAL","DEBITO","CREDITO","TOTAL","DEBITO","CREDITO","TOTAL","DEBITO","CREDITO","TOTAL","DEBITO","CREDITO","TOTAL","DEBITO","CREDITO","TOTAL","DEBITO","CREDITO","TOTAL","DEBITO","CREDITO","TOTAL","DEBITO","CREDITO","TOTAL","DEBITO","CREDITO","TOTAL","DEBITO","CREDITO","TOTAL","DEBITO","CREDITO","TOTAL","DEBITO","CREDITO","TOTAL","DEBITO","CREDITO","TOTAL","DEBITO","CREDITO","TOTAL","DEBITO","CREDITO","TOTAL"]
["CUENTA","AUXILIAR","DESCRIPCION","DEB","CRE","TOTAL","DEB2","CRE2","TOTAL2","DEB3","CRE4","CRE5","CRE52","CRE53","CRE54","CRE55","CRE56","CRE57","CRE7","CRE8","CRE9","CRE10","CRE11","CRE12","CRE13","CRE14","CRE15","CRE16","CRE17","CRE18","CRE19","CRE20","CRE21","CRE22","CRE23","CRE24","CRE25","CRE26","CRE27","CRE28","CRE29","CRE30","CRE31","CRE32","CRE33","CRE34","CRE35","CRE36","CRE37","CRE38","CRE39","CRE40","CRE41","CRE42","CRE43","CRE44","CRE45","CRE452","CRE453","CRE454","CRE46","CRE47","CRE48"]
[{"$f":"+'BALANCE DE PRUEBA UNITARIO'!A4","v":130505},{"$f":"+'BALANCE DE PRUEBA UNITARIO'!B4","v":130505},{"$f":"+'BALANCE DE PRUEBA UNITARIO'!C4","v":"NACIONALES "},{"$f":"SUMIFS(Diario[VALOR],Diario[CENTRO DE COSTOS],D$2,Diario[DEBITO],PUC_310[[#This Row],[CUENTA]])","v":0},{"$f":"SUMIFS(Diario[VALOR],Diario[CENTRO DE COSTOS],E$2,Diario[CREDITO],PUC_310[[#This Row],[CUENTA]])","v":0},{"$f":"+PUC_310[[#This Row],[DEB]]-PUC_310[[#This Row],[CRE]]","v":0},{"$f":"SUMIFS(Diario[VALOR],Diario[CENTRO DE COSTOS],G$2,Diario[DEBITO],PUC_310[[#This Row],[CUENTA]])","v":0},{"$f":"SUMIFS(Diario[VALOR],Diario[CENTRO DE COSTOS],H$2,Diario[CREDITO],PUC_310[[#This Row],[CUENTA]])","v":0},{"$f":"+PUC_310[[#This Row],[DEB2]]-PUC_310[[#This Row],[CRE2]]","v":0},{"$f":"SUMIFS(Diario[VALOR],Diario[CENTRO DE COSTOS],J$2,Diario[DEBITO],PUC_310[[#This Row],[CUENTA]])","v":0},{"$f":"SUMIFS(Diario[VALOR],Diario[CENTRO DE COSTOS],K$2,Diario[CREDITO],PUC_310[[#This Row],[CUENTA]])","v":0},{"$f":"+PUC_310[[#This Row],[DEB3]]-PUC_310[[#This Row],[CRE4]]","v":0},{"$f":"SUMIFS(Diario[VALOR],Diario[CENTRO DE COSTOS],M$2,Diario[DEBITO],PUC_310[[#This Row],[CUENTA]])","v":0},{"$f":"SUMIFS(Diario[VALOR],Diario[CENTRO DE COSTOS],N$2,Diario[CREDITO],PUC_310[[#This Row],[CUENTA]])","v":0},{"$f":"+PUC_310[[#This Row],[CRE52]]-PUC_310[[#This Row],[CRE53]]","v":0},{"$f":"SUMIFS(Diario[VALOR],Diario[CENTRO DE COSTOS],P$2,Diario[DEBITO],PUC_310[[#This Row],[CUENTA]])","v":0},{"$f":"SUMIFS(Diario[VALOR],Diario[CENTRO DE COSTOS],Q$2,Diario[CREDITO],PUC_310[[#This Row],[CUENTA]])","v":0},{"$f":"+PUC_310[[#This Row],[CRE55]]-PUC_310[[#This Row],[CRE56]]","v":0},{"$f":"SUMIFS(Diario[VALOR],Diario[CENTRO DE COSTOS],S$2,Diario[DEBITO],PUC_310[[#This Row],[CUENTA]])","v":0},{"$f":"SUMIFS(Diario[VALOR],Diario[CENTRO DE COSTOS],T$2,Diario[CREDITO],PUC_310[[#This Row],[CUENTA]])","v":0},{"$f":"+PUC_310[[#This Row],[CRE7]]-PUC_310[[#This Row],[CRE8]]","v":0},{"$f":"SUMIFS(Diario[VALOR],Diario[CENTRO DE COSTOS],V$2,Diario[DEBITO],PUC_310[[#This Row],[CUENTA]])","v":0},{"$f":"SUMIFS(Diario[VALOR],Diario[CENTRO DE COSTOS],W$2,Diario[CREDITO],PUC_310[[#This Row],[CUENTA]])","v":0},{"$f":"+PUC_310[[#This Row],[CRE10]]-PUC_310[[#This Row],[CRE11]]","v":0},{"$f":"SUMIFS(Diario[VALOR],Diario[CENTRO DE COSTOS],Y$2,Diario[DEBITO],PUC_310[[#This Row],[CUENTA]])","v":0},{"$f":"SUMIFS(Diario[VALOR],Diario[CENTRO DE COSTOS],Z$2,Diario[CREDITO],PUC_310[[#This Row],[CUENTA]])","v":0},{"$f":"+PUC_310[[#This Row],[CRE13]]-PUC_310[[#This Row],[CRE14]]","v":0},{"$f":"SUMIFS(Diario[VALOR],Diario[CENTRO DE COSTOS],AB$2,Diario[DEBITO],PUC_310[[#This Row],[CUENTA]])","v":0},{"$f":"SUMIFS(Diario[VALOR],Diario[CENTRO DE COSTOS],AC$2,Diario[CREDITO],PUC_310[[#This Row],[CUENTA]])","v":0},{"$f":"+PUC_310[[#This Row],[CRE16]]-PUC_310[[#This Row],[CRE17]]","v":0},{"$f":"SUMIFS(Diario[VALOR],Diario[CENTRO DE COSTOS],AE$2,Diario[DEBITO],PUC_310[[#This Row],[CUENTA]])","v":0},{"$f":"SUMIFS(Diario[VALOR],Diario[CENTRO DE COSTOS],AF$2,Diario[CREDITO],PUC_310[[#This Row],[CUENTA]])","v":0},{"$f":"+PUC_310[[#This Row],[CRE19]]-PUC_310[[#This Row],[CRE20]]","v":0},{"$f":"SUMIFS(Diario[VALOR],Diario[CENTRO DE COSTOS],AH$2,Diario[DEBITO],PUC_310[[#This Row],[CUENTA]])","v":0},{"$f":"SUMIFS(Diario[VALOR],Diario[CENTRO DE COSTOS],AI$2,Diario[CREDITO],PUC_310[[#This Row],[CUENTA]])","v":0},{"$f":"+PUC_310[[#This Row],[CRE22]]-PUC_310[[#This Row],[CRE23]]","v":0},{"$f":"SUMIFS(Diario[VALOR],Diario[CENTRO DE COSTOS],AK$2,Diario[DEBITO],PUC_310[[#This Row],[CUENTA]])","v":0},{"$f":"SUMIFS(Diario[VALOR],Diario[CENTRO DE COSTOS],AL$2,Diario[CREDITO],PUC_310[[#This Row],[CUENTA]])","v":0},{"$f":"+PUC_310[[#This Row],[CRE25]]-PUC_310[[#This Row],[CRE26]]","v":0},{"$f":"SUMIFS(Diario[VALOR],Diario[CENTRO DE COSTOS],AN$2,Diario[DEBITO],PUC_310[[#This Row],[CUENTA]])","v":0},{"$f":"SUMIFS(Diario[VALOR],Diario[CENTRO DE COSTOS],AO$2,Diario[CREDITO],PUC_310[[#This Row],[CUENTA]])","v":0},{"$f":"+PUC_310[[#This Row],[CRE28]]-PUC_310[[#This Row],[CRE29]]","v":0},{"$f":"SUMIFS(Diario[VALOR],Diario[CENTRO DE COSTOS],AQ$2,Diario[DEBITO],PUC_310[[#This Row],[CUENTA]])","v":0},{"$f":"SUMIFS(Diario[VALOR],Diario[CENTRO DE COSTOS],AR$2,Diario[CREDITO],PUC_310[[#This Row],[CUENTA]])","v":0},{"$f":"+PUC_310[[#This Row],[CRE31]]-PUC_310[[#This Row],[CRE32]]","v":0},{"$f":"SUMIFS(Diario[VALOR],Diario[CENTRO DE COSTOS],AT$2,Diario[DEBITO],PUC_310[[#This Row],[CUENTA]])","v":0},{"$f":"SUMIFS(Diario[VALOR],Diario[CENTRO DE COSTOS],AU$2,Diario[CREDITO],PUC_310[[#This Row],[CUENTA]])","v":0},{"$f":"+PUC_310[[#This Row],[CRE34]]-PUC_310[[#This Row],[CRE35]]","v":0},{"$f":"SUMIFS(Diario[VALOR],Diario[CENTRO DE COSTOS],AW$2,Diario[DEBITO],PUC_310[[#This Row],[CUENTA]])","v":0},{"$f":"SUMIFS(Diario[VALOR],Diario[CENTRO DE COSTOS],AX$2,Diario[CREDITO],PUC_310[[#This Row],[CUENTA]])","v":0},{"$f":"+PUC_310[[#This Row],[CRE37]]-PUC_310[[#This Row],[CRE38]]","v":0},{"$f":"SUMIFS(Diario[VALOR],Diario[CENTRO DE COSTOS],AZ$2,Diario[DEBITO],PUC_310[[#This Row],[CUENTA]])","v":0},{"$f":"SUMIFS(Diario[VALOR],Diario[CENTRO DE COSTOS],BA$2,Diario[CREDITO],PUC_310[[#This Row],[CUENTA]])","v":0},{"$f":"+PUC_310[[#This Row],[CRE40]]-PUC_310[[#This Row],[CRE41]]","v":0},{"$f":"SUMIFS(Diario[VALOR],Diario[CENTRO DE COSTOS],BC$2,Diario[DEBITO],PUC_310[[#This Row],[CUENTA]])","v":0},{"$f":"SUMIFS(Diario[VALOR],Diario[CENTRO DE COSTOS],BD$2,Diario[CREDITO],PUC_310[[#This Row],[CUENTA]])","v":0},{"$f":"+PUC_310[[#This Row],[CRE43]]-PUC_310[[#This Row],[CRE44]]","v":0},{"$f":"SUMIFS(Diario[VALOR],Diario[CENTRO DE COSTOS],BF$2,Diario[DEBITO],PUC_310[[#This Row],[CUENTA]])","v":0},{"$f":"SUMIFS(Diario[VALOR],Diario[CENTRO DE COSTOS],BG$2,Diario[CREDITO],PUC_310[[#This Row],[CUENTA]])","v":0},{"$f":"+PUC_310[[#This Row],[CRE452]]-PUC_310[[#This Row],[CRE453]]","v":0},{"$f":"SUMIF($B$3:$BH$3,$BI$3,PUC_310[[#This Row],[AUXILIAR]:[CRE4]])","v":0},{"$f":"SUMIF($B$3:$BH$3,$BJ$3,PUC_310[[#This Row],[AUXILIAR]:[CRE4]])","v":0},{"$f":"+PUC_310[[#This Row],[CRE46]]-PUC_310[[#This Row],[CRE47]]","v":0}]
[{"$f":"+'BALANCE DE PRUEBA UNITARIO'!A5","v":143015},{"$f":"+'BALANCE DE PRUEBA UNITARIO'!B5","v":143015},{"$f":"+'BALANCE DE PRUEBA UNITARIO'!C5","v":"PRODUCTOS AGRICOLAS Y FORESTALES "},{"$f":"SUMIFS(Diario[VALOR],Diario[CENTRO DE COSTOS],D$2,Diario[DEBITO],PUC_310[[#This Row],[CUENTA]])","v":0},{"$f":"SUMIFS(Diario[VALOR],Diario[CENTRO DE COSTOS],E$2,Diario[CREDITO],PUC_310[[#This Row],[CUENTA]])","v":0},{"$f":"+PUC_310[[#This Row],[DEB]]-PUC_310[[#This Row],[CRE]]","v":0},{"$f":"SUMIFS(Diario[VALOR],Diario[CENTRO DE COSTOS],G$2,Diario[DEBITO],PUC_310[[#This Row],[CUENTA]])","v":0},{"$f":"SUMIFS(Diario[VALOR],Diario[CENTRO DE COSTOS],H$2,Diario[CREDITO],PUC_310[[#This Row],[CUENTA]])","v":0},{"$f":"+PUC_310[[#This Row],[DEB2]]-PUC_310[[#This Row],[CRE2]]","v":0},{"$f":"SUMIFS(Diario[VALOR],Diario[CENTRO DE COSTOS],J$2,Diario[DEBITO],PUC_310[[#This Row],[CUENTA]])","v":0},{"$f":"SUMIFS(Diario[VALOR],Diario[CENTRO DE COSTOS],K$2,Diario[CREDITO],PUC_310[[#This Row],[CUENTA]])","v":0},{"$f":"+PUC_310[[#This Row],[DEB3]]-PUC_310[[#This Row],[CRE4]]","v":0},{"$f":"SUMIFS(Diario[VALOR],Diario[CENTRO DE COSTOS],M$2,Diario[DEBITO],PUC_310[[#This Row],[CUENTA]])","v":0},{"$f":"SUMIFS(Diario[VALOR],Diario[CENTRO DE COSTOS],N$2,Diario[CREDITO],PUC_310[[#This Row],[CUENTA]])","v":0},{"$f":"+PUC_310[[#This Row],[CRE52]]-PUC_310[[#This Row],[CRE53]]","v":0},{"$f":"SUMIFS(Diario[VALOR],Diario[CENTRO DE COSTOS],P$2,Diario[DEBITO],PUC_310[[#This Row],[CUENTA]])","v":0},{"$f":"SUMIFS(Diario[VALOR],Diario[CENTRO DE COSTOS],Q$2,Diario[CREDITO],PUC_310[[#This Row],[CUENTA]])","v":0},{"$f":"+PUC_310[[#This Row],[CRE55]]-PUC_310[[#This Row],[CRE56]]","v":0},{"$f":"SUMIFS(Diario[VALOR],Diario[CENTRO DE COSTOS],S$2,Diario[DEBITO],PUC_310[[#This Row],[CUENTA]])","v":0},{"$f":"SUMIFS(Diario[VALOR],Diario[CENTRO DE COSTOS],T$2,Diario[CREDITO],PUC_310[[#This Row],[CUENTA]])","v":0},{"$f":"+PUC_310[[#This Row],[CRE7]]-PUC_310[[#This Row],[CRE8]]","v":0},{"$f":"SUMIFS(Diario[VALOR],Diario[CENTRO DE COSTOS],V$2,Diario[DEBITO],PUC_310[[#This Row],[CUENTA]])","v":0},{"$f":"SUMIFS(Diario[VALOR],Diario[CENTRO DE COSTOS],W$2,Diario[CREDITO],PUC_310[[#This Row],[CUENTA]])","v":0},{"$f":"+PUC_310[[#This Row],[CRE10]]-PUC_310[[#This Row],[CRE11]]","v":0},{"$f":"SUMIFS(Diario[VALOR],Diario[CENTRO DE COSTOS],Y$2,Diario[DEBITO],PUC_310[[#This Row],[CUENTA]])","v":0},{"$f":"SUMIFS(Diario[VALOR],Diario[CENTRO DE COSTOS],Z$2,Diario[CREDITO],PUC_310[[#This Row],[CUENTA]])","v":0},{"$f":"+PUC_310[[#This Row],[CRE13]]-PUC_310[[#This Row],[CRE14]]","v":0},{"$f":"SUMIFS(Diario[VALOR],Diario[CENTRO DE COSTOS],AB$2,Diario[DEBITO],PUC_310[[#This Row],[CUENTA]])","v":0},{"$f":"SUMIFS(Diario[VALOR],Diario[CENTRO DE COSTOS],AC$2,Diario[CREDITO],PUC_310[[#This Row],[CUENTA]])","v":0},{"$f":"+PUC_310[[#This Row],[CRE16]]-PUC_310[[#This Row],[CRE17]]","v":0},{"$f":"SUMIFS(Diario[VALOR],Diario[CENTRO DE COSTOS],AE$2,Diario[DEBITO],PUC_310[[#This Row],[CUENTA]])","v":0},{"$f":"SUMIFS(Diario[VALOR],Diario[CENTRO DE COSTOS],AF$2,Diario[CREDITO],PUC_310[[#This Row],[CUENTA]])","v":0},{"$f":"+PUC_310[[#This Row],[CRE19]]-PUC_310[[#This Row],[CRE20]]","v":0},{"$f":"SUMIFS(Diario[VALOR],Diario[CENTRO DE COSTOS],AH$2,Diario[DEBITO],PUC_310[[#This Row],[CUENTA]])","v":0},{"$f":"SUMIFS(Diario[VALOR],Diario[CENTRO DE COSTOS],AI$2,Diario[CREDITO],PUC_310[[#This Row],[CUENTA]])","v":0},{"$f":"+PUC_310[[#This Row],[CRE22]]-PUC_310[[#This Row],[CRE23]]","v":0},{"$f":"SUMIFS(Diario[VALOR],Diario[CENTRO DE COSTOS],AK$2,Diario[DEBITO],PUC_310[[#This Row],[CUENTA]])","v":0},{"$f":"SUMIFS(Diario[VALOR],Diario[CENTRO DE COSTOS],AL$2,Diario[CREDITO],PUC_310[[#This Row],[CUENTA]])","v":0},{"$f":"+PUC_310[[#This Row],[CRE25]]-PUC_310[[#This Row],[CRE26]]","v":0},{"$f":"SUMIFS(Diario[VALOR],Diario[CENTRO DE COSTOS],AN$2,Diario[DEBITO],PUC_310[[#This Row],[CUENTA]])","v":0},{"$f":"SUMIFS(Diario[VALOR],Diario[CENTRO DE COSTOS],AO$2,Diario[CREDITO],PUC_310[[#This Row],[CUENTA]])","v":0},{"$f":"+PUC_310[[#This Row],[CRE28]]-PUC_310[[#This Row],[CRE29]]","v":0},{"$f":"SUMIFS(Diario[VALOR],Diario[CENTRO DE COSTOS],AQ$2,Diario[DEBITO],PUC_310[[#This Row],[CUENTA]])","v":0},{"$f":"SUMIFS(Diario[VALOR],Diario[CENTRO DE COSTOS],AR$2,Diario[CREDITO],PUC_310[[#This Row],[CUENTA]])","v":0},{"$f":"+PUC_310[[#This Row],[CRE31]]-PUC_310[[#This Row],[CRE32]]","v":0},{"$f":"SUMIFS(Diario[VALOR],Diario[CENTRO DE COSTOS],AT$2,Diario[DEBITO],PUC_310[[#This Row],[CUENTA]])","v":0},{"$f":"SUMIFS(Diario[VALOR],Diario[CENTRO DE COSTOS],AU$2,Diario[CREDITO],PUC_310[[#This Row],[CUENTA]])","v":0},{"$f":"+PUC_310[[#This Row],[CRE34]]-PUC_310[[#This Row],[CRE35]]","v":0},{"$f":"SUMIFS(Diario[VALOR],Diario[CENTRO DE COSTOS],AW$2,Diario[DEBITO],PUC_310[[#This Row],[CUENTA]])","v":0},{"$f":"SUMIFS(Diario[VALOR],Diario[CENTRO DE COSTOS],AX$2,Diario[CREDITO],PUC_310[[#This Row],[CUENTA]])","v":0},{"$f":"+PUC_310[[#This Row],[CRE37]]-PUC_310[[#This Row],[CRE38]]","v":0},{"$f":"SUMIFS(Diario[VALOR],Diario[CENTRO DE COSTOS],AZ$2,Diario[DEBITO],PUC_310[[#This Row],[CUENTA]])","v":0},{"$f":"SUMIFS(Diario[VALOR],Diario[CENTRO DE COSTOS],BA$2,Diario[CREDITO],PUC_310[[#This Row],[CUENTA]])","v":0},{"$f":"+PUC_310[[#This Row],[CRE40]]-PUC_310[[#This Row],[CRE41]]","v":0},{"$f":"SUMIFS(Diario[VALOR],Diario[CENTRO DE COSTOS],BC$2,Diario[DEBITO],PUC_310[[#This Row],[CUENTA]])","v":0},{"$f":"SUMIFS(Diario[VALOR],Diario[CENTRO DE COSTOS],BD$2,Diario[CREDITO],PUC_310[[#This Row],[CUENTA]])","v":0},{"$f":"+PUC_310[[#This Row],[CRE43]]-PUC_310[[#This Row],[CRE44]]","v":0},{"$f":"SUMIFS(Diario[VALOR],Diario[CENTRO DE COSTOS],BF$2,Diario[DEBITO],PUC_310[[#This Row],[CUENTA]])","v":0},{"$f":"SUMIFS(Diario[VALOR],Diario[CENTRO DE COSTOS],BG$2,Diario[CREDITO],PUC_310[[#This Row],[CUENTA]])","v":0},{"$f":"+PUC_310[[#This Row],[CRE452]]-PUC_310[[#This Row],[CRE453]]","v":0},{"$f":"SUMIF($B$3:$BH$3,$BI$3,PUC_310[[#This Row],[AUXILIAR]:[CRE4]])","v":0},{"$f":"SUMIF($B$3:$BH$3,$BJ$3,PUC_310[[#This Row],[AUXILIAR]:[CRE4]])","v":0},{"$f":"+PUC_310[[#This Row],[CRE46]]-PUC_310[[#This Row],[CRE47]]","v":0}]
[{"$f":"+'BALANCE DE PRUEBA UNITARIO'!A6","v":151680},{"$f":"+'BALANCE DE PRUEBA UNITARIO'!B6","v":151680},{"$f":"+'BALANCE DE PRUEBA UNITARIO'!C6","v":"BODEGAS "},{"$f":"SUMIFS(Diario[VALOR],Diario[CENTRO DE COSTOS],D$2,Diario[DEBITO],PUC_310[[#This Row],[CUENTA]])","v":0},{"$f":"SUMIFS(Diario[VALOR],Diario[CENTRO DE COSTOS],E$2,Diario[CREDITO],PUC_310[[#This Row],[CUENTA]])","v":0},{"$f":"+PUC_310[[#This Row],[DEB]]-PUC_310[[#This Row],[CRE]]","v":0},{"$f":"SUMIFS(Diario[VALOR],Diario[CENTRO DE COSTOS],G$2,Diario[DEBITO],PUC_310[[#This Row],[CUENTA]])","v":0},{"$f":"SUMIFS(Diario[VALOR],Diario[CENTRO DE COSTOS],H$2,Diario[CREDITO],PUC_310[[#This Row],[CUENTA]])","v":0},{"$f":"+PUC_310[[#This Row],[DEB2]]-PUC_310[[#This Row],[CRE2]]","v":0},{"$f":"SUMIFS(Diario[VALOR],Diario[CENTRO DE COSTOS],J$2,Diario[DEBITO],PUC_310[[#This Row],[CUENTA]])","v":0},{"$f":"SUMIFS(Diario[VALOR],Diario[CENTRO DE COSTOS],K$2,Diario[CREDITO],PUC_310[[#This Row],[CUENTA]])","v":0},{"$f":"+PUC_310[[#This Row],[DEB3]]-PUC_310[[#This Row],[CRE4]]","v":0},{"$f":"SUMIFS(Diario[VALOR],Diario[CENTRO DE COSTOS],M$2,Diario[DEBITO],PUC_310[[#This Row],[CUENTA]])","v":0},{"$f":"SUMIFS(Diario[VALOR],Diario[CENTRO DE COSTOS],N$2,Diario[CREDITO],PUC_310[[#This Row],[CUENTA]])","v":0},{"$f":"+PUC_310[[#This Row],[CRE52]]-PUC_310[[#This Row],[CRE53]]","v":0},{"$f":"SUMIFS(Diario[VALOR],Diario[CENTRO DE COSTOS],P$2,Diario[DEBITO],PUC_310[[#This Row],[CUENTA]])","v":0},{"$f":"SUMIFS(Diario[VALOR],Diario[CENTRO DE COSTOS],Q$2,Diario[CREDITO],PUC_310[[#This Row],[CUENTA]])","v":0},{"$f":"+PUC_310[[#This Row],[CRE55]]-PUC_310[[#This Row],[CRE56]]","v":0},{"$f":"SUMIFS(Diario[VALOR],Diario[CENTRO DE COSTOS],S$2,Diario[DEBITO],PUC_310[[#This Row],[CUENTA]])","v":0},{"$f":"SUMIFS(Diario[VALOR],Diario[CENTRO DE COSTOS],T$2,Diario[CREDITO],PUC_310[[#This Row],[CUENTA]])","v":0},{"$f":"+PUC_310[[#This Row],[CRE7]]-PUC_310[[#This Row],[CRE8]]","v":0},{"$f":"SUMIFS(Diario[VALOR],Diario[CENTRO DE COSTOS],V$2,Diario[DEBITO],PUC_310[[#This Row],[CUENTA]])","v":0},{"$f":"SUMIFS(Diario[VALOR],Diario[CENTRO DE COSTOS],W$2,Diario[CREDITO],PUC_310[[#This Row],[CUENTA]])","v":0},{"$f":"+PUC_310[[#This Row],[CRE10]]-PUC_310[[#This Row],[CRE11]]","v":0},{"$f":"SUMIFS(Diario[VALOR],Diario[CENTRO DE COSTOS],Y$2,Diario[DEBITO],PUC_310[[#This Row],[CUENTA]])","v":0},{"$f":"SUMIFS(Diario[VALOR],Diario[CENTRO DE COSTOS],Z$2,Diario[CREDITO],PUC_310[[#This Row],[CUENTA]])","v":0},{"$f":"+PUC_310[[#This Row],[CRE13]]-PUC_310[[#This Row],[CRE14]]","v":0},{"$f":"SUMIFS(Diario[VALOR],Diario[CENTRO DE COSTOS],AB$2,Diario[DEBITO],PUC_310[[#This Row],[CUENTA]])","v":0},{"$f":"SUMIFS(Diario[VALOR],Diario[CENTRO DE COSTOS],AC$2,Diario[CREDITO],PUC_310[[#This Row],[CUENTA]])","v":0},{"$f":"+PUC_310[[#This Row],[CRE16]]-PUC_310[[#This Row],[CRE17]]","v":0},{"$f":"SUMIFS(Diario[VALOR],Diario[CENTRO DE COSTOS],AE$2,Diario[DEBITO],PUC_310[[#This Row],[CUENTA]])","v":0},{"$f":"SUMIFS(Diario[VALOR],Diario[CENTRO DE COSTOS],AF$2,Diario[CREDITO],PUC_310[[#This Row],[CUENTA]])","v":0},{"$f":"+PUC_310[[#This Row],[CRE19]]-PUC_310[[#This Row],[CRE20]]","v":0},{"$f":"SUMIFS(Diario[VALOR],Diario[CENTRO DE COSTOS],AH$2,Diario[DEBITO],PUC_310[[#This Row],[CUENTA]])","v":0},{"$f":"SUMIFS(Diario[VALOR],Diario[CENTRO DE COSTOS],AI$2,Diario[CREDITO],PUC_310[[#This Row],[CUENTA]])","v":0},{"$f":"+PUC_310[[#This Row],[CRE22]]-PUC_310[[#This Row],[CRE23]]","v":0},{"$f":"SUMIFS(Diario[VALOR],Diario[CENTRO DE COSTOS],AK$2,Diario[DEBITO],PUC_310[[#This Row],[CUENTA]])","v":0},{"$f":"SUMIFS(Diario[VALOR],Diario[CENTRO DE COSTOS],AL$2,Diario[CREDITO],PUC_310[[#This Row],[CUENTA]])","v":0},{"$f":"+PUC_310[[#This Row],[CRE25]]-PUC_310[[#This Row],[CRE26]]","v":0},{"$f":"SUMIFS(Diario[VALOR],Diario[CENTRO DE COSTOS],AN$2,Diario[DEBITO],PUC_310[[#This Row],[CUENTA]])","v":0},{"$f":"SUMIFS(Diario[VALOR],Diario[CENTRO DE COSTOS],AO$2,Diario[CREDITO],PUC_310[[#This Row],[CUENTA]])","v":0},{"$f":"+PUC_310[[#This Row],[CRE28]]-PUC_310[[#This Row],[CRE29]]","v":0},{"$f":"SUMIFS(Diario[VALOR],Diario[CENTRO DE COSTOS],AQ$2,Diario[DEBITO],PUC_310[[#This Row],[CUENTA]])","v":0},{"$f":"SUMIFS(Diario[VALOR],Diario[CENTRO DE COSTOS],AR$2,Diario[CREDITO],PUC_310[[#This Row],[CUENTA]])","v":0},{"$f":"+PUC_310[[#This Row],[CRE31]]-PUC_310[[#This Row],[CRE32]]","v":0},{"$f":"SUMIFS(Diario[VALOR],Diario[CENTRO DE COSTOS],AT$2,Diario[DEBITO],PUC_310[[#This Row],[CUENTA]])","v":0},{"$f":"SUMIFS(Diario[VALOR],Diario[CENTRO DE COSTOS],AU$2,Diario[CREDITO],PUC_310[[#This Row],[CUENTA]])","v":0},{"$f":"+PUC_310[[#This Row],[CRE34]]-PUC_310[[#This Row],[CRE35]]","v":0},{"$f":"SUMIFS(Diario[VALOR],Diario[CENTRO DE COSTOS],AW$2,Diario[DEBITO],PUC_310[[#This Row],[CUENTA]])","v":0},{"$f":"SUMIFS(Diario[VALOR],Diario[CENTRO DE COSTOS],AX$2,Diario[CREDITO],PUC_310[[#This Row],[CUENTA]])","v":0},{"$f":"+PUC_310[[#This Row],[CRE37]]-PUC_310[[#This Row],[CRE38]]","v":0},{"$f":"SUMIFS(Diario[VALOR],Diario[CENTRO DE COSTOS],AZ$2,Diario[DEBITO],PUC_310[[#This Row],[CUENTA]])","v":0},{"$f":"SUMIFS(Diario[VALOR],Diario[CENTRO DE COSTOS],BA$2,Diario[CREDITO],PUC_310[[#This Row],[CUENTA]])","v":0},{"$f":"+PUC_310[[#This Row],[CRE40]]-PUC_310[[#This Row],[CRE41]]","v":0},{"$f":"SUMIFS(Diario[VALOR],Diario[CENTRO DE COSTOS],BC$2,Diario[DEBITO],PUC_310[[#This Row],[CUENTA]])","v":0},{"$f":"SUMIFS(Diario[VALOR],Diario[CENTRO DE COSTOS],BD$2,Diario[CREDITO],PUC_310[[#This Row],[CUENTA]])","v":0},{"$f":"+PUC_310[[#This Row],[CRE43]]-PUC_310[[#This Row],[CRE44]]","v":0},{"$f":"SUMIFS(Diario[VALOR],Diario[CENTRO DE COSTOS],BF$2,Diario[DEBITO],PUC_310[[#This Row],[CUENTA]])","v":0},{"$f":"SUMIFS(Diario[VALOR],Diario[CENTRO DE COSTOS],BG$2,Diario[CREDITO],PUC_310[[#This Row],[CUENTA]])","v":0},{"$f":"+PUC_310[[#This Row],[CRE452]]-PUC_310[[#This Row],[CRE453]]","v":0},{"$f":"SUMIF($B$3:$BH$3,$BI$3,PUC_310[[#This Row],[AUXILIAR]:[CRE4]])","v":0},{"$f":"SUMIF($B$3:$BH$3,$BJ$3,PUC_310[[#This Row],[AUXILIAR]:[CRE4]])","v":0},{"$f":"+PUC_310[[#This Row],[CRE46]]-PUC_310[[#This Row],[CRE47]]","v":0}]
[{"$f":"+'BALANCE DE PRUEBA UNITARIO'!A7","v":152000},{"$f":"+'BALANCE DE PRUEBA UNITARIO'!B7","v":152000},{"$f":"+'BALANCE DE PRUEBA UNITARIO'!C7","v":"MAQUINARIA Y EQUIPO "},{"$f":"SUMIFS(Diario[VALOR],Diario[CENTRO DE COSTOS],D$2,Diario[DEBITO],PUC_310[[#This Row],[CUENTA]])","v":0},{"$f":"SUMIFS(Diario[VALOR],Diario[CENTRO DE COSTOS],E$2,Diario[CREDITO],PUC_310[[#This Row],[CUENTA]])","v":0},{"$f":"+PUC_310[[#This Row],[DEB]]-PUC_310[[#This Row],[CRE]]","v":0},{"$f":"SUMIFS(Diario[VALOR],Diario[CENTRO DE COSTOS],G$2,Diario[DEBITO],PUC_310[[#This Row],[CUENTA]])","v":0},{"$f":"SUMIFS(Diario[VALOR],Diario[CENTRO DE COSTOS],H$2,Diario[CREDITO],PUC_310[[#This Row],[CUENTA]])","v":0},{"$f":"+PUC_310[[#This Row],[DEB2]]-PUC_310[[#This Row],[CRE2]]","v":0},{"$f":"SUMIFS(Diario[VALOR],Diario[CENTRO DE COSTOS],J$2,Diario[DEBITO],PUC_310[[#This Row],[CUENTA]])","v":0},{"$f":"SUMIFS(Diario[VALOR],Diario[CENTRO DE COSTOS],K$2,Diario[CREDITO],PUC_310[[#This Row],[CUENTA]])","v":0},{"$f":"+PUC_310[[#This Row],[DEB3]]-PUC_310[[#This Row],[CRE4]]","v":0},{"$f":"SUMIFS(Diario[VALOR],Diario[CENTRO DE COSTOS],M$2,Diario[DEBITO],PUC_310[[#This Row],[CUENTA]])","v":0},{"$f":"SUMIFS(Diario[VALOR],Diario[CENTRO DE COSTOS],N$2,Diario[CREDITO],PUC_310[[#This Row],[CUENTA]])","v":0},{"$f":"+PUC_310[[#This Row],[CRE52]]-PUC_310[[#This Row],[CRE53]]","v":0},{"$f":"SUMIFS(Diario[VALOR],Diario[CENTRO DE COSTOS],P$2,Diario[DEBITO],PUC_310[[#This Row],[CUENTA]])","v":0},{"$f":"SUMIFS(Diario[VALOR],Diario[CENTRO DE COSTOS],Q$2,Diario[CREDITO],PUC_310[[#This Row],[CUENTA]])","v":0},{"$f":"+PUC_310[[#This Row],[CRE55]]-PUC_310[[#This Row],[CRE56]]","v":0},{"$f":"SUMIFS(Diario[VALOR],Diario[CENTRO DE COSTOS],S$2,Diario[DEBITO],PUC_310[[#This Row],[CUENTA]])","v":0},{"$f":"SUMIFS(Diario[VALOR],Diario[CENTRO DE COSTOS],T$2,Diario[CREDITO],PUC_310[[#This Row],[CUENTA]])","v":0},{"$f":"+PUC_310[[#This Row],[CRE7]]-PUC_310[[#This Row],[CRE8]]","v":0},{"$f":"SUMIFS(Diario[VALOR],Diario[CENTRO DE COSTOS],V$2,Diario[DEBITO],PUC_310[[#This Row],[CUENTA]])","v":0},{"$f":"SUMIFS(Diario[VALOR],Diario[CENTRO DE COSTOS],W$2,Diario[CREDITO],PUC_310[[#This Row],[CUENTA]])","v":0},{"$f":"+PUC_310[[#This Row],[CRE10]]-PUC_310[[#This Row],[CRE11]]","v":0},{"$f":"SUMIFS(Diario[VALOR],Diario[CENTRO DE COSTOS],Y$2,Diario[DEBITO],PUC_310[[#This Row],[CUENTA]])","v":0},{"$f":"SUMIFS(Diario[VALOR],Diario[CENTRO DE COSTOS],Z$2,Diario[CREDITO],PUC_310[[#This Row],[CUENTA]])","v":0},{"$f":"+PUC_310[[#This Row],[CRE13]]-PUC_310[[#This Row],[CRE14]]","v":0},{"$f":"SUMIFS(Diario[VALOR],Diario[CENTRO DE COSTOS],AB$2,Diario[DEBITO],PUC_310[[#This Row],[CUENTA]])","v":0},{"$f":"SUMIFS(Diario[VALOR],Diario[CENTRO DE COSTOS],AC$2,Diario[CREDITO],PUC_310[[#This Row],[CUENTA]])","v":0},{"$f":"+PUC_310[[#This Row],[CRE16]]-PUC_310[[#This Row],[CRE17]]","v":0},{"$f":"SUMIFS(Diario[VALOR],Diario[CENTRO DE COSTOS],AE$2,Diario[DEBITO],PUC_310[[#This Row],[CUENTA]])","v":0},{"$f":"SUMIFS(Diario[VALOR],Diario[CENTRO DE COSTOS],AF$2,Diario[CREDITO],PUC_310[[#This Row],[CUENTA]])","v":0},{"$f":"+PUC_310[[#This Row],[CRE19]]-PUC_310[[#This Row],[CRE20]]","v":0},{"$f":"SUMIFS(Diario[VALOR],Diario[CENTRO DE COSTOS],AH$2,Diario[DEBITO],PUC_310[[#This Row],[CUENTA]])","v":0},{"$f":"SUMIFS(Diario[VALOR],Diario[CENTRO DE COSTOS],AI$2,Diario[CREDITO],PUC_310[[#This Row],[CUENTA]])","v":0},{"$f":"+PUC_310[[#This Row],[CRE22]]-PUC_310[[#This Row],[CRE23]]","v":0},{"$f":"SUMIFS(Diario[VALOR],Diario[CENTRO DE COSTOS],AK$2,Diario[DEBITO],PUC_310[[#This Row],[CUENTA]])","v":0},{"$f":"SUMIFS(Diario[VALOR],Diario[CENTRO DE COSTOS],AL$2,Diario[CREDITO],PUC_310[[#This Row],[CUENTA]])","v":0},{"$f":"+PUC_310[[#This Row],[CRE25]]-PUC_310[[#This Row],[CRE26]]","v":0},{"$f":"SUMIFS(Diario[VALOR],Diario[CENTRO DE COSTOS],AN$2,Diario[DEBITO],PUC_310[[#This Row],[CUENTA]])","v":0},{"$f":"SUMIFS(Diario[VALOR],Diario[CENTRO DE COSTOS],AO$2,Diario[CREDITO],PUC_310[[#This Row],[CUENTA]])","v":0},{"$f":"+PUC_310[[#This Row],[CRE28]]-PUC_310[[#This Row],[CRE29]]","v":0},{"$f":"SUMIFS(Diario[VALOR],Diario[CENTRO DE COSTOS],AQ$2,Diario[DEBITO],PUC_310[[#This Row],[CUENTA]])","v":0},{"$f":"SUMIFS(Diario[VALOR],Diario[CENTRO DE COSTOS],AR$2,Diario[CREDITO],PUC_310[[#This Row],[CUENTA]])","v":0},{"$f":"+PUC_310[[#This Row],[CRE31]]-PUC_310[[#This Row],[CRE32]]","v":0},{"$f":"SUMIFS(Diario[VALOR],Diario[CENTRO DE COSTOS],AT$2,Diario[DEBITO],PUC_310[[#This Row],[CUENTA]])","v":0},{"$f":"SUMIFS(Diario[VALOR],Diario[CENTRO DE COSTOS],AU$2,Diario[CREDITO],PUC_310[[#This Row],[CUENTA]])","v":0},{"$f":"+PUC_310[[#This Row],[CRE34]]-PUC_310[[#This Row],[CRE35]]","v":0},{"$f":"SUMIFS(Diario[VALOR],Diario[CENTRO DE COSTOS],AW$2,Diario[DEBITO],PUC_310[[#This Row],[CUENTA]])","v":0},{"$f":"SUMIFS(Diario[VALOR],Diario[CENTRO DE COSTOS],AX$2,Diario[CREDITO],PUC_310[[#This Row],[CUENTA]])","v":0},{"$f":"+PUC_310[[#This Row],[CRE37]]-PUC_310[[#This Row],[CRE38]]","v":0},{"$f":"SUMIFS(Diario[VALOR],Diario[CENTRO DE COSTOS],AZ$2,Diario[DEBITO],PUC_310[[#This Row],[CUENTA]])","v":0},{"$f":"SUMIFS(Diario[VALOR],Diario[CENTRO DE COSTOS],BA$2,Diario[CREDITO],PUC_310[[#This Row],[CUENTA]])","v":0},{"$f":"+PUC_310[[#This Row],[CRE40]]-PUC_310[[#This Row],[CRE41]]","v":0},{"$f":"SUMIFS(Diario[VALOR],Diario[CENTRO DE COSTOS],BC$2,Diario[DEBITO],PUC_310[[#This Row],[CUENTA]])","v":0},{"$f":"SUMIFS(Diario[VALOR],Diario[CENTRO DE COSTOS],BD$2,Diario[CREDITO],PUC_310[[#This Row],[CUENTA]])","v":0},{"$f":"+PUC_310[[#This Row],[CRE43]]-PUC_310[[#This Row],[CRE44]]","v":0},{"$f":"SUMIFS(Diario[VALOR],Diario[CENTRO DE COSTOS],BF$2,Diario[DEBITO],PUC_310[[#This Row],[CUENTA]])","v":0},{"$f":"SUMIFS(Diario[VALOR],Diario[CENTRO DE COSTOS],BG$2,Diario[CREDITO],PUC_310[[#This Row],[CUENTA]])","v":0},{"$f":"+PUC_310[[#This Row],[CRE452]]-PUC_310[[#This Row],[CRE453]]","v":0},{"$f":"SUMIF($B$3:$BH$3,$BI$3,PUC_310[[#This Row],[AUXILIAR]:[CRE4]])","v":0},{"$f":"SUMIF($B$3:$BH$3,$BJ$3,PUC_310[[#This Row],[AUXILIAR]:[CRE4]])","v":0},{"$f":"+PUC_310[[#This Row],[CRE46]]-PUC_310[[#This Row],[CRE47]]","v":0}]
[{"$f":"+'BALANCE DE PRUEBA UNITARIO'!A8","v":158405},{"$f":"+'BALANCE DE PRUEBA UNITARIO'!B8","v":158405},{"$f":"+'BALANCE DE PRUEBA UNITARIO'!C8","v":"ESPECIES MENORES "},{"$f":"SUMIFS(Diario[VALOR],Diario[CENTRO DE COSTOS],D$2,Diario[DEBITO],PUC_310[[#This Row],[CUENTA]])","v":0},{"$f":"SUMIFS(Diario[VALOR],Diario[CENTRO DE COSTOS],E$2,Diario[CREDITO],PUC_310[[#This Row],[CUENTA]])","v":0},{"$f":"+PUC_310[[#This Row],[DEB]]-PUC_310[[#This Row],[CRE]]","v":0},{"$f":"SUMIFS(Diario[VALOR],Diario[CENTRO DE COSTOS],G$2,Diario[DEBITO],PUC_310[[#This Row],[CUENTA]])","v":0},{"$f":"SUMIFS(Diario[VALOR],Diario[CENTRO DE COSTOS],H$2,Diario[CREDITO],PUC_310[[#This Row],[CUENTA]])","v":0},{"$f":"+PUC_310[[#This Row],[DEB2]]-PUC_310[[#This Row],[CRE2]]","v":0},{"$f":"SUMIFS(Diario[VALOR],Diario[CENTRO DE COSTOS],J$2,Diario[DEBITO],PUC_310[[#This Row],[CUENTA]])","v":0},{"$f":"SUMIFS(Diario[VALOR],Diario[CENTRO DE COSTOS],K$2,Diario[CREDITO],PUC_310[[#This Row],[CUENTA]])","v":0},{"$f":"+PUC_310[[#This Row],[DEB3]]-PUC_310[[#This Row],[CRE4]]","v":0},{"$f":"SUMIFS(Diario[VALOR],Diario[CENTRO DE COSTOS],M$2,Diario[DEBITO],PUC_310[[#This Row],[CUENTA]])","v":0},{"$f":"SUMIFS(Diario[VALOR],Diario[CENTRO DE COSTOS],N$2,Diario[CREDITO],PUC_310[[#This Row],[CUENTA]])","v":0},{"$f":"+PUC_310[[#This Row],[CRE52]]-PUC_310[[#This Row],[CRE53]]","v":0},{"$f":"SUMIFS(Diario[VALOR],Diario[CENTRO DE COSTOS],P$2,Diario[DEBITO],PUC_310[[#This Row],[CUENTA]])","v":0},{"$f":"SUMIFS(Diario[VALOR],Diario[CENTRO DE COSTOS],Q$2,Diario[CREDITO],PUC_310[[#This Row],[CUENTA]])","v":0},{"$f":"+PUC_310[[#This Row],[CRE55]]-PUC_310[[#This Row],[CRE56]]","v":0},{"$f":"SUMIFS(Diario[VALOR],Diario[CENTRO DE COSTOS],S$2,Diario[DEBITO],PUC_310[[#This Row],[CUENTA]])","v":0},{"$f":"SUMIFS(Diario[VALOR],Diario[CENTRO DE COSTOS],T$2,Diario[CREDITO],PUC_310[[#This Row],[CUENTA]])","v":0},{"$f":"+PUC_310[[#This Row],[CRE7]]-PUC_310[[#This Row],[CRE8]]","v":0},{"$f":"SUMIFS(Diario[VALOR],Diario[CENTRO DE COSTOS],V$2,Diario[DEBITO],PUC_310[[#This Row],[CUENTA]])","v":0},{"$f":"SUMIFS(Diario[VALOR],Diario[CENTRO DE COSTOS],W$2,Diario[CREDITO],PUC_310[[#This Row],[CUENTA]])","v":0},{"$f":"+PUC_310[[#This Row],[CRE10]]-PUC_310[[#This Row],[CRE11]]","v":0},{"$f":"SUMIFS(Diario[VALOR],Diario[CENTRO DE COSTOS],Y$2,Diario[DEBITO],PUC_310[[#This Row],[CUENTA]])","v":0},{"$f":"SUMIFS(Diario[VALOR],Diario[CENTRO DE COSTOS],Z$2,Diario[CREDITO],PUC_310[[#This Row],[CUENTA]])","v":0},{"$f":"+PUC_310[[#This Row],[CRE13]]-PUC_310[[#This Row],[CRE14]]","v":0},{"$f":"SUMIFS(Diario[VALOR],Diario[CENTRO DE COSTOS],AB$2,Diario[DEBITO],PUC_310[[#This Row],[CUENTA]])","v":0},{"$f":"SUMIFS(Diario[VALOR],Diario[CENTRO DE COSTOS],AC$2,Diario[CREDITO],PUC_310[[#This Row],[CUENTA]])","v":0},{"$f":"+PUC_310[[#This Row],[CRE16]]-PUC_310[[#This Row],[CRE17]]","v":0},{"$f":"SUMIFS(Diario[VALOR],Diario[CENTRO DE COSTOS],AE$2,Diario[DEBITO],PUC_310[[#This Row],[CUENTA]])","v":0},{"$f":"SUMIFS(Diario[VALOR],Diario[CENTRO DE COSTOS],AF$2,Diario[CREDITO],PUC_310[[#This Row],[CUENTA]])","v":0},{"$f":"+PUC_310[[#This Row],[CRE19]]-PUC_310[[#This Row],[CRE20]]","v":0},{"$f":"SUMIFS(Diario[VALOR],Diario[CENTRO DE COSTOS],AH$2,Diario[DEBITO],PUC_310[[#This Row],[CUENTA]])","v":0},{"$f":"SUMIFS(Diario[VALOR],Diario[CENTRO DE COSTOS],AI$2,Diario[CREDITO],PUC_310[[#This Row],[CUENTA]])","v":0},{"$f":"+PUC_310[[#This Row],[CRE22]]-PUC_310[[#This Row],[CRE23]]","v":0},{"$f":"SUMIFS(Diario[VALOR],Diario[CENTRO DE COSTOS],AK$2,Diario[DEBITO],PUC_310[[#This Row],[CUENTA]])","v":0},{"$f":"SUMIFS(Diario[VALOR],Diario[CENTRO DE COSTOS],AL$2,Diario[CREDITO],PUC_310[[#This Row],[CUENTA]])","v":0},{"$f":"+PUC_310[[#This Row],[CRE25]]-PUC_310[[#This Row],[CRE26]]","v":0},{"$f":"SUMIFS(Diario[VALOR],Diario[CENTRO DE COSTOS],AN$2,Diario[DEBITO],PUC_310[[#This Row],[CUENTA]])","v":0},{"$f":"SUMIFS(Diario[VALOR],Diario[CENTRO DE COSTOS],AO$2,Diario[CREDITO],PUC_310[[#This Row],[CUENTA]])","v":0},{"$f":"+PUC_310[[#This Row],[CRE28]]-PUC_310[[#This Row],[CRE29]]","v":0},{"$f":"SUMIFS(Diario[VALOR],Diario[CENTRO DE COSTOS],AQ$2,Diario[DEBITO],PUC_310[[#This Row],[CUENTA]])","v":0},{"$f":"SUMIFS(Diario[VALOR],Diario[CENTRO DE COSTOS],AR$2,Diario[CREDITO],PUC_310[[#This Row],[CUENTA]])","v":0},{"$f":"+PUC_310[[#This Row],[CRE31]]-PUC_310[[#This Row],[CRE32]]","v":0},{"$f":"SUMIFS(Diario[VALOR],Diario[CENTRO DE COSTOS],AT$2,Diario[DEBITO],PUC_310[[#This Row],[CUENTA]])","v":0},{"$f":"SUMIFS(Diario[VALOR],Diario[CENTRO DE COSTOS],AU$2,Diario[CREDITO],PUC_310[[#This Row],[CUENTA]])","v":0},{"$f":"+PUC_310[[#This Row],[CRE34]]-PUC_310[[#This Row],[CRE35]]","v":0},{"$f":"SUMIFS(Diario[VALOR],Diario[CENTRO DE COSTOS],AW$2,Diario[DEBITO],PUC_310[[#This Row],[CUENTA]])","v":0},{"$f":"SUMIFS(Diario[VALOR],Diario[CENTRO DE COSTOS],AX$2,Diario[CREDITO],PUC_310[[#This Row],[CUENTA]])","v":0},{"$f":"+PUC_310[[#This Row],[CRE37]]-PUC_310[[#This Row],[CRE38]]","v":0},{"$f":"SUMIFS(Diario[VALOR],Diario[CENTRO DE COSTOS],AZ$2,Diario[DEBITO],PUC_310[[#This Row],[CUENTA]])","v":0},{"$f":"SUMIFS(Diario[VALOR],Diario[CENTRO DE COSTOS],BA$2,Diario[CREDITO],PUC_310[[#This Row],[CUENTA]])","v":0},{"$f":"+PUC_310[[#This Row],[CRE40]]-PUC_310[[#This Row],[CRE41]]","v":0},{"$f":"SUMIFS(Diario[VALOR],Diario[CENTRO DE COSTOS],BC$2,Diario[DEBITO],PUC_310[[#This Row],[CUENTA]])","v":0},{"$f":"SUMIFS(Diario[VALOR],Diario[CENTRO DE COSTOS],BD$2,Diario[CREDITO],PUC_310[[#This Row],[CUENTA]])","v":0},{"$f":"+PUC_310[[#This Row],[CRE43]]-PUC_310[[#This Row],[CRE44]]","v":0},{"$f":"SUMIFS(Diario[VALOR],Diario[CENTRO DE COSTOS],BF$2,Diario[DEBITO],PUC_310[[#This Row],[CUENTA]])","v":0},{"$f":"SUMIFS(Diario[VALOR],Diario[CENTRO DE COSTOS],BG$2,Diario[CREDITO],PUC_310[[#This Row],[CUENTA]])","v":0},{"$f":"+PUC_310[[#This Row],[CRE452]]-PUC_310[[#This Row],[CRE453]]","v":0},{"$f":"SUMIF($B$3:$BH$3,$BI$3,PUC_310[[#This Row],[AUXILIAR]:[CRE4]])","v":0},{"$f":"SUMIF($B$3:$BH$3,$BJ$3,PUC_310[[#This Row],[AUXILIAR]:[CRE4]])","v":0},{"$f":"+PUC_310[[#This Row],[CRE46]]-PUC_310[[#This Row],[CRE47]]","v":0}]
[{"$f":"+'BALANCE DE PRUEBA UNITARIO'!A9","v":158815},{"$f":"+'BALANCE DE PRUEBA UNITARIO'!B9","v":158815},{"$f":"+'BALANCE DE PRUEBA UNITARIO'!C9","v":"EQUIPO DE COMPUTACION Y COMUNICACION "},{"$f":"SUMIFS(Diario[VALOR],Diario[CENTRO DE COSTOS],D$2,Diario[DEBITO],PUC_310[[#This Row],[CUENTA]])","v":0},{"$f":"SUMIFS(Diario[VALOR],Diario[CENTRO DE COSTOS],E$2,Diario[CREDITO],PUC_310[[#This Row],[CUENTA]])","v":0},{"$f":"+PUC_310[[#This Row],[DEB]]-PUC_310[[#This Row],[CRE]]","v":0},{"$f":"SUMIFS(Diario[VALOR],Diario[CENTRO DE COSTOS],G$2,Diario[DEBITO],PUC_310[[#This Row],[CUENTA]])","v":0},{"$f":"SUMIFS(Diario[VALOR],Diario[CENTRO DE COSTOS],H$2,Diario[CREDITO],PUC_310[[#This Row],[CUENTA]])","v":0},{"$f":"+PUC_310[[#This Row],[DEB2]]-PUC_310[[#This Row],[CRE2]]","v":0},{"$f":"SUMIFS(Diario[VALOR],Diario[CENTRO DE COSTOS],J$2,Diario[DEBITO],PUC_310[[#This Row],[CUENTA]])","v":0},{"$f":"SUMIFS(Diario[VALOR],Diario[CENTRO DE COSTOS],K$2,Diario[CREDITO],PUC_310[[#This Row],[CUENTA]])","v":0},{"$f":"+PUC_310[[#This Row],[DEB3]]-PUC_310[[#This Row],[CRE4]]","v":0},{"$f":"SUMIFS(Diario[VALOR],Diario[CENTRO DE COSTOS],M$2,Diario[DEBITO],PUC_310[[#This Row],[CUENTA]])","v":0},{"$f":"SUMIFS(Diario[VALOR],Diario[CENTRO DE COSTOS],N$2,Diario[CREDITO],PUC_310[[#This Row],[CUENTA]])","v":0},{"$f":"+PUC_310[[#This Row],[CRE52]]-PUC_310[[#This Row],[CRE53]]","v":0},{"$f":"SUMIFS(Diario[VALOR],Diario[CENTRO DE COSTOS],P$2,Diario[DEBITO],PUC_310[[#This Row],[CUENTA]])","v":0},{"$f":"SUMIFS(Diario[VALOR],Diario[CENTRO DE COSTOS],Q$2,Diario[CREDITO],PUC_310[[#This Row],[CUENTA]])","v":0},{"$f":"+PUC_310[[#This Row],[CRE55]]-PUC_310[[#This Row],[CRE56]]","v":0},{"$f":"SUMIFS(Diario[VALOR],Diario[CENTRO DE COSTOS],S$2,Diario[DEBITO],PUC_310[[#This Row],[CUENTA]])","v":0},{"$f":"SUMIFS(Diario[VALOR],Diario[CENTRO DE COSTOS],T$2,Diario[CREDITO],PUC_310[[#This Row],[CUENTA]])","v":0},{"$f":"+PUC_310[[#This Row],[CRE7]]-PUC_310[[#This Row],[CRE8]]","v":0},{"$f":"SUMIFS(Diario[VALOR],Diario[CENTRO DE COSTOS],V$2,Diario[DEBITO],PUC_310[[#This Row],[CUENTA]])","v":0},{"$f":"SUMIFS(Diario[VALOR],Diario[CENTRO DE COSTOS],W$2,Diario[CREDITO],PUC_310[[#This Row],[CUENTA]])","v":0},{"$f":"+PUC_310[[#This Row],[CRE10]]-PUC_310[[#This Row],[CRE11]]","v":0},{"$f":"SUMIFS(Diario[VALOR],Diario[CENTRO DE COSTOS],Y$2,Diario[DEBITO],PUC_310[[#This Row],[CUENTA]])","v":0},{"$f":"SUMIFS(Diario[VALOR],Diario[CENTRO DE COSTOS],Z$2,Diario[CREDITO],PUC_310[[#This Row],[CUENTA]])","v":0},{"$f":"+PUC_310[[#This Row],[CRE13]]-PUC_310[[#This Row],[CRE14]]","v":0},{"$f":"SUMIFS(Diario[VALOR],Diario[CENTRO DE COSTOS],AB$2,Diario[DEBITO],PUC_310[[#This Row],[CUENTA]])","v":0},{"$f":"SUMIFS(Diario[VALOR],Diario[CENTRO DE COSTOS],AC$2,Diario[CREDITO],PUC_310[[#This Row],[CUENTA]])","v":0},{"$f":"+PUC_310[[#This Row],[CRE16]]-PUC_310[[#This Row],[CRE17]]","v":0},{"$f":"SUMIFS(Diario[VALOR],Diario[CENTRO DE COSTOS],AE$2,Diario[DEBITO],PUC_310[[#This Row],[CUENTA]])","v":0},{"$f":"SUMIFS(Diario[VALOR],Diario[CENTRO DE COSTOS],AF$2,Diario[CREDITO],PUC_310[[#This Row],[CUENTA]])","v":0},{"$f":"+PUC_310[[#This Row],[CRE19]]-PUC_310[[#This Row],[CRE20]]","v":0},{"$f":"SUMIFS(Diario[VALOR],Diario[CENTRO DE COSTOS],AH$2,Diario[DEBITO],PUC_310[[#This Row],[CUENTA]])","v":0},{"$f":"SUMIFS(Diario[VALOR],Diario[CENTRO DE COSTOS],AI$2,Diario[CREDITO],PUC_310[[#This Row],[CUENTA]])","v":0},{"$f":"+PUC_310[[#This Row],[CRE22]]-PUC_310[[#This Row],[CRE23]]","v":0},{"$f":"SUMIFS(Diario[VALOR],Diario[CENTRO DE COSTOS],AK$2,Diario[DEBITO],PUC_310[[#This Row],[CUENTA]])","v":0},{"$f":"SUMIFS(Diario[VALOR],Diario[CENTRO DE COSTOS],AL$2,Diario[CREDITO],PUC_310[[#This Row],[CUENTA]])","v":0},{"$f":"+PUC_310[[#This Row],[CRE25]]-PUC_310[[#This Row],[CRE26]]","v":0},{"$f":"SUMIFS(Diario[VALOR],Diario[CENTRO DE COSTOS],AN$2,Diario[DEBITO],PUC_310[[#This Row],[CUENTA]])","v":0},{"$f":"SUMIFS(Diario[VALOR],Diario[CENTRO DE COSTOS],AO$2,Diario[CREDITO],PUC_310[[#This Row],[CUENTA]])","v":0},{"$f":"+PUC_310[[#This Row],[CRE28]]-PUC_310[[#This Row],[CRE29]]","v":0},{"$f":"SUMIFS(Diario[VALOR],Diario[CENTRO DE COSTOS],AQ$2,Diario[DEBITO],PUC_310[[#This Row],[CUENTA]])","v":0},{"$f":"SUMIFS(Diario[VALOR],Diario[CENTRO DE COSTOS],AR$2,Diario[CREDITO],PUC_310[[#This Row],[CUENTA]])","v":0},{"$f":"+PUC_310[[#This Row],[CRE31]]-PUC_310[[#This Row],[CRE32]]","v":0},{"$f":"SUMIFS(Diario[VALOR],Diario[CENTRO DE COSTOS],AT$2,Diario[DEBITO],PUC_310[[#This Row],[CUENTA]])","v":0},{"$f":"SUMIFS(Diario[VALOR],Diario[CENTRO DE COSTOS],AU$2,Diario[CREDITO],PUC_310[[#This Row],[CUENTA]])","v":0},{"$f":"+PUC_310[[#This Row],[CRE34]]-PUC_310[[#This Row],[CRE35]]","v":0},{"$f":"SUMIFS(Diario[VALOR],Diario[CENTRO DE COSTOS],AW$2,Diario[DEBITO],PUC_310[[#This Row],[CUENTA]])","v":0},{"$f":"SUMIFS(Diario[VALOR],Diario[CENTRO DE COSTOS],AX$2,Diario[CREDITO],PUC_310[[#This Row],[CUENTA]])","v":0},{"$f":"+PUC_310[[#This Row],[CRE37]]-PUC_310[[#This Row],[CRE38]]","v":0},{"$f":"SUMIFS(Diario[VALOR],Diario[CENTRO DE COSTOS],AZ$2,Diario[DEBITO],PUC_310[[#This Row],[CUENTA]])","v":0},{"$f":"SUMIFS(Diario[VALOR],Diario[CENTRO DE COSTOS],BA$2,Diario[CREDITO],PUC_310[[#This Row],[CUENTA]])","v":0},{"$f":"+PUC_310[[#This Row],[CRE40]]-PUC_310[[#This Row],[CRE41]]","v":0},{"$f":"SUMIFS(Diario[VALOR],Diario[CENTRO DE COSTOS],BC$2,Diario[DEBITO],PUC_310[[#This Row],[CUENTA]])","v":0},{"$f":"SUMIFS(Diario[VALOR],Diario[CENTRO DE COSTOS],BD$2,Diario[CREDITO],PUC_310[[#This Row],[CUENTA]])","v":0},{"$f":"+PUC_310[[#This Row],[CRE43]]-PUC_310[[#This Row],[CRE44]]","v":0},{"$f":"SUMIFS(Diario[VALOR],Diario[CENTRO DE COSTOS],BF$2,Diario[DEBITO],PUC_310[[#This Row],[CUENTA]])","v":0},{"$f":"SUMIFS(Diario[VALOR],Diario[CENTRO DE COSTOS],BG$2,Diario[CREDITO],PUC_310[[#This Row],[CUENTA]])","v":0},{"$f":"+PUC_310[[#This Row],[CRE452]]-PUC_310[[#This Row],[CRE453]]","v":0},{"$f":"SUMIF($B$3:$BH$3,$BI$3,PUC_310[[#This Row],[AUXILIAR]:[CRE4]])","v":0},{"$f":"SUMIF($B$3:$BH$3,$BJ$3,PUC_310[[#This Row],[AUXILIAR]:[CRE4]])","v":0},{"$f":"+PUC_310[[#This Row],[CRE46]]-PUC_310[[#This Row],[CRE47]]","v":0}]
[{"$f":"+'BALANCE DE PRUEBA UNITARIO'!A10","v":250505},{"$f":"+'BALANCE DE PRUEBA UNITARIO'!B10","v":250505},{"$f":"+'BALANCE DE PRUEBA UNITARIO'!C10","v":"PROVEEDORES NACIONALES"},{"$f":"SUMIFS(Diario[VALOR],Diario[CENTRO DE COSTOS],D$2,Diario[DEBITO],PUC_310[[#This Row],[CUENTA]])","v":0},{"$f":"SUMIFS(Diario[VALOR],Diario[CENTRO DE COSTOS],E$2,Diario[CREDITO],PUC_310[[#This Row],[CUENTA]])","v":0},{"$f":"+PUC_310[[#This Row],[DEB]]-PUC_310[[#This Row],[CRE]]","v":0},{"$f":"SUMIFS(Diario[VALOR],Diario[CENTRO DE COSTOS],G$2,Diario[DEBITO],PUC_310[[#This Row],[CUENTA]])","v":0},{"$f":"SUMIFS(Diario[VALOR],Diario[CENTRO DE COSTOS],H$2,Diario[CREDITO],PUC_310[[#This Row],[CUENTA]])","v":0},{"$f":"+PUC_310[[#This Row],[DEB2]]-PUC_310[[#This Row],[CRE2]]","v":0},{"$f":"SUMIFS(Diario[VALOR],Diario[CENTRO DE COSTOS],J$2,Diario[DEBITO],PUC_310[[#This Row],[CUENTA]])","v":0},{"$f":"SUMIFS(Diario[VALOR],Diario[CENTRO DE COSTOS],K$2,Diario[CREDITO],PUC_310[[#This Row],[CUENTA]])","v":0},{"$f":"+PUC_310[[#This Row],[DEB3]]-PUC_310[[#This Row],[CRE4]]","v":0},{"$f":"SUMIFS(Diario[VALOR],Diario[CENTRO DE COSTOS],M$2,Diario[DEBITO],PUC_310[[#This Row],[CUENTA]])","v":0},{"$f":"SUMIFS(Diario[VALOR],Diario[CENTRO DE COSTOS],N$2,Diario[CREDITO],PUC_310[[#This Row],[CUENTA]])","v":0},{"$f":"+PUC_310[[#This Row],[CRE52]]-PUC_310[[#This Row],[CRE53]]","v":0},{"$f":"SUMIFS(Diario[VALOR],Diario[CENTRO DE COSTOS],P$2,Diario[DEBITO],PUC_310[[#This Row],[CUENTA]])","v":0},{"$f":"SUMIFS(Diario[VALOR],Diario[CENTRO DE COSTOS],Q$2,Diario[CREDITO],PUC_310[[#This Row],[CUENTA]])","v":0},{"$f":"+PUC_310[[#This Row],[CRE55]]-PUC_310[[#This Row],[CRE56]]","v":0},{"$f":"SUMIFS(Diario[VALOR],Diario[CENTRO DE COSTOS],S$2,Diario[DEBITO],PUC_310[[#This Row],[CUENTA]])","v":0},{"$f":"SUMIFS(Diario[VALOR],Diario[CENTRO DE COSTOS],T$2,Diario[CREDITO],PUC_310[[#This Row],[CUENTA]])","v":0},{"$f":"+PUC_310[[#This Row],[CRE7]]-PUC_310[[#This Row],[CRE8]]","v":0},{"$f":"SUMIFS(Diario[VALOR],Diario[CENTRO DE COSTOS],V$2,Diario[DEBITO],PUC_310[[#This Row],[CUENTA]])","v":0},{"$f":"SUMIFS(Diario[VALOR],Diario[CENTRO DE COSTOS],W$2,Diario[CREDITO],PUC_310[[#This Row],[CUENTA]])","v":0},{"$f":"+PUC_310[[#This Row],[CRE10]]-PUC_310[[#This Row],[CRE11]]","v":0},{"$f":"SUMIFS(Diario[VALOR],Diario[CENTRO DE COSTOS],Y$2,Diario[DEBITO],PUC_310[[#This Row],[CUENTA]])","v":0},{"$f":"SUMIFS(Diario[VALOR],Diario[CENTRO DE COSTOS],Z$2,Diario[CREDITO],PUC_310[[#This Row],[CUENTA]])","v":0},{"$f":"+PUC_310[[#This Row],[CRE13]]-PUC_310[[#This Row],[CRE14]]","v":0},{"$f":"SUMIFS(Diario[VALOR],Diario[CENTRO DE COSTOS],AB$2,Diario[DEBITO],PUC_310[[#This Row],[CUENTA]])","v":0},{"$f":"SUMIFS(Diario[VALOR],Diario[CENTRO DE COSTOS],AC$2,Diario[CREDITO],PUC_310[[#This Row],[CUENTA]])","v":0},{"$f":"+PUC_310[[#This Row],[CRE16]]-PUC_310[[#This Row],[CRE17]]","v":0},{"$f":"SUMIFS(Diario[VALOR],Diario[CENTRO DE COSTOS],AE$2,Diario[DEBITO],PUC_310[[#This Row],[CUENTA]])","v":0},{"$f":"SUMIFS(Diario[VALOR],Diario[CENTRO DE COSTOS],AF$2,Diario[CREDITO],PUC_310[[#This Row],[CUENTA]])","v":0},{"$f":"+PUC_310[[#This Row],[CRE19]]-PUC_310[[#This Row],[CRE20]]","v":0},{"$f":"SUMIFS(Diario[VALOR],Diario[CENTRO DE COSTOS],AH$2,Diario[DEBITO],PUC_310[[#This Row],[CUENTA]])","v":0},{"$f":"SUMIFS(Diario[VALOR],Diario[CENTRO DE COSTOS],AI$2,Diario[CREDITO],PUC_310[[#This Row],[CUENTA]])","v":0},{"$f":"+PUC_310[[#This Row],[CRE22]]-PUC_310[[#This Row],[CRE23]]","v":0},{"$f":"SUMIFS(Diario[VALOR],Diario[CENTRO DE COSTOS],AK$2,Diario[DEBITO],PUC_310[[#This Row],[CUENTA]])","v":0},{"$f":"SUMIFS(Diario[VALOR],Diario[CENTRO DE COSTOS],AL$2,Diario[CREDITO],PUC_310[[#This Row],[CUENTA]])","v":0},{"$f":"+PUC_310[[#This Row],[CRE25]]-PUC_310[[#This Row],[CRE26]]","v":0},{"$f":"SUMIFS(Diario[VALOR],Diario[CENTRO DE COSTOS],AN$2,Diario[DEBITO],PUC_310[[#This Row],[CUENTA]])","v":0},{"$f":"SUMIFS(Diario[VALOR],Diario[CENTRO DE COSTOS],AO$2,Diario[CREDITO],PUC_310[[#This Row],[CUENTA]])","v":0},{"$f":"+PUC_310[[#This Row],[CRE28]]-PUC_310[[#This Row],[CRE29]]","v":0},{"$f":"SUMIFS(Diario[VALOR],Diario[CENTRO DE COSTOS],AQ$2,Diario[DEBITO],PUC_310[[#This Row],[CUENTA]])","v":0},{"$f":"SUMIFS(Diario[VALOR],Diario[CENTRO DE COSTOS],AR$2,Diario[CREDITO],PUC_310[[#This Row],[CUENTA]])","v":0},{"$f":"+PUC_310[[#This Row],[CRE31]]-PUC_310[[#This Row],[CRE32]]","v":0},{"$f":"SUMIFS(Diario[VALOR],Diario[CENTRO DE COSTOS],AT$2,Diario[DEBITO],PUC_310[[#This Row],[CUENTA]])","v":0},{"$f":"SUMIFS(Diario[VALOR],Diario[CENTRO DE COSTOS],AU$2,Diario[CREDITO],PUC_310[[#This Row],[CUENTA]])","v":0},{"$f":"+PUC_310[[#This Row],[CRE34]]-PUC_310[[#This Row],[CRE35]]","v":0},{"$f":"SUMIFS(Diario[VALOR],Diario[CENTRO DE COSTOS],AW$2,Diario[DEBITO],PUC_310[[#This Row],[CUENTA]])","v":0},{"$f":"SUMIFS(Diario[VALOR],Diario[CENTRO DE COSTOS],AX$2,Diario[CREDITO],PUC_310[[#This Row],[CUENTA]])","v":0},{"$f":"+PUC_310[[#This Row],[CRE37]]-PUC_310[[#This Row],[CRE38]]","v":0},{"$f":"SUMIFS(Diario[VALOR],Diario[CENTRO DE COSTOS],AZ$2,Diario[DEBITO],PUC_310[[#This Row],[CUENTA]])","v":0},{"$f":"SUMIFS(Diario[VALOR],Diario[CENTRO DE COSTOS],BA$2,Diario[CREDITO],PUC_310[[#This Row],[CUENTA]])","v":0},{"$f":"+PUC_310[[#This Row],[CRE40]]-PUC_310[[#This Row],[CRE41]]","v":0},{"$f":"SUMIFS(Diario[VALOR],Diario[CENTRO DE COSTOS],BC$2,Diario[DEBITO],PUC_310[[#This Row],[CUENTA]])","v":0},{"$f":"SUMIFS(Diario[VALOR],Diario[CENTRO DE COSTOS],BD$2,Diario[CREDITO],PUC_310[[#This Row],[CUENTA]])","v":0},{"$f":"+PUC_310[[#This Row],[CRE43]]-PUC_310[[#This Row],[CRE44]]","v":0},{"$f":"SUMIFS(Diario[VALOR],Diario[CENTRO DE COSTOS],BF$2,Diario[DEBITO],PUC_310[[#This Row],[CUENTA]])","v":0},{"$f":"SUMIFS(Diario[VALOR],Diario[CENTRO DE COSTOS],BG$2,Diario[CREDITO],PUC_310[[#This Row],[CUENTA]])","v":0},{"$f":"+PUC_310[[#This Row],[CRE452]]-PUC_310[[#This Row],[CRE453]]","v":0},{"$f":"SUMIF($B$3:$BH$3,$BI$3,PUC_310[[#This Row],[AUXILIAR]:[CRE4]])","v":0},{"$f":"SUMIF($B$3:$BH$3,$BJ$3,PUC_310[[#This Row],[AUXILIAR]:[CRE4]])","v":0},{"$f":"+PUC_310[[#This Row],[CRE46]]-PUC_310[[#This Row],[CRE47]]","v":0}]
[{"$f":"+'BALANCE DE PRUEBA UNITARIO'!A11","v":410545},{"$f":"+'BALANCE DE PRUEBA UNITARIO'!B11","v":410545},{"$f":"+'BALANCE DE PRUEBA UNITARIO'!C11","v":"OTROS CULTIVOS AGRICOLAS "},{"$f":"SUMIFS(Diario[VALOR],Diario[CENTRO DE COSTOS],D$2,Diario[DEBITO],PUC_310[[#This Row],[CUENTA]])","v":0},{"$f":"SUMIFS(Diario[VALOR],Diario[CENTRO DE COSTOS],E$2,Diario[CREDITO],PUC_310[[#This Row],[CUENTA]])","v":0},{"$f":"+PUC_310[[#This Row],[DEB]]-PUC_310[[#This Row],[CRE]]","v":0},{"$f":"SUMIFS(Diario[VALOR],Diario[CENTRO DE COSTOS],G$2,Diario[DEBITO],PUC_310[[#This Row],[CUENTA]])","v":0},{"$f":"SUMIFS(Diario[VALOR],Diario[CENTRO DE COSTOS],H$2,Diario[CREDITO],PUC_310[[#This Row],[CUENTA]])","v":0},{"$f":"+PUC_310[[#This Row],[DEB2]]-PUC_310[[#This Row],[CRE2]]","v":0},{"$f":"SUMIFS(Diario[VALOR],Diario[CENTRO DE COSTOS],J$2,Diario[DEBITO],PUC_310[[#This Row],[CUENTA]])","v":0},{"$f":"SUMIFS(Diario[VALOR],Diario[CENTRO DE COSTOS],K$2,Diario[CREDITO],PUC_310[[#This Row],[CUENTA]])","v":0},{"$f":"+PUC_310[[#This Row],[DEB3]]-PUC_310[[#This Row],[CRE4]]","v":0},{"$f":"SUMIFS(Diario[VALOR],Diario[CENTRO DE COSTOS],M$2,Diario[DEBITO],PUC_310[[#This Row],[CUENTA]])","v":0},{"$f":"SUMIFS(Diario[VALOR],Diario[CENTRO DE COSTOS],N$2,Diario[CREDITO],PUC_310[[#This Row],[CUENTA]])","v":0},{"$f":"+PUC_310[[#This Row],[CRE52]]-PUC_310[[#This Row],[CRE53]]","v":0},{"$f":"SUMIFS(Diario[VALOR],Diario[CENTRO DE COSTOS],P$2,Diario[DEBITO],PUC_310[[#This Row],[CUENTA]])","v":0},{"$f":"SUMIFS(Diario[VALOR],Diario[CENTRO DE COSTOS],Q$2,Diario[CREDITO],PUC_310[[#This Row],[CUENTA]])","v":0},{"$f":"+PUC_310[[#This Row],[CRE55]]-PUC_310[[#This Row],[CRE56]]","v":0},{"$f":"SUMIFS(Diario[VALOR],Diario[CENTRO DE COSTOS],S$2,Diario[DEBITO],PUC_310[[#This Row],[CUENTA]])","v":0},{"$f":"SUMIFS(Diario[VALOR],Diario[CENTRO DE COSTOS],T$2,Diario[CREDITO],PUC_310[[#This Row],[CUENTA]])","v":0},{"$f":"+PUC_310[[#This Row],[CRE7]]-PUC_310[[#This Row],[CRE8]]","v":0},{"$f":"SUMIFS(Diario[VALOR],Diario[CENTRO DE COSTOS],V$2,Diario[DEBITO],PUC_310[[#This Row],[CUENTA]])","v":0},{"$f":"SUMIFS(Diario[VALOR],Diario[CENTRO DE COSTOS],W$2,Diario[CREDITO],PUC_310[[#This Row],[CUENTA]])","v":0},{"$f":"+PUC_310[[#This Row],[CRE10]]-PUC_310[[#This Row],[CRE11]]","v":0},{"$f":"SUMIFS(Diario[VALOR],Diario[CENTRO DE COSTOS],Y$2,Diario[DEBITO],PUC_310[[#This Row],[CUENTA]])","v":0},{"$f":"SUMIFS(Diario[VALOR],Diario[CENTRO DE COSTOS],Z$2,Diario[CREDITO],PUC_310[[#This Row],[CUENTA]])","v":0},{"$f":"+PUC_310[[#This Row],[CRE13]]-PUC_310[[#This Row],[CRE14]]","v":0},{"$f":"SUMIFS(Diario[VALOR],Diario[CENTRO DE COSTOS],AB$2,Diario[DEBITO],PUC_310[[#This Row],[CUENTA]])","v":0},{"$f":"SUMIFS(Diario[VALOR],Diario[CENTRO DE COSTOS],AC$2,Diario[CREDITO],PUC_310[[#This Row],[CUENTA]])","v":0},{"$f":"+PUC_310[[#This Row],[CRE16]]-PUC_310[[#This Row],[CRE17]]","v":0},{"$f":"SUMIFS(Diario[VALOR],Diario[CENTRO DE COSTOS],AE$2,Diario[DEBITO],PUC_310[[#This Row],[CUENTA]])","v":0},{"$f":"SUMIFS(Diario[VALOR],Diario[CENTRO DE COSTOS],AF$2,Diario[CREDITO],PUC_310[[#This Row],[CUENTA]])","v":0},{"$f":"+PUC_310[[#This Row],[CRE19]]-PUC_310[[#This Row],[CRE20]]","v":0},{"$f":"SUMIFS(Diario[VALOR],Diario[CENTRO DE COSTOS],AH$2,Diario[DEBITO],PUC_310[[#This Row],[CUENTA]])","v":0},{"$f":"SUMIFS(Diario[VALOR],Diario[CENTRO DE COSTOS],AI$2,Diario[CREDITO],PUC_310[[#This Row],[CUENTA]])","v":0},{"$f":"+PUC_310[[#This Row],[CRE22]]-PUC_310[[#This Row],[CRE23]]","v":0},{"$f":"SUMIFS(Diario[VALOR],Diario[CENTRO DE COSTOS],AK$2,Diario[DEBITO],PUC_310[[#This Row],[CUENTA]])","v":0},{"$f":"SUMIFS(Diario[VALOR],Diario[CENTRO DE COSTOS],AL$2,Diario[CREDITO],PUC_310[[#This Row],[CUENTA]])","v":0},{"$f":"+PUC_310[[#This Row],[CRE25]]-PUC_310[[#This Row],[CRE26]]","v":0},{"$f":"SUMIFS(Diario[VALOR],Diario[CENTRO DE COSTOS],AN$2,Diario[DEBITO],PUC_310[[#This Row],[CUENTA]])","v":0},{"$f":"SUMIFS(Diario[VALOR],Diario[CENTRO DE COSTOS],AO$2,Diario[CREDITO],PUC_310[[#This Row],[CUENTA]])","v":0},{"$f":"+PUC_310[[#This Row],[CRE28]]-PUC_310[[#This Row],[CRE29]]","v":0},{"$f":"SUMIFS(Diario[VALOR],Diario[CENTRO DE COSTOS],AQ$2,Diario[DEBITO],PUC_310[[#This Row],[CUENTA]])","v":0},{"$f":"SUMIFS(Diario[VALOR],Diario[CENTRO DE COSTOS],AR$2,Diario[CREDITO],PUC_310[[#This Row],[CUENTA]])","v":0},{"$f":"+PUC_310[[#This Row],[CRE31]]-PUC_310[[#This Row],[CRE32]]","v":0},{"$f":"SUMIFS(Diario[VALOR],Diario[CENTRO DE COSTOS],AT$2,Diario[DEBITO],PUC_310[[#This Row],[CUENTA]])","v":0},{"$f":"SUMIFS(Diario[VALOR],Diario[CENTRO DE COSTOS],AU$2,Diario[CREDITO],PUC_310[[#This Row],[CUENTA]])","v":0},{"$f":"+PUC_310[[#This Row],[CRE34]]-PUC_310[[#This Row],[CRE35]]","v":0},{"$f":"SUMIFS(Diario[VALOR],Diario[CENTRO DE COSTOS],AW$2,Diario[DEBITO],PUC_310[[#This Row],[CUENTA]])","v":0},{"$f":"SUMIFS(Diario[VALOR],Diario[CENTRO DE COSTOS],AX$2,Diario[CREDITO],PUC_310[[#This Row],[CUENTA]])","v":0},{"$f":"+PUC_310[[#This Row],[CRE37]]-PUC_310[[#This Row],[CRE38]]","v":0},{"$f":"SUMIFS(Diario[VALOR],Diario[CENTRO DE COSTOS],AZ$2,Diario[DEBITO],PUC_310[[#This Row],[CUENTA]])","v":0},{"$f":"SUMIFS(Diario[VALOR],Diario[CENTRO DE COSTOS],BA$2,Diario[CREDITO],PUC_310[[#This Row],[CUENTA]])","v":0},{"$f":"+PUC_310[[#This Row],[CRE40]]-PUC_310[[#This Row],[CRE41]]","v":0},{"$f":"SUMIFS(Diario[VALOR],Diario[CENTRO DE COSTOS],BC$2,Diario[DEBITO],PUC_310[[#This Row],[CUENTA]])","v":0},{"$f":"SUMIFS(Diario[VALOR],Diario[CENTRO DE COSTOS],BD$2,Diario[CREDITO],PUC_310[[#This Row],[CUENTA]])","v":0},{"$f":"+PUC_310[[#This Row],[CRE43]]-PUC_310[[#This Row],[CRE44]]","v":0},{"$f":"SUMIFS(Diario[VALOR],Diario[CENTRO DE COSTOS],BF$2,Diario[DEBITO],PUC_310[[#This Row],[CUENTA]])","v":0},{"$f":"SUMIFS(Diario[VALOR],Diario[CENTRO DE COSTOS],BG$2,Diario[CREDITO],PUC_310[[#This Row],[CUENTA]])","v":0},{"$f":"+PUC_310[[#This Row],[CRE452]]-PUC_310[[#This Row],[CRE453]]","v":0},{"$f":"SUMIF($B$3:$BH$3,$BI$3,PUC_310[[#This Row],[AUXILIAR]:[CRE4]])","v":0},{"$f":"SUMIF($B$3:$BH$3,$BJ$3,PUC_310[[#This Row],[AUXILIAR]:[CRE4]])","v":0},{"$f":"+PUC_310[[#This Row],[CRE46]]-PUC_310[[#This Row],[CRE47]]","v":0}]
[{"$f":"+'BALANCE DE PRUEBA UNITARIO'!A12","v":510506},{"$f":"+'BALANCE DE PRUEBA UNITARIO'!B12","v":510506},{"$f":"+'BALANCE DE PRUEBA UNITARIO'!C12","v":"SUELDOS "},{"$f":"SUMIFS(Diario[VALOR],Diario[CENTRO DE COSTOS],D$2,Diario[DEBITO],PUC_310[[#This Row],[CUENTA]])","v":0},{"$f":"SUMIFS(Diario[VALOR],Diario[CENTRO DE COSTOS],E$2,Diario[CREDITO],PUC_310[[#This Row],[CUENTA]])","v":0},{"$f":"+PUC_310[[#This Row],[DEB]]-PUC_310[[#This Row],[CRE]]","v":0},{"$f":"SUMIFS(Diario[VALOR],Diario[CENTRO DE COSTOS],G$2,Diario[DEBITO],PUC_310[[#This Row],[CUENTA]])","v":0},{"$f":"SUMIFS(Diario[VALOR],Diario[CENTRO DE COSTOS],H$2,Diario[CREDITO],PUC_310[[#This Row],[CUENTA]])","v":0},{"$f":"+PUC_310[[#This Row],[DEB2]]-PUC_310[[#This Row],[CRE2]]","v":0},{"$f":"SUMIFS(Diario[VALOR],Diario[CENTRO DE COSTOS],J$2,Diario[DEBITO],PUC_310[[#This Row],[CUENTA]])","v":0},{"$f":"SUMIFS(Diario[VALOR],Diario[CENTRO DE COSTOS],K$2,Diario[CREDITO],PUC_310[[#This Row],[CUENTA]])","v":0},{"$f":"+PUC_310[[#This Row],[DEB3]]-PUC_310[[#This Row],[CRE4]]","v":0},{"$f":"SUMIFS(Diario[VALOR],Diario[CENTRO DE COSTOS],M$2,Diario[DEBITO],PUC_310[[#This Row],[CUENTA]])","v":0},{"$f":"SUMIFS(Diario[VALOR],Diario[CENTRO DE COSTOS],N$2,Diario[CREDITO],PUC_310[[#This Row],[CUENTA]])","v":0},{"$f":"+PUC_310[[#This Row],[CRE52]]-PUC_310[[#This Row],[CRE53]]","v":0},{"$f":"SUMIFS(Diario[VALOR],Diario[CENTRO DE COSTOS],P$2,Diario[DEBITO],PUC_310[[#This Row],[CUENTA]])","v":0},{"$f":"SUMIFS(Diario[VALOR],Diario[CENTRO DE COSTOS],Q$2,Diario[CREDITO],PUC_310[[#This Row],[CUENTA]])","v":0},{"$f":"+PUC_310[[#This Row],[CRE55]]-PUC_310[[#This Row],[CRE56]]","v":0},{"$f":"SUMIFS(Diario[VALOR],Diario[CENTRO DE COSTOS],S$2,Diario[DEBITO],PUC_310[[#This Row],[CUENTA]])","v":0},{"$f":"SUMIFS(Diario[VALOR],Diario[CENTRO DE COSTOS],T$2,Diario[CREDITO],PUC_310[[#This Row],[CUENTA]])","v":0},{"$f":"+PUC_310[[#This Row],[CRE7]]-PUC_310[[#This Row],[CRE8]]","v":0},{"$f":"SUMIFS(Diario[VALOR],Diario[CENTRO DE COSTOS],V$2,Diario[DEBITO],PUC_310[[#This Row],[CUENTA]])","v":0},{"$f":"SUMIFS(Diario[VALOR],Diario[CENTRO DE COSTOS],W$2,Diario[CREDITO],PUC_310[[#This Row],[CUENTA]])","v":0},{"$f":"+PUC_310[[#This Row],[CRE10]]-PUC_310[[#This Row],[CRE11]]","v":0},{"$f":"SUMIFS(Diario[VALOR],Diario[CENTRO DE COSTOS],Y$2,Diario[DEBITO],PUC_310[[#This Row],[CUENTA]])","v":0},{"$f":"SUMIFS(Diario[VALOR],Diario[CENTRO DE COSTOS],Z$2,Diario[CREDITO],PUC_310[[#This Row],[CUENTA]])","v":0},{"$f":"+PUC_310[[#This Row],[CRE13]]-PUC_310[[#This Row],[CRE14]]","v":0},{"$f":"SUMIFS(Diario[VALOR],Diario[CENTRO DE COSTOS],AB$2,Diario[DEBITO],PUC_310[[#This Row],[CUENTA]])","v":0},{"$f":"SUMIFS(Diario[VALOR],Diario[CENTRO DE COSTOS],AC$2,Diario[CREDITO],PUC_310[[#This Row],[CUENTA]])","v":0},{"$f":"+PUC_310[[#This Row],[CRE16]]-PUC_310[[#This Row],[CRE17]]","v":0},{"$f":"SUMIFS(Diario[VALOR],Diario[CENTRO DE COSTOS],AE$2,Diario[DEBITO],PUC_310[[#This Row],[CUENTA]])","v":0},{"$f":"SUMIFS(Diario[VALOR],Diario[CENTRO DE COSTOS],AF$2,Diario[CREDITO],PUC_310[[#This Row],[CUENTA]])","v":0},{"$f":"+PUC_310[[#This Row],[CRE19]]-PUC_310[[#This Row],[CRE20]]","v":0},{"$f":"SUMIFS(Diario[VALOR],Diario[CENTRO DE COSTOS],AH$2,Diario[DEBITO],PUC_310[[#This Row],[CUENTA]])","v":0},{"$f":"SUMIFS(Diario[VALOR],Diario[CENTRO DE COSTOS],AI$2,Diario[CREDITO],PUC_310[[#This Row],[CUENTA]])","v":0},{"$f":"+PUC_310[[#This Row],[CRE22]]-PUC_310[[#This Row],[CRE23]]","v":0},{"$f":"SUMIFS(Diario[VALOR],Diario[CENTRO DE COSTOS],AK$2,Diario[DEBITO],PUC_310[[#This Row],[CUENTA]])","v":0},{"$f":"SUMIFS(Diario[VALOR],Diario[CENTRO DE COSTOS],AL$2,Diario[CREDITO],PUC_310[[#This Row],[CUENTA]])","v":0},{"$f":"+PUC_310[[#This Row],[CRE25]]-PUC_310[[#This Row],[CRE26]]","v":0},{"$f":"SUMIFS(Diario[VALOR],Diario[CENTRO DE COSTOS],AN$2,Diario[DEBITO],PUC_310[[#This Row],[CUENTA]])","v":0},{"$f":"SUMIFS(Diario[VALOR],Diario[CENTRO DE COSTOS],AO$2,Diario[CREDITO],PUC_310[[#This Row],[CUENTA]])","v":0},{"$f":"+PUC_310[[#This Row],[CRE28]]-PUC_310[[#This Row],[CRE29]]","v":0},{"$f":"SUMIFS(Diario[VALOR],Diario[CENTRO DE COSTOS],AQ$2,Diario[DEBITO],PUC_310[[#This Row],[CUENTA]])","v":0},{"$f":"SUMIFS(Diario[VALOR],Diario[CENTRO DE COSTOS],AR$2,Diario[CREDITO],PUC_310[[#This Row],[CUENTA]])","v":0},{"$f":"+PUC_310[[#This Row],[CRE31]]-PUC_310[[#This Row],[CRE32]]","v":0},{"$f":"SUMIFS(Diario[VALOR],Diario[CENTRO DE COSTOS],AT$2,Diario[DEBITO],PUC_310[[#This Row],[CUENTA]])","v":0},{"$f":"SUMIFS(Diario[VALOR],Diario[CENTRO DE COSTOS],AU$2,Diario[CREDITO],PUC_310[[#This Row],[CUENTA]])","v":0},{"$f":"+PUC_310[[#This Row],[CRE34]]-PUC_310[[#This Row],[CRE35]]","v":0},{"$f":"SUMIFS(Diario[VALOR],Diario[CENTRO DE COSTOS],AW$2,Diario[DEBITO],PUC_310[[#This Row],[CUENTA]])","v":0},{"$f":"SUMIFS(Diario[VALOR],Diario[CENTRO DE COSTOS],AX$2,Diario[CREDITO],PUC_310[[#This Row],[CUENTA]])","v":0},{"$f":"+PUC_310[[#This Row],[CRE37]]-PUC_310[[#This Row],[CRE38]]","v":0},{"$f":"SUMIFS(Diario[VALOR],Diario[CENTRO DE COSTOS],AZ$2,Diario[DEBITO],PUC_310[[#This Row],[CUENTA]])","v":0},{"$f":"SUMIFS(Diario[VALOR],Diario[CENTRO DE COSTOS],BA$2,Diario[CREDITO],PUC_310[[#This Row],[CUENTA]])","v":0},{"$f":"+PUC_310[[#This Row],[CRE40]]-PUC_310[[#This Row],[CRE41]]","v":0},{"$f":"SUMIFS(Diario[VALOR],Diario[CENTRO DE COSTOS],BC$2,Diario[DEBITO],PUC_310[[#This Row],[CUENTA]])","v":0},{"$f":"SUMIFS(Diario[VALOR],Diario[CENTRO DE COSTOS],BD$2,Diario[CREDITO],PUC_310[[#This Row],[CUENTA]])","v":0},{"$f":"+PUC_310[[#This Row],[CRE43]]-PUC_310[[#This Row],[CRE44]]","v":0},{"$f":"SUMIFS(Diario[VALOR],Diario[CENTRO DE COSTOS],BF$2,Diario[DEBITO],PUC_310[[#This Row],[CUENTA]])","v":0},{"$f":"SUMIFS(Diario[VALOR],Diario[CENTRO DE COSTOS],BG$2,Diario[CREDITO],PUC_310[[#This Row],[CUENTA]])","v":0},{"$f":"+PUC_310[[#This Row],[CRE452]]-PUC_310[[#This Row],[CRE453]]","v":0},{"$f":"SUMIF($B$3:$BH$3,$BI$3,PUC_310[[#This Row],[AUXILIAR]:[CRE4]])","v":0},{"$f":"SUMIF($B$3:$BH$3,$BJ$3,PUC_310[[#This Row],[AUXILIAR]:[CRE4]])","v":0},{"$f":"+PUC_310[[#This Row],[CRE46]]-PUC_310[[#This Row],[CRE47]]","v":0}]
[{"$f":"+'BALANCE DE PRUEBA UNITARIO'!A13","v":510551},{"$f":"+'BALANCE DE PRUEBA UNITARIO'!B13","v":510551},{"$f":"+'BALANCE DE PRUEBA UNITARIO'!C13","v":"DOTACION Y SUMINISTRO A TRABAJADORES "},{"$f":"SUMIFS(Diario[VALOR],Diario[CENTRO DE COSTOS],D$2,Diario[DEBITO],PUC_310[[#This Row],[CUENTA]])","v":0},{"$f":"SUMIFS(Diario[VALOR],Diario[CENTRO DE COSTOS],E$2,Diario[CREDITO],PUC_310[[#This Row],[CUENTA]])","v":0},{"$f":"+PUC_310[[#This Row],[DEB]]-PUC_310[[#This Row],[CRE]]","v":0},{"$f":"SUMIFS(Diario[VALOR],Diario[CENTRO DE COSTOS],G$2,Diario[DEBITO],PUC_310[[#This Row],[CUENTA]])","v":0},{"$f":"SUMIFS(Diario[VALOR],Diario[CENTRO DE COSTOS],H$2,Diario[CREDITO],PUC_310[[#This Row],[CUENTA]])","v":0},{"$f":"+PUC_310[[#This Row],[DEB2]]-PUC_310[[#This Row],[CRE2]]","v":0},{"$f":"SUMIFS(Diario[VALOR],Diario[CENTRO DE COSTOS],J$2,Diario[DEBITO],PUC_310[[#This Row],[CUENTA]])","v":0},{"$f":"SUMIFS(Diario[VALOR],Diario[CENTRO DE COSTOS],K$2,Diario[CREDITO],PUC_310[[#This Row],[CUENTA]])","v":0},{"$f":"+PUC_310[[#This Row],[DEB3]]-PUC_310[[#This Row],[CRE4]]","v":0},{"$f":"SUMIFS(Diario[VALOR],Diario[CENTRO DE COSTOS],M$2,Diario[DEBITO],PUC_310[[#This Row],[CUENTA]])","v":0},{"$f":"SUMIFS(Diario[VALOR],Diario[CENTRO DE COSTOS],N$2,Diario[CREDITO],PUC_310[[#This Row],[CUENTA]])","v":0},{"$f":"+PUC_310[[#This Row],[CRE52]]-PUC_310[[#This Row],[CRE53]]","v":0},{"$f":"SUMIFS(Diario[VALOR],Diario[CENTRO DE COSTOS],P$2,Diario[DEBITO],PUC_310[[#This Row],[CUENTA]])","v":0},{"$f":"SUMIFS(Diario[VALOR],Diario[CENTRO DE COSTOS],Q$2,Diario[CREDITO],PUC_310[[#This Row],[CUENTA]])","v":0},{"$f":"+PUC_310[[#This Row],[CRE55]]-PUC_310[[#This Row],[CRE56]]","v":0},{"$f":"SUMIFS(Diario[VALOR],Diario[CENTRO DE COSTOS],S$2,Diario[DEBITO],PUC_310[[#This Row],[CUENTA]])","v":0},{"$f":"SUMIFS(Diario[VALOR],Diario[CENTRO DE COSTOS],T$2,Diario[CREDITO],PUC_310[[#This Row],[CUENTA]])","v":0},{"$f":"+PUC_310[[#This Row],[CRE7]]-PUC_310[[#This Row],[CRE8]]","v":0},{"$f":"SUMIFS(Diario[VALOR],Diario[CENTRO DE COSTOS],V$2,Diario[DEBITO],PUC_310[[#This Row],[CUENTA]])","v":0},{"$f":"SUMIFS(Diario[VALOR],Diario[CENTRO DE COSTOS],W$2,Diario[CREDITO],PUC_310[[#This Row],[CUENTA]])","v":0},{"$f":"+PUC_310[[#This Row],[CRE10]]-PUC_310[[#This Row],[CRE11]]","v":0},{"$f":"SUMIFS(Diario[VALOR],Diario[CENTRO DE COSTOS],Y$2,Diario[DEBITO],PUC_310[[#This Row],[CUENTA]])","v":0},{"$f":"SUMIFS(Diario[VALOR],Diario[CENTRO DE COSTOS],Z$2,Diario[CREDITO],PUC_310[[#This Row],[CUENTA]])","v":0},{"$f":"+PUC_310[[#This Row],[CRE13]]-PUC_310[[#This Row],[CRE14]]","v":0},{"$f":"SUMIFS(Diario[VALOR],Diario[CENTRO DE COSTOS],AB$2,Diario[DEBITO],PUC_310[[#This Row],[CUENTA]])","v":0},{"$f":"SUMIFS(Diario[VALOR],Diario[CENTRO DE COSTOS],AC$2,Diario[CREDITO],PUC_310[[#This Row],[CUENTA]])","v":0},{"$f":"+PUC_310[[#This Row],[CRE16]]-PUC_310[[#This Row],[CRE17]]","v":0},{"$f":"SUMIFS(Diario[VALOR],Diario[CENTRO DE COSTOS],AE$2,Diario[DEBITO],PUC_310[[#This Row],[CUENTA]])","v":0},{"$f":"SUMIFS(Diario[VALOR],Diario[CENTRO DE COSTOS],AF$2,Diario[CREDITO],PUC_310[[#This Row],[CUENTA]])","v":0},{"$f":"+PUC_310[[#This Row],[CRE19]]-PUC_310[[#This Row],[CRE20]]","v":0},{"$f":"SUMIFS(Diario[VALOR],Diario[CENTRO DE COSTOS],AH$2,Diario[DEBITO],PUC_310[[#This Row],[CUENTA]])","v":0},{"$f":"SUMIFS(Diario[VALOR],Diario[CENTRO DE COSTOS],AI$2,Diario[CREDITO],PUC_310[[#This Row],[CUENTA]])","v":0},{"$f":"+PUC_310[[#This Row],[CRE22]]-PUC_310[[#This Row],[CRE23]]","v":0},{"$f":"SUMIFS(Diario[VALOR],Diario[CENTRO DE COSTOS],AK$2,Diario[DEBITO],PUC_310[[#This Row],[CUENTA]])","v":0},{"$f":"SUMIFS(Diario[VALOR],Diario[CENTRO DE COSTOS],AL$2,Diario[CREDITO],PUC_310[[#This Row],[CUENTA]])","v":0},{"$f":"+PUC_310[[#This Row],[CRE25]]-PUC_310[[#This Row],[CRE26]]","v":0},{"$f":"SUMIFS(Diario[VALOR],Diario[CENTRO DE COSTOS],AN$2,Diario[DEBITO],PUC_310[[#This Row],[CUENTA]])","v":0},{"$f":"SUMIFS(Diario[VALOR],Diario[CENTRO DE COSTOS],AO$2,Diario[CREDITO],PUC_310[[#This Row],[CUENTA]])","v":0},{"$f":"+PUC_310[[#This Row],[CRE28]]-PUC_310[[#This Row],[CRE29]]","v":0},{"$f":"SUMIFS(Diario[VALOR],Diario[CENTRO DE COSTOS],AQ$2,Diario[DEBITO],PUC_310[[#This Row],[CUENTA]])","v":0},{"$f":"SUMIFS(Diario[VALOR],Diario[CENTRO DE COSTOS],AR$2,Diario[CREDITO],PUC_310[[#This Row],[CUENTA]])","v":0},{"$f":"+PUC_310[[#This Row],[CRE31]]-PUC_310[[#This Row],[CRE32]]","v":0},{"$f":"SUMIFS(Diario[VALOR],Diario[CENTRO DE COSTOS],AT$2,Diario[DEBITO],PUC_310[[#This Row],[CUENTA]])","v":0},{"$f":"SUMIFS(Diario[VALOR],Diario[CENTRO DE COSTOS],AU$2,Diario[CREDITO],PUC_310[[#This Row],[CUENTA]])","v":0},{"$f":"+PUC_310[[#This Row],[CRE34]]-PUC_310[[#This Row],[CRE35]]","v":0},{"$f":"SUMIFS(Diario[VALOR],Diario[CENTRO DE COSTOS],AW$2,Diario[DEBITO],PUC_310[[#This Row],[CUENTA]])","v":0},{"$f":"SUMIFS(Diario[VALOR],Diario[CENTRO DE COSTOS],AX$2,Diario[CREDITO],PUC_310[[#This Row],[CUENTA]])","v":0},{"$f":"+PUC_310[[#This Row],[CRE37]]-PUC_310[[#This Row],[CRE38]]","v":0},{"$f":"SUMIFS(Diario[VALOR],Diario[CENTRO DE COSTOS],AZ$2,Diario[DEBITO],PUC_310[[#This Row],[CUENTA]])","v":0},{"$f":"SUMIFS(Diario[VALOR],Diario[CENTRO DE COSTOS],BA$2,Diario[CREDITO],PUC_310[[#This Row],[CUENTA]])","v":0},{"$f":"+PUC_310[[#This Row],[CRE40]]-PUC_310[[#This Row],[CRE41]]","v":0},{"$f":"SUMIFS(Diario[VALOR],Diario[CENTRO DE COSTOS],BC$2,Diario[DEBITO],PUC_310[[#This Row],[CUENTA]])","v":0},{"$f":"SUMIFS(Diario[VALOR],Diario[CENTRO DE COSTOS],BD$2,Diario[CREDITO],PUC_310[[#This Row],[CUENTA]])","v":0},{"$f":"+PUC_310[[#This Row],[CRE43]]-PUC_310[[#This Row],[CRE44]]","v":0},{"$f":"SUMIFS(Diario[VALOR],Diario[CENTRO DE COSTOS],BF$2,Diario[DEBITO],PUC_310[[#This Row],[CUENTA]])","v":0},{"$f":"SUMIFS(Diario[VALOR],Diario[CENTRO DE COSTOS],BG$2,Diario[CREDITO],PUC_310[[#This Row],[CUENTA]])","v":0},{"$f":"+PUC_310[[#This Row],[CRE452]]-PUC_310[[#This Row],[CRE453]]","v":0},{"$f":"SUMIF($B$3:$BH$3,$BI$3,PUC_310[[#This Row],[AUXILIAR]:[CRE4]])","v":0},{"$f":"SUMIF($B$3:$BH$3,$BJ$3,PUC_310[[#This Row],[AUXILIAR]:[CRE4]])","v":0},{"$f":"+PUC_310[[#This Row],[CRE46]]-PUC_310[[#This Row],[CRE47]]","v":0}]
[{"$f":"+'BALANCE DE PRUEBA UNITARIO'!A14","v":510554},{"$f":"+'BALANCE DE PRUEBA UNITARIO'!B14","v":510554},{"$f":"+'BALANCE DE PRUEBA UNITARIO'!C14","v":"SEGUROS "},{"$f":"SUMIFS(Diario[VALOR],Diario[CENTRO DE COSTOS],D$2,Diario[DEBITO],PUC_310[[#This Row],[CUENTA]])","v":0},{"$f":"SUMIFS(Diario[VALOR],Diario[CENTRO DE COSTOS],E$2,Diario[CREDITO],PUC_310[[#This Row],[CUENTA]])","v":0},{"$f":"+PUC_310[[#This Row],[DEB]]-PUC_310[[#This Row],[CRE]]","v":0},{"$f":"SUMIFS(Diario[VALOR],Diario[CENTRO DE COSTOS],G$2,Diario[DEBITO],PUC_310[[#This Row],[CUENTA]])","v":0},{"$f":"SUMIFS(Diario[VALOR],Diario[CENTRO DE COSTOS],H$2,Diario[CREDITO],PUC_310[[#This Row],[CUENTA]])","v":0},{"$f":"+PUC_310[[#This Row],[DEB2]]-PUC_310[[#This Row],[CRE2]]","v":0},{"$f":"SUMIFS(Diario[VALOR],Diario[CENTRO DE COSTOS],J$2,Diario[DEBITO],PUC_310[[#This Row],[CUENTA]])","v":0},{"$f":"SUMIFS(Diario[VALOR],Diario[CENTRO DE COSTOS],K$2,Diario[CREDITO],PUC_310[[#This Row],[CUENTA]])","v":0},{"$f":"+PUC_310[[#This Row],[DEB3]]-PUC_310[[#This Row],[CRE4]]","v":0},{"$f":"SUMIFS(Diario[VALOR],Diario[CENTRO DE COSTOS],M$2,Diario[DEBITO],PUC_310[[#This Row],[CUENTA]])","v":0},{"$f":"SUMIFS(Diario[VALOR],Diario[CENTRO DE COSTOS],N$2,Diario[CREDITO],PUC_310[[#This Row],[CUENTA]])","v":0},{"$f":"+PUC_310[[#This Row],[CRE52]]-PUC_310[[#This Row],[CRE53]]","v":0},{"$f":"SUMIFS(Diario[VALOR],Diario[CENTRO DE COSTOS],P$2,Diario[DEBITO],PUC_310[[#This Row],[CUENTA]])","v":0},{"$f":"SUMIFS(Diario[VALOR],Diario[CENTRO DE COSTOS],Q$2,Diario[CREDITO],PUC_310[[#This Row],[CUENTA]])","v":0},{"$f":"+PUC_310[[#This Row],[CRE55]]-PUC_310[[#This Row],[CRE56]]","v":0},{"$f":"SUMIFS(Diario[VALOR],Diario[CENTRO DE COSTOS],S$2,Diario[DEBITO],PUC_310[[#This Row],[CUENTA]])","v":0},{"$f":"SUMIFS(Diario[VALOR],Diario[CENTRO DE COSTOS],T$2,Diario[CREDITO],PUC_310[[#This Row],[CUENTA]])","v":0},{"$f":"+PUC_310[[#This Row],[CRE7]]-PUC_310[[#This Row],[CRE8]]","v":0},{"$f":"SUMIFS(Diario[VALOR],Diario[CENTRO DE COSTOS],V$2,Diario[DEBITO],PUC_310[[#This Row],[CUENTA]])","v":0},{"$f":"SUMIFS(Diario[VALOR],Diario[CENTRO DE COSTOS],W$2,Diario[CREDITO],PUC_310[[#This Row],[CUENTA]])","v":0},{"$f":"+PUC_310[[#This Row],[CRE10]]-PUC_310[[#This Row],[CRE11]]","v":0},{"$f":"SUMIFS(Diario[VALOR],Diario[CENTRO DE COSTOS],Y$2,Diario[DEBITO],PUC_310[[#This Row],[CUENTA]])","v":0},{"$f":"SUMIFS(Diario[VALOR],Diario[CENTRO DE COSTOS],Z$2,Diario[CREDITO],PUC_310[[#This Row],[CUENTA]])","v":0},{"$f":"+PUC_310[[#This Row],[CRE13]]-PUC_310[[#This Row],[CRE14]]","v":0},{"$f":"SUMIFS(Diario[VALOR],Diario[CENTRO DE COSTOS],AB$2,Diario[DEBITO],PUC_310[[#This Row],[CUENTA]])","v":0},{"$f":"SUMIFS(Diario[VALOR],Diario[CENTRO DE COSTOS],AC$2,Diario[CREDITO],PUC_310[[#This Row],[CUENTA]])","v":0},{"$f":"+PUC_310[[#This Row],[CRE16]]-PUC_310[[#This Row],[CRE17]]","v":0},{"$f":"SUMIFS(Diario[VALOR],Diario[CENTRO DE COSTOS],AE$2,Diario[DEBITO],PUC_310[[#This Row],[CUENTA]])","v":0},{"$f":"SUMIFS(Diario[VALOR],Diario[CENTRO DE COSTOS],AF$2,Diario[CREDITO],PUC_310[[#This Row],[CUENTA]])","v":0},{"$f":"+PUC_310[[#This Row],[CRE19]]-PUC_310[[#This Row],[CRE20]]","v":0},{"$f":"SUMIFS(Diario[VALOR],Diario[CENTRO DE COSTOS],AH$2,Diario[DEBITO],PUC_310[[#This Row],[CUENTA]])","v":0},{"$f":"SUMIFS(Diario[VALOR],Diario[CENTRO DE COSTOS],AI$2,Diario[CREDITO],PUC_310[[#This Row],[CUENTA]])","v":0},{"$f":"+PUC_310[[#This Row],[CRE22]]-PUC_310[[#This Row],[CRE23]]","v":0},{"$f":"SUMIFS(Diario[VALOR],Diario[CENTRO DE COSTOS],AK$2,Diario[DEBITO],PUC_310[[#This Row],[CUENTA]])","v":0},{"$f":"SUMIFS(Diario[VALOR],Diario[CENTRO DE COSTOS],AL$2,Diario[CREDITO],PUC_310[[#This Row],[CUENTA]])","v":0},{"$f":"+PUC_310[[#This Row],[CRE25]]-PUC_310[[#This Row],[CRE26]]","v":0},{"$f":"SUMIFS(Diario[VALOR],Diario[CENTRO DE COSTOS],AN$2,Diario[DEBITO],PUC_310[[#This Row],[CUENTA]])","v":0},{"$f":"SUMIFS(Diario[VALOR],Diario[CENTRO DE COSTOS],AO$2,Diario[CREDITO],PUC_310[[#This Row],[CUENTA]])","v":0},{"$f":"+PUC_310[[#This Row],[CRE28]]-PUC_310[[#This Row],[CRE29]]","v":0},{"$f":"SUMIFS(Diario[VALOR],Diario[CENTRO DE COSTOS],AQ$2,Diario[DEBITO],PUC_310[[#This Row],[CUENTA]])","v":0},{"$f":"SUMIFS(Diario[VALOR],Diario[CENTRO DE COSTOS],AR$2,Diario[CREDITO],PUC_310[[#This Row],[CUENTA]])","v":0},{"$f":"+PUC_310[[#This Row],[CRE31]]-PUC_310[[#This Row],[CRE32]]","v":0},{"$f":"SUMIFS(Diario[VALOR],Diario[CENTRO DE COSTOS],AT$2,Diario[DEBITO],PUC_310[[#This Row],[CUENTA]])","v":0},{"$f":"SUMIFS(Diario[VALOR],Diario[CENTRO DE COSTOS],AU$2,Diario[CREDITO],PUC_310[[#This Row],[CUENTA]])","v":0},{"$f":"+PUC_310[[#This Row],[CRE34]]-PUC_310[[#This Row],[CRE35]]","v":0},{"$f":"SUMIFS(Diario[VALOR],Diario[CENTRO DE COSTOS],AW$2,Diario[DEBITO],PUC_310[[#This Row],[CUENTA]])","v":0},{"$f":"SUMIFS(Diario[VALOR],Diario[CENTRO DE COSTOS],AX$2,Diario[CREDITO],PUC_310[[#This Row],[CUENTA]])","v":0},{"$f":"+PUC_310[[#This Row],[CRE37]]-PUC_310[[#This Row],[CRE38]]","v":0},{"$f":"SUMIFS(Diario[VALOR],Diario[CENTRO DE COSTOS],AZ$2,Diario[DEBITO],PUC_310[[#This Row],[CUENTA]])","v":0},{"$f":"SUMIFS(Diario[VALOR],Diario[CENTRO DE COSTOS],BA$2,Diario[CREDITO],PUC_310[[#This Row],[CUENTA]])","v":0},{"$f":"+PUC_310[[#This Row],[CRE40]]-PUC_310[[#This Row],[CRE41]]","v":0},{"$f":"SUMIFS(Diario[VALOR],Diario[CENTRO DE COSTOS],BC$2,Diario[DEBITO],PUC_310[[#This Row],[CUENTA]])","v":0},{"$f":"SUMIFS(Diario[VALOR],Diario[CENTRO DE COSTOS],BD$2,Diario[CREDITO],PUC_310[[#This Row],[CUENTA]])","v":0},{"$f":"+PUC_310[[#This Row],[CRE43]]-PUC_310[[#This Row],[CRE44]]","v":0},{"$f":"SUMIFS(Diario[VALOR],Diario[CENTRO DE COSTOS],BF$2,Diario[DEBITO],PUC_310[[#This Row],[CUENTA]])","v":0},{"$f":"SUMIFS(Diario[VALOR],Diario[CENTRO DE COSTOS],BG$2,Diario[CREDITO],PUC_310[[#This Row],[CUENTA]])","v":0},{"$f":"+PUC_310[[#This Row],[CRE452]]-PUC_310[[#This Row],[CRE453]]","v":0},{"$f":"SUMIF($B$3:$BH$3,$BI$3,PUC_310[[#This Row],[AUXILIAR]:[CRE4]])","v":0},{"$f":"SUMIF($B$3:$BH$3,$BJ$3,PUC_310[[#This Row],[AUXILIAR]:[CRE4]])","v":0},{"$f":"+PUC_310[[#This Row],[CRE46]]-PUC_310[[#This Row],[CRE47]]","v":0}]
[{"$f":"+'BALANCE DE PRUEBA UNITARIO'!A15","v":510584},{"$f":"+'BALANCE DE PRUEBA UNITARIO'!B15","v":510584},{"$f":"+'BALANCE DE PRUEBA UNITARIO'!C15","v":"GASTOS MEDICOS Y DROGAS "},{"$f":"SUMIFS(Diario[VALOR],Diario[CENTRO DE COSTOS],D$2,Diario[DEBITO],PUC_310[[#This Row],[CUENTA]])","v":0},{"$f":"SUMIFS(Diario[VALOR],Diario[CENTRO DE COSTOS],E$2,Diario[CREDITO],PUC_310[[#This Row],[CUENTA]])","v":0},{"$f":"+PUC_310[[#This Row],[DEB]]-PUC_310[[#This Row],[CRE]]","v":0},{"$f":"SUMIFS(Diario[VALOR],Diario[CENTRO DE COSTOS],G$2,Diario[DEBITO],PUC_310[[#This Row],[CUENTA]])","v":0},{"$f":"SUMIFS(Diario[VALOR],Diario[CENTRO DE COSTOS],H$2,Diario[CREDITO],PUC_310[[#This Row],[CUENTA]])","v":0},{"$f":"+PUC_310[[#This Row],[DEB2]]-PUC_310[[#This Row],[CRE2]]","v":0},{"$f":"SUMIFS(Diario[VALOR],Diario[CENTRO DE COSTOS],J$2,Diario[DEBITO],PUC_310[[#This Row],[CUENTA]])","v":0},{"$f":"SUMIFS(Diario[VALOR],Diario[CENTRO DE COSTOS],K$2,Diario[CREDITO],PUC_310[[#This Row],[CUENTA]])","v":0},{"$f":"+PUC_310[[#This Row],[DEB3]]-PUC_310[[#This Row],[CRE4]]","v":0},{"$f":"SUMIFS(Diario[VALOR],Diario[CENTRO DE COSTOS],M$2,Diario[DEBITO],PUC_310[[#This Row],[CUENTA]])","v":0},{"$f":"SUMIFS(Diario[VALOR],Diario[CENTRO DE COSTOS],N$2,Diario[CREDITO],PUC_310[[#This Row],[CUENTA]])","v":0},{"$f":"+PUC_310[[#This Row],[CRE52]]-PUC_310[[#This Row],[CRE53]]","v":0},{"$f":"SUMIFS(Diario[VALOR],Diario[CENTRO DE COSTOS],P$2,Diario[DEBITO],PUC_310[[#This Row],[CUENTA]])","v":0},{"$f":"SUMIFS(Diario[VALOR],Diario[CENTRO DE COSTOS],Q$2,Diario[CREDITO],PUC_310[[#This Row],[CUENTA]])","v":0},{"$f":"+PUC_310[[#This Row],[CRE55]]-PUC_310[[#This Row],[CRE56]]","v":0},{"$f":"SUMIFS(Diario[VALOR],Diario[CENTRO DE COSTOS],S$2,Diario[DEBITO],PUC_310[[#This Row],[CUENTA]])","v":0},{"$f":"SUMIFS(Diario[VALOR],Diario[CENTRO DE COSTOS],T$2,Diario[CREDITO],PUC_310[[#This Row],[CUENTA]])","v":0},{"$f":"+PUC_310[[#This Row],[CRE7]]-PUC_310[[#This Row],[CRE8]]","v":0},{"$f":"SUMIFS(Diario[VALOR],Diario[CENTRO DE COSTOS],V$2,Diario[DEBITO],PUC_310[[#This Row],[CUENTA]])","v":0},{"$f":"SUMIFS(Diario[VALOR],Diario[CENTRO DE COSTOS],W$2,Diario[CREDITO],PUC_310[[#This Row],[CUENTA]])","v":0},{"$f":"+PUC_310[[#This Row],[CRE10]]-PUC_310[[#This Row],[CRE11]]","v":0},{"$f":"SUMIFS(Diario[VALOR],Diario[CENTRO DE COSTOS],Y$2,Diario[DEBITO],PUC_310[[#This Row],[CUENTA]])","v":0},{"$f":"SUMIFS(Diario[VALOR],Diario[CENTRO DE COSTOS],Z$2,Diario[CREDITO],PUC_310[[#This Row],[CUENTA]])","v":0},{"$f":"+PUC_310[[#This Row],[CRE13]]-PUC_310[[#This Row],[CRE14]]","v":0},{"$f":"SUMIFS(Diario[VALOR],Diario[CENTRO DE COSTOS],AB$2,Diario[DEBITO],PUC_310[[#This Row],[CUENTA]])","v":0},{"$f":"SUMIFS(Diario[VALOR],Diario[CENTRO DE COSTOS],AC$2,Diario[CREDITO],PUC_310[[#This Row],[CUENTA]])","v":0},{"$f":"+PUC_310[[#This Row],[CRE16]]-PUC_310[[#This Row],[CRE17]]","v":0},{"$f":"SUMIFS(Diario[VALOR],Diario[CENTRO DE COSTOS],AE$2,Diario[DEBITO],PUC_310[[#This Row],[CUENTA]])","v":0},{"$f":"SUMIFS(Diario[VALOR],Diario[CENTRO DE COSTOS],AF$2,Diario[CREDITO],PUC_310[[#This Row],[CUENTA]])","v":0},{"$f":"+PUC_310[[#This Row],[CRE19]]-PUC_310[[#This Row],[CRE20]]","v":0},{"$f":"SUMIFS(Diario[VALOR],Diario[CENTRO DE COSTOS],AH$2,Diario[DEBITO],PUC_310[[#This Row],[CUENTA]])","v":0},{"$f":"SUMIFS(Diario[VALOR],Diario[CENTRO DE COSTOS],AI$2,Diario[CREDITO],PUC_310[[#This Row],[CUENTA]])","v":0},{"$f":"+PUC_310[[#This Row],[CRE22]]-PUC_310[[#This Row],[CRE23]]","v":0},{"$f":"SUMIFS(Diario[VALOR],Diario[CENTRO DE COSTOS],AK$2,Diario[DEBITO],PUC_310[[#This Row],[CUENTA]])","v":0},{"$f":"SUMIFS(Diario[VALOR],Diario[CENTRO DE COSTOS],AL$2,Diario[CREDITO],PUC_310[[#This Row],[CUENTA]])","v":0},{"$f":"+PUC_310[[#This Row],[CRE25]]-PUC_310[[#This Row],[CRE26]]","v":0},{"$f":"SUMIFS(Diario[VALOR],Diario[CENTRO DE COSTOS],AN$2,Diario[DEBITO],PUC_310[[#This Row],[CUENTA]])","v":0},{"$f":"SUMIFS(Diario[VALOR],Diario[CENTRO DE COSTOS],AO$2,Diario[CREDITO],PUC_310[[#This Row],[CUENTA]])","v":0},{"$f":"+PUC_310[[#This Row],[CRE28]]-PUC_310[[#This Row],[CRE29]]","v":0},{"$f":"SUMIFS(Diario[VALOR],Diario[CENTRO DE COSTOS],AQ$2,Diario[DEBITO],PUC_310[[#This Row],[CUENTA]])","v":0},{"$f":"SUMIFS(Diario[VALOR],Diario[CENTRO DE COSTOS],AR$2,Diario[CREDITO],PUC_310[[#This Row],[CUENTA]])","v":0},{"$f":"+PUC_310[[#This Row],[CRE31]]-PUC_310[[#This Row],[CRE32]]","v":0},{"$f":"SUMIFS(Diario[VALOR],Diario[CENTRO DE COSTOS],AT$2,Diario[DEBITO],PUC_310[[#This Row],[CUENTA]])","v":0},{"$f":"SUMIFS(Diario[VALOR],Diario[CENTRO DE COSTOS],AU$2,Diario[CREDITO],PUC_310[[#This Row],[CUENTA]])","v":0},{"$f":"+PUC_310[[#This Row],[CRE34]]-PUC_310[[#This Row],[CRE35]]","v":0},{"$f":"SUMIFS(Diario[VALOR],Diario[CENTRO DE COSTOS],AW$2,Diario[DEBITO],PUC_310[[#This Row],[CUENTA]])","v":0},{"$f":"SUMIFS(Diario[VALOR],Diario[CENTRO DE COSTOS],AX$2,Diario[CREDITO],PUC_310[[#This Row],[CUENTA]])","v":0},{"$f":"+PUC_310[[#This Row],[CRE37]]-PUC_310[[#This Row],[CRE38]]","v":0},{"$f":"SUMIFS(Diario[VALOR],Diario[CENTRO DE COSTOS],AZ$2,Diario[DEBITO],PUC_310[[#This Row],[CUENTA]])","v":0},{"$f":"SUMIFS(Diario[VALOR],Diario[CENTRO DE COSTOS],BA$2,Diario[CREDITO],PUC_310[[#This Row],[CUENTA]])","v":0},{"$f":"+PUC_310[[#This Row],[CRE40]]-PUC_310[[#This Row],[CRE41]]","v":0},{"$f":"SUMIFS(Diario[VALOR],Diario[CENTRO DE COSTOS],BC$2,Diario[DEBITO],PUC_310[[#This Row],[CUENTA]])","v":0},{"$f":"SUMIFS(Diario[VALOR],Diario[CENTRO DE COSTOS],BD$2,Diario[CREDITO],PUC_310[[#This Row],[CUENTA]])","v":0},{"$f":"+PUC_310[[#This Row],[CRE43]]-PUC_310[[#This Row],[CRE44]]","v":0},{"$f":"SUMIFS(Diario[VALOR],Diario[CENTRO DE COSTOS],BF$2,Diario[DEBITO],PUC_310[[#This Row],[CUENTA]])","v":0},{"$f":"SUMIFS(Diario[VALOR],Diario[CENTRO DE COSTOS],BG$2,Diario[CREDITO],PUC_310[[#This Row],[CUENTA]])","v":0},{"$f":"+PUC_310[[#This Row],[CRE452]]-PUC_310[[#This Row],[CRE453]]","v":0},{"$f":"SUMIF($B$3:$BH$3,$BI$3,PUC_310[[#This Row],[AUXILIAR]:[CRE4]])","v":0},{"$f":"SUMIF($B$3:$BH$3,$BJ$3,PUC_310[[#This Row],[AUXILIAR]:[CRE4]])","v":0},{"$f":"+PUC_310[[#This Row],[CRE46]]-PUC_310[[#This Row],[CRE47]]","v":0}]
[{"$f":"+'BALANCE DE PRUEBA UNITARIO'!A16","v":511035},{"$f":"+'BALANCE DE PRUEBA UNITARIO'!B16","v":511035},{"$f":"+'BALANCE DE PRUEBA UNITARIO'!C16","v":"ASESORIA TECNICA "},{"$f":"SUMIFS(Diario[VALOR],Diario[CENTRO DE COSTOS],D$2,Diario[DEBITO],PUC_310[[#This Row],[CUENTA]])","v":0},{"$f":"SUMIFS(Diario[VALOR],Diario[CENTRO DE COSTOS],E$2,Diario[CREDITO],PUC_310[[#This Row],[CUENTA]])","v":0},{"$f":"+PUC_310[[#This Row],[DEB]]-PUC_310[[#This Row],[CRE]]","v":0},{"$f":"SUMIFS(Diario[VALOR],Diario[CENTRO DE COSTOS],G$2,Diario[DEBITO],PUC_310[[#This Row],[CUENTA]])","v":0},{"$f":"SUMIFS(Diario[VALOR],Diario[CENTRO DE COSTOS],H$2,Diario[CREDITO],PUC_310[[#This Row],[CUENTA]])","v":0},{"$f":"+PUC_310[[#This Row],[DEB2]]-PUC_310[[#This Row],[CRE2]]","v":0},{"$f":"SUMIFS(Diario[VALOR],Diario[CENTRO DE COSTOS],J$2,Diario[DEBITO],PUC_310[[#This Row],[CUENTA]])","v":0},{"$f":"SUMIFS(Diario[VALOR],Diario[CENTRO DE COSTOS],K$2,Diario[CREDITO],PUC_310[[#This Row],[CUENTA]])","v":0},{"$f":"+PUC_310[[#This Row],[DEB3]]-PUC_310[[#This Row],[CRE4]]","v":0},{"$f":"SUMIFS(Diario[VALOR],Diario[CENTRO DE COSTOS],M$2,Diario[DEBITO],PUC_310[[#This Row],[CUENTA]])","v":0},{"$f":"SUMIFS(Diario[VALOR],Diario[CENTRO DE COSTOS],N$2,Diario[CREDITO],PUC_310[[#This Row],[CUENTA]])","v":0},{"$f":"+PUC_310[[#This Row],[CRE52]]-PUC_310[[#This Row],[CRE53]]","v":0},{"$f":"SUMIFS(Diario[VALOR],Diario[CENTRO DE COSTOS],P$2,Diario[DEBITO],PUC_310[[#This Row],[CUENTA]])","v":0},{"$f":"SUMIFS(Diario[VALOR],Diario[CENTRO DE COSTOS],Q$2,Diario[CREDITO],PUC_310[[#This Row],[CUENTA]])","v":0},{"$f":"+PUC_310[[#This Row],[CRE55]]-PUC_310[[#This Row],[CRE56]]","v":0},{"$f":"SUMIFS(Diario[VALOR],Diario[CENTRO DE COSTOS],S$2,Diario[DEBITO],PUC_310[[#This Row],[CUENTA]])","v":0},{"$f":"SUMIFS(Diario[VALOR],Diario[CENTRO DE COSTOS],T$2,Diario[CREDITO],PUC_310[[#This Row],[CUENTA]])","v":0},{"$f":"+PUC_310[[#This Row],[CRE7]]-PUC_310[[#This Row],[CRE8]]","v":0},{"$f":"SUMIFS(Diario[VALOR],Diario[CENTRO DE COSTOS],V$2,Diario[DEBITO],PUC_310[[#This Row],[CUENTA]])","v":0},{"$f":"SUMIFS(Diario[VALOR],Diario[CENTRO DE COSTOS],W$2,Diario[CREDITO],PUC_310[[#This Row],[CUENTA]])","v":0},{"$f":"+PUC_310[[#This Row],[CRE10]]-PUC_310[[#This Row],[CRE11]]","v":0},{"$f":"SUMIFS(Diario[VALOR],Diario[CENTRO DE COSTOS],Y$2,Diario[DEBITO],PUC_310[[#This Row],[CUENTA]])","v":0},{"$f":"SUMIFS(Diario[VALOR],Diario[CENTRO DE COSTOS],Z$2,Diario[CREDITO],PUC_310[[#This Row],[CUENTA]])","v":0},{"$f":"+PUC_310[[#This Row],[CRE13]]-PUC_310[[#This Row],[CRE14]]","v":0},{"$f":"SUMIFS(Diario[VALOR],Diario[CENTRO DE COSTOS],AB$2,Diario[DEBITO],PUC_310[[#This Row],[CUENTA]])","v":0},{"$f":"SUMIFS(Diario[VALOR],Diario[CENTRO DE COSTOS],AC$2,Diario[CREDITO],PUC_310[[#This Row],[CUENTA]])","v":0},{"$f":"+PUC_310[[#This Row],[CRE16]]-PUC_310[[#This Row],[CRE17]]","v":0},{"$f":"SUMIFS(Diario[VALOR],Diario[CENTRO DE COSTOS],AE$2,Diario[DEBITO],PUC_310[[#This Row],[CUENTA]])","v":0},{"$f":"SUMIFS(Diario[VALOR],Diario[CENTRO DE COSTOS],AF$2,Diario[CREDITO],PUC_310[[#This Row],[CUENTA]])","v":0},{"$f":"+PUC_310[[#This Row],[CRE19]]-PUC_310[[#This Row],[CRE20]]","v":0},{"$f":"SUMIFS(Diario[VALOR],Diario[CENTRO DE COSTOS],AH$2,Diario[DEBITO],PUC_310[[#This Row],[CUENTA]])","v":0},{"$f":"SUMIFS(Diario[VALOR],Diario[CENTRO DE COSTOS],AI$2,Diario[CREDITO],PUC_310[[#This Row],[CUENTA]])","v":0},{"$f":"+PUC_310[[#This Row],[CRE22]]-PUC_310[[#This Row],[CRE23]]","v":0},{"$f":"SUMIFS(Diario[VALOR],Diario[CENTRO DE COSTOS],AK$2,Diario[DEBITO],PUC_310[[#This Row],[CUENTA]])","v":0},{"$f":"SUMIFS(Diario[VALOR],Diario[CENTRO DE COSTOS],AL$2,Diario[CREDITO],PUC_310[[#This Row],[CUENTA]])","v":0},{"$f":"+PUC_310[[#This Row],[CRE25]]-PUC_310[[#This Row],[CRE26]]","v":0},{"$f":"SUMIFS(Diario[VALOR],Diario[CENTRO DE COSTOS],AN$2,Diario[DEBITO],PUC_310[[#This Row],[CUENTA]])","v":0},{"$f":"SUMIFS(Diario[VALOR],Diario[CENTRO DE COSTOS],AO$2,Diario[CREDITO],PUC_310[[#This Row],[CUENTA]])","v":0},{"$f":"+PUC_310[[#This Row],[CRE28]]-PUC_310[[#This Row],[CRE29]]","v":0},{"$f":"SUMIFS(Diario[VALOR],Diario[CENTRO DE COSTOS],AQ$2,Diario[DEBITO],PUC_310[[#This Row],[CUENTA]])","v":0},{"$f":"SUMIFS(Diario[VALOR],Diario[CENTRO DE COSTOS],AR$2,Diario[CREDITO],PUC_310[[#This Row],[CUENTA]])","v":0},{"$f":"+PUC_310[[#This Row],[CRE31]]-PUC_310[[#This Row],[CRE32]]","v":0},{"$f":"SUMIFS(Diario[VALOR],Diario[CENTRO DE COSTOS],AT$2,Diario[DEBITO],PUC_310[[#This Row],[CUENTA]])","v":0},{"$f":"SUMIFS(Diario[VALOR],Diario[CENTRO DE COSTOS],AU$2,Diario[CREDITO],PUC_310[[#This Row],[CUENTA]])","v":0},{"$f":"+PUC_310[[#This Row],[CRE34]]-PUC_310[[#This Row],[CRE35]]","v":0},{"$f":"SUMIFS(Diario[VALOR],Diario[CENTRO DE COSTOS],AW$2,Diario[DEBITO],PUC_310[[#This Row],[CUENTA]])","v":0},{"$f":"SUMIFS(Diario[VALOR],Diario[CENTRO DE COSTOS],AX$2,Diario[CREDITO],PUC_310[[#This Row],[CUENTA]])","v":0},{"$f":"+PUC_310[[#This Row],[CRE37]]-PUC_310[[#This Row],[CRE38]]","v":0},{"$f":"SUMIFS(Diario[VALOR],Diario[CENTRO DE COSTOS],AZ$2,Diario[DEBITO],PUC_310[[#This Row],[CUENTA]])","v":0},{"$f":"SUMIFS(Diario[VALOR],Diario[CENTRO DE COSTOS],BA$2,Diario[CREDITO],PUC_310[[#This Row],[CUENTA]])","v":0},{"$f":"+PUC_310[[#This Row],[CRE40]]-PUC_310[[#This Row],[CRE41]]","v":0},{"$f":"SUMIFS(Diario[VALOR],Diario[CENTRO DE COSTOS],BC$2,Diario[DEBITO],PUC_310[[#This Row],[CUENTA]])","v":0},{"$f":"SUMIFS(Diario[VALOR],Diario[CENTRO DE COSTOS],BD$2,Diario[CREDITO],PUC_310[[#This Row],[CUENTA]])","v":0},{"$f":"+PUC_310[[#This Row],[CRE43]]-PUC_310[[#This Row],[CRE44]]","v":0},{"$f":"SUMIFS(Diario[VALOR],Diario[CENTRO DE COSTOS],BF$2,Diario[DEBITO],PUC_310[[#This Row],[CUENTA]])","v":0},{"$f":"SUMIFS(Diario[VALOR],Diario[CENTRO DE COSTOS],BG$2,Diario[CREDITO],PUC_310[[#This Row],[CUENTA]])","v":0},{"$f":"+PUC_310[[#This Row],[CRE452]]-PUC_310[[#This Row],[CRE453]]","v":0},{"$f":"SUMIF($B$3:$BH$3,$BI$3,PUC_310[[#This Row],[AUXILIAR]:[CRE4]])","v":0},{"$f":"SUMIF($B$3:$BH$3,$BJ$3,PUC_310[[#This Row],[AUXILIAR]:[CRE4]])","v":0},{"$f":"+PUC_310[[#This Row],[CRE46]]-PUC_310[[#This Row],[CRE47]]","v":0}]
[{"$f":"+'BALANCE DE PRUEBA UNITARIO'!A17","v":512080},{"$f":"+'BALANCE DE PRUEBA UNITARIO'!B17","v":512080},{"$f":"+'BALANCE DE PRUEBA UNITARIO'!C17","v":"VIATICOS"},{"$f":"SUMIFS(Diario[VALOR],Diario[CENTRO DE COSTOS],D$2,Diario[DEBITO],PUC_310[[#This Row],[CUENTA]])","v":0},{"$f":"SUMIFS(Diario[VALOR],Diario[CENTRO DE COSTOS],E$2,Diario[CREDITO],PUC_310[[#This Row],[CUENTA]])","v":0},{"$f":"+PUC_310[[#This Row],[DEB]]-PUC_310[[#This Row],[CRE]]","v":0},{"$f":"SUMIFS(Diario[VALOR],Diario[CENTRO DE COSTOS],G$2,Diario[DEBITO],PUC_310[[#This Row],[CUENTA]])","v":0},{"$f":"SUMIFS(Diario[VALOR],Diario[CENTRO DE COSTOS],H$2,Diario[CREDITO],PUC_310[[#This Row],[CUENTA]])","v":0},{"$f":"+PUC_310[[#This Row],[DEB2]]-PUC_310[[#This Row],[CRE2]]","v":0},{"$f":"SUMIFS(Diario[VALOR],Diario[CENTRO DE COSTOS],J$2,Diario[DEBITO],PUC_310[[#This Row],[CUENTA]])","v":0},{"$f":"SUMIFS(Diario[VALOR],Diario[CENTRO DE COSTOS],K$2,Diario[CREDITO],PUC_310[[#This Row],[CUENTA]])","v":0},{"$f":"+PUC_310[[#This Row],[DEB3]]-PUC_310[[#This Row],[CRE4]]","v":0},{"$f":"SUMIFS(Diario[VALOR],Diario[CENTRO DE COSTOS],M$2,Diario[DEBITO],PUC_310[[#This Row],[CUENTA]])","v":0},{"$f":"SUMIFS(Diario[VALOR],Diario[CENTRO DE COSTOS],N$2,Diario[CREDITO],PUC_310[[#This Row],[CUENTA]])","v":0},{"$f":"+PUC_310[[#This Row],[CRE52]]-PUC_310[[#This Row],[CRE53]]","v":0},{"$f":"SUMIFS(Diario[VALOR],Diario[CENTRO DE COSTOS],P$2,Diario[DEBITO],PUC_310[[#This Row],[CUENTA]])","v":0},{"$f":"SUMIFS(Diario[VALOR],Diario[CENTRO DE COSTOS],Q$2,Diario[CREDITO],PUC_310[[#This Row],[CUENTA]])","v":0},{"$f":"+PUC_310[[#This Row],[CRE55]]-PUC_310[[#This Row],[CRE56]]","v":0},{"$f":"SUMIFS(Diario[VALOR],Diario[CENTRO DE COSTOS],S$2,Diario[DEBITO],PUC_310[[#This Row],[CUENTA]])","v":0},{"$f":"SUMIFS(Diario[VALOR],Diario[CENTRO DE COSTOS],T$2,Diario[CREDITO],PUC_310[[#This Row],[CUENTA]])","v":0},{"$f":"+PUC_310[[#This Row],[CRE7]]-PUC_310[[#This Row],[CRE8]]","v":0},{"$f":"SUMIFS(Diario[VALOR],Diario[CENTRO DE COSTOS],V$2,Diario[DEBITO],PUC_310[[#This Row],[CUENTA]])","v":0},{"$f":"SUMIFS(Diario[VALOR],Diario[CENTRO DE COSTOS],W$2,Diario[CREDITO],PUC_310[[#This Row],[CUENTA]])","v":0},{"$f":"+PUC_310[[#This Row],[CRE10]]-PUC_310[[#This Row],[CRE11]]","v":0},{"$f":"SUMIFS(Diario[VALOR],Diario[CENTRO DE COSTOS],Y$2,Diario[DEBITO],PUC_310[[#This Row],[CUENTA]])","v":0},{"$f":"SUMIFS(Diario[VALOR],Diario[CENTRO DE COSTOS],Z$2,Diario[CREDITO],PUC_310[[#This Row],[CUENTA]])","v":0},{"$f":"+PUC_310[[#This Row],[CRE13]]-PUC_310[[#This Row],[CRE14]]","v":0},{"$f":"SUMIFS(Diario[VALOR],Diario[CENTRO DE COSTOS],AB$2,Diario[DEBITO],PUC_310[[#This Row],[CUENTA]])","v":0},{"$f":"SUMIFS(Diario[VALOR],Diario[CENTRO DE COSTOS],AC$2,Diario[CREDITO],PUC_310[[#This Row],[CUENTA]])","v":0},{"$f":"+PUC_310[[#This Row],[CRE16]]-PUC_310[[#This Row],[CRE17]]","v":0},{"$f":"SUMIFS(Diario[VALOR],Diario[CENTRO DE COSTOS],AE$2,Diario[DEBITO],PUC_310[[#This Row],[CUENTA]])","v":0},{"$f":"SUMIFS(Diario[VALOR],Diario[CENTRO DE COSTOS],AF$2,Diario[CREDITO],PUC_310[[#This Row],[CUENTA]])","v":0},{"$f":"+PUC_310[[#This Row],[CRE19]]-PUC_310[[#This Row],[CRE20]]","v":0},{"$f":"SUMIFS(Diario[VALOR],Diario[CENTRO DE COSTOS],AH$2,Diario[DEBITO],PUC_310[[#This Row],[CUENTA]])","v":0},{"$f":"SUMIFS(Diario[VALOR],Diario[CENTRO DE COSTOS],AI$2,Diario[CREDITO],PUC_310[[#This Row],[CUENTA]])","v":0},{"$f":"+PUC_310[[#This Row],[CRE22]]-PUC_310[[#This Row],[CRE23]]","v":0},{"$f":"SUMIFS(Diario[VALOR],Diario[CENTRO DE COSTOS],AK$2,Diario[DEBITO],PUC_310[[#This Row],[CUENTA]])","v":0},{"$f":"SUMIFS(Diario[VALOR],Diario[CENTRO DE COSTOS],AL$2,Diario[CREDITO],PUC_310[[#This Row],[CUENTA]])","v":0},{"$f":"+PUC_310[[#This Row],[CRE25]]-PUC_310[[#This Row],[CRE26]]","v":0},{"$f":"SUMIFS(Diario[VALOR],Diario[CENTRO DE COSTOS],AN$2,Diario[DEBITO],PUC_310[[#This Row],[CUENTA]])","v":0},{"$f":"SUMIFS(Diario[VALOR],Diario[CENTRO DE COSTOS],AO$2,Diario[CREDITO],PUC_310[[#This Row],[CUENTA]])","v":0},{"$f":"+PUC_310[[#This Row],[CRE28]]-PUC_310[[#This Row],[CRE29]]","v":0},{"$f":"SUMIFS(Diario[VALOR],Diario[CENTRO DE COSTOS],AQ$2,Diario[DEBITO],PUC_310[[#This Row],[CUENTA]])","v":0},{"$f":"SUMIFS(Diario[VALOR],Diario[CENTRO DE COSTOS],AR$2,Diario[CREDITO],PUC_310[[#This Row],[CUENTA]])","v":0},{"$f":"+PUC_310[[#This Row],[CRE31]]-PUC_310[[#This Row],[CRE32]]","v":0},{"$f":"SUMIFS(Diario[VALOR],Diario[CENTRO DE COSTOS],AT$2,Diario[DEBITO],PUC_310[[#This Row],[CUENTA]])","v":0},{"$f":"SUMIFS(Diario[VALOR],Diario[CENTRO DE COSTOS],AU$2,Diario[CREDITO],PUC_310[[#This Row],[CUENTA]])","v":0},{"$f":"+PUC_310[[#This Row],[CRE34]]-PUC_310[[#This Row],[CRE35]]","v":0},{"$f":"SUMIFS(Diario[VALOR],Diario[CENTRO DE COSTOS],AW$2,Diario[DEBITO],PUC_310[[#This Row],[CUENTA]])","v":0},{"$f":"SUMIFS(Diario[VALOR],Diario[CENTRO DE COSTOS],AX$2,Diario[CREDITO],PUC_310[[#This Row],[CUENTA]])","v":0},{"$f":"+PUC_310[[#This Row],[CRE37]]-PUC_310[[#This Row],[CRE38]]","v":0},{"$f":"SUMIFS(Diario[VALOR],Diario[CENTRO DE COSTOS],AZ$2,Diario[DEBITO],PUC_310[[#This Row],[CUENTA]])","v":0},{"$f":"SUMIFS(Diario[VALOR],Diario[CENTRO DE COSTOS],BA$2,Diario[CREDITO],PUC_310[[#This Row],[CUENTA]])","v":0},{"$f":"+PUC_310[[#This Row],[CRE40]]-PUC_310[[#This Row],[CRE41]]","v":0},{"$f":"SUMIFS(Diario[VALOR],Diario[CENTRO DE COSTOS],BC$2,Diario[DEBITO],PUC_310[[#This Row],[CUENTA]])","v":0},{"$f":"SUMIFS(Diario[VALOR],Diario[CENTRO DE COSTOS],BD$2,Diario[CREDITO],PUC_310[[#This Row],[CUENTA]])","v":0},{"$f":"+PUC_310[[#This Row],[CRE43]]-PUC_310[[#This Row],[CRE44]]","v":0},{"$f":"SUMIFS(Diario[VALOR],Diario[CENTRO DE COSTOS],BF$2,Diario[DEBITO],PUC_310[[#This Row],[CUENTA]])","v":0},{"$f":"SUMIFS(Diario[VALOR],Diario[CENTRO DE COSTOS],BG$2,Diario[CREDITO],PUC_310[[#This Row],[CUENTA]])","v":0},{"$f":"+PUC_310[[#This Row],[CRE452]]-PUC_310[[#This Row],[CRE453]]","v":0},{"$f":"SUMIF($B$3:$BH$3,$BI$3,PUC_310[[#This Row],[AUXILIAR]:[CRE4]])","v":0},{"$f":"SUMIF($B$3:$BH$3,$BJ$3,PUC_310[[#This Row],[AUXILIAR]:[CRE4]])","v":0},{"$f":"+PUC_310[[#This Row],[CRE46]]-PUC_310[[#This Row],[CRE47]]","v":0}]
[{"$f":"+'BALANCE DE PRUEBA UNITARIO'!A18","v":513015},{"$f":"+'BALANCE DE PRUEBA UNITARIO'!B18","v":513015},{"$f":"+'BALANCE DE PRUEBA UNITARIO'!C18","v":"AVALUOS"},{"$f":"SUMIFS(Diario[VALOR],Diario[CENTRO DE COSTOS],D$2,Diario[DEBITO],PUC_310[[#This Row],[CUENTA]])","v":0},{"$f":"SUMIFS(Diario[VALOR],Diario[CENTRO DE COSTOS],E$2,Diario[CREDITO],PUC_310[[#This Row],[CUENTA]])","v":0},{"$f":"+PUC_310[[#This Row],[DEB]]-PUC_310[[#This Row],[CRE]]","v":0},{"$f":"SUMIFS(Diario[VALOR],Diario[CENTRO DE COSTOS],G$2,Diario[DEBITO],PUC_310[[#This Row],[CUENTA]])","v":0},{"$f":"SUMIFS(Diario[VALOR],Diario[CENTRO DE COSTOS],H$2,Diario[CREDITO],PUC_310[[#This Row],[CUENTA]])","v":0},{"$f":"+PUC_310[[#This Row],[DEB2]]-PUC_310[[#This Row],[CRE2]]","v":0},{"$f":"SUMIFS(Diario[VALOR],Diario[CENTRO DE COSTOS],J$2,Diario[DEBITO],PUC_310[[#This Row],[CUENTA]])","v":0},{"$f":"SUMIFS(Diario[VALOR],Diario[CENTRO DE COSTOS],K$2,Diario[CREDITO],PUC_310[[#This Row],[CUENTA]])","v":0},{"$f":"+PUC_310[[#This Row],[DEB3]]-PUC_310[[#This Row],[CRE4]]","v":0},{"$f":"SUMIFS(Diario[VALOR],Diario[CENTRO DE COSTOS],M$2,Diario[DEBITO],PUC_310[[#This Row],[CUENTA]])","v":0},{"$f":"SUMIFS(Diario[VALOR],Diario[CENTRO DE COSTOS],N$2,Diario[CREDITO],PUC_310[[#This Row],[CUENTA]])","v":0},{"$f":"+PUC_310[[#This Row],[CRE52]]-PUC_310[[#This Row],[CRE53]]","v":0},{"$f":"SUMIFS(Diario[VALOR],Diario[CENTRO DE COSTOS],P$2,Diario[DEBITO],PUC_310[[#This Row],[CUENTA]])","v":0},{"$f":"SUMIFS(Diario[VALOR],Diario[CENTRO DE COSTOS],Q$2,Diario[CREDITO],PUC_310[[#This Row],[CUENTA]])","v":0},{"$f":"+PUC_310[[#This Row],[CRE55]]-PUC_310[[#This Row],[CRE56]]","v":0},{"$f":"SUMIFS(Diario[VALOR],Diario[CENTRO DE COSTOS],S$2,Diario[DEBITO],PUC_310[[#This Row],[CUENTA]])","v":0},{"$f":"SUMIFS(Diario[VALOR],Diario[CENTRO DE COSTOS],T$2,Diario[CREDITO],PUC_310[[#This Row],[CUENTA]])","v":0},{"$f":"+PUC_310[[#This Row],[CRE7]]-PUC_310[[#This Row],[CRE8]]","v":0},{"$f":"SUMIFS(Diario[VALOR],Diario[CENTRO DE COSTOS],V$2,Diario[DEBITO],PUC_310[[#This Row],[CUENTA]])","v":0},{"$f":"SUMIFS(Diario[VALOR],Diario[CENTRO DE COSTOS],W$2,Diario[CREDITO],PUC_310[[#This Row],[CUENTA]])","v":0},{"$f":"+PUC_310[[#This Row],[CRE10]]-PUC_310[[#This Row],[CRE11]]","v":0},{"$f":"SUMIFS(Diario[VALOR],Diario[CENTRO DE COSTOS],Y$2,Diario[DEBITO],PUC_310[[#This Row],[CUENTA]])","v":0},{"$f":"SUMIFS(Diario[VALOR],Diario[CENTRO DE COSTOS],Z$2,Diario[CREDITO],PUC_310[[#This Row],[CUENTA]])","v":0},{"$f":"+PUC_310[[#This Row],[CRE13]]-PUC_310[[#This Row],[CRE14]]","v":0},{"$f":"SUMIFS(Diario[VALOR],Diario[CENTRO DE COSTOS],AB$2,Diario[DEBITO],PUC_310[[#This Row],[CUENTA]])","v":0},{"$f":"SUMIFS(Diario[VALOR],Diario[CENTRO DE COSTOS],AC$2,Diario[CREDITO],PUC_310[[#This Row],[CUENTA]])","v":0},{"$f":"+PUC_310[[#This Row],[CRE16]]-PUC_310[[#This Row],[CRE17]]","v":0},{"$f":"SUMIFS(Diario[VALOR],Diario[CENTRO DE COSTOS],AE$2,Diario[DEBITO],PUC_310[[#This Row],[CUENTA]])","v":0},{"$f":"SUMIFS(Diario[VALOR],Diario[CENTRO DE COSTOS],AF$2,Diario[CREDITO],PUC_310[[#This Row],[CUENTA]])","v":0},{"$f":"+PUC_310[[#This Row],[CRE19]]-PUC_310[[#This Row],[CRE20]]","v":0},{"$f":"SUMIFS(Diario[VALOR],Diario[CENTRO DE COSTOS],AH$2,Diario[DEBITO],PUC_310[[#This Row],[CUENTA]])","v":0},{"$f":"SUMIFS(Diario[VALOR],Diario[CENTRO DE COSTOS],AI$2,Diario[CREDITO],PUC_310[[#This Row],[CUENTA]])","v":0},{"$f":"+PUC_310[[#This Row],[CRE22]]-PUC_310[[#This Row],[CRE23]]","v":0},{"$f":"SUMIFS(Diario[VALOR],Diario[CENTRO DE COSTOS],AK$2,Diario[DEBITO],PUC_310[[#This Row],[CUENTA]])","v":0},{"$f":"SUMIFS(Diario[VALOR],Diario[CENTRO DE COSTOS],AL$2,Diario[CREDITO],PUC_310[[#This Row],[CUENTA]])","v":0},{"$f":"+PUC_310[[#This Row],[CRE25]]-PUC_310[[#This Row],[CRE26]]","v":0},{"$f":"SUMIFS(Diario[VALOR],Diario[CENTRO DE COSTOS],AN$2,Diario[DEBITO],PUC_310[[#This Row],[CUENTA]])","v":0},{"$f":"SUMIFS(Diario[VALOR],Diario[CENTRO DE COSTOS],AO$2,Diario[CREDITO],PUC_310[[#This Row],[CUENTA]])","v":0},{"$f":"+PUC_310[[#This Row],[CRE28]]-PUC_310[[#This Row],[CRE29]]","v":0},{"$f":"SUMIFS(Diario[VALOR],Diario[CENTRO DE COSTOS],AQ$2,Diario[DEBITO],PUC_310[[#This Row],[CUENTA]])","v":0},{"$f":"SUMIFS(Diario[VALOR],Diario[CENTRO DE COSTOS],AR$2,Diario[CREDITO],PUC_310[[#This Row],[CUENTA]])","v":0},{"$f":"+PUC_310[[#This Row],[CRE31]]-PUC_310[[#This Row],[CRE32]]","v":0},{"$f":"SUMIFS(Diario[VALOR],Diario[CENTRO DE COSTOS],AT$2,Diario[DEBITO],PUC_310[[#This Row],[CUENTA]])","v":0},{"$f":"SUMIFS(Diario[VALOR],Diario[CENTRO DE COSTOS],AU$2,Diario[CREDITO],PUC_310[[#This Row],[CUENTA]])","v":0},{"$f":"+PUC_310[[#This Row],[CRE34]]-PUC_310[[#This Row],[CRE35]]","v":0},{"$f":"SUMIFS(Diario[VALOR],Diario[CENTRO DE COSTOS],AW$2,Diario[DEBITO],PUC_310[[#This Row],[CUENTA]])","v":0},{"$f":"SUMIFS(Diario[VALOR],Diario[CENTRO DE COSTOS],AX$2,Diario[CREDITO],PUC_310[[#This Row],[CUENTA]])","v":0},{"$f":"+PUC_310[[#This Row],[CRE37]]-PUC_310[[#This Row],[CRE38]]","v":0},{"$f":"SUMIFS(Diario[VALOR],Diario[CENTRO DE COSTOS],AZ$2,Diario[DEBITO],PUC_310[[#This Row],[CUENTA]])","v":0},{"$f":"SUMIFS(Diario[VALOR],Diario[CENTRO DE COSTOS],BA$2,Diario[CREDITO],PUC_310[[#This Row],[CUENTA]])","v":0},{"$f":"+PUC_310[[#This Row],[CRE40]]-PUC_310[[#This Row],[CRE41]]","v":0},{"$f":"SUMIFS(Diario[VALOR],Diario[CENTRO DE COSTOS],BC$2,Diario[DEBITO],PUC_310[[#This Row],[CUENTA]])","v":0},{"$f":"SUMIFS(Diario[VALOR],Diario[CENTRO DE COSTOS],BD$2,Diario[CREDITO],PUC_310[[#This Row],[CUENTA]])","v":0},{"$f":"+PUC_310[[#This Row],[CRE43]]-PUC_310[[#This Row],[CRE44]]","v":0},{"$f":"SUMIFS(Diario[VALOR],Diario[CENTRO DE COSTOS],BF$2,Diario[DEBITO],PUC_310[[#This Row],[CUENTA]])","v":0},{"$f":"SUMIFS(Diario[VALOR],Diario[CENTRO DE COSTOS],BG$2,Diario[CREDITO],PUC_310[[#This Row],[CUENTA]])","v":0},{"$f":"+PUC_310[[#This Row],[CRE452]]-PUC_310[[#This Row],[CRE453]]","v":0},{"$f":"SUMIF($B$3:$BH$3,$BI$3,PUC_310[[#This Row],[AUXILIAR]:[CRE4]])","v":0},{"$f":"SUMIF($B$3:$BH$3,$BJ$3,PUC_310[[#This Row],[AUXILIAR]:[CRE4]])","v":0},{"$f":"+PUC_310[[#This Row],[CRE46]]-PUC_310[[#This Row],[CRE47]]","v":0}]
[{"$f":"+'BALANCE DE PRUEBA UNITARIO'!A19","v":513595},{"$f":"+'BALANCE DE PRUEBA UNITARIO'!B19","v":513595},{"$f":"+'BALANCE DE PRUEBA UNITARIO'!C19","v":"IMPLEMENTACION SSGT"},{"$f":"SUMIFS(Diario[VALOR],Diario[CENTRO DE COSTOS],D$2,Diario[DEBITO],PUC_310[[#This Row],[CUENTA]])","v":0},{"$f":"SUMIFS(Diario[VALOR],Diario[CENTRO DE COSTOS],E$2,Diario[CREDITO],PUC_310[[#This Row],[CUENTA]])","v":0},{"$f":"+PUC_310[[#This Row],[DEB]]-PUC_310[[#This Row],[CRE]]","v":0},{"$f":"SUMIFS(Diario[VALOR],Diario[CENTRO DE COSTOS],G$2,Diario[DEBITO],PUC_310[[#This Row],[CUENTA]])","v":0},{"$f":"SUMIFS(Diario[VALOR],Diario[CENTRO DE COSTOS],H$2,Diario[CREDITO],PUC_310[[#This Row],[CUENTA]])","v":0},{"$f":"+PUC_310[[#This Row],[DEB2]]-PUC_310[[#This Row],[CRE2]]","v":0},{"$f":"SUMIFS(Diario[VALOR],Diario[CENTRO DE COSTOS],J$2,Diario[DEBITO],PUC_310[[#This Row],[CUENTA]])","v":0},{"$f":"SUMIFS(Diario[VALOR],Diario[CENTRO DE COSTOS],K$2,Diario[CREDITO],PUC_310[[#This Row],[CUENTA]])","v":0},{"$f":"+PUC_310[[#This Row],[DEB3]]-PUC_310[[#This Row],[CRE4]]","v":0},{"$f":"SUMIFS(Diario[VALOR],Diario[CENTRO DE COSTOS],M$2,Diario[DEBITO],PUC_310[[#This Row],[CUENTA]])","v":0},{"$f":"SUMIFS(Diario[VALOR],Diario[CENTRO DE COSTOS],N$2,Diario[CREDITO],PUC_310[[#This Row],[CUENTA]])","v":0},{"$f":"+PUC_310[[#This Row],[CRE52]]-PUC_310[[#This Row],[CRE53]]","v":0},{"$f":"SUMIFS(Diario[VALOR],Diario[CENTRO DE COSTOS],P$2,Diario[DEBITO],PUC_310[[#This Row],[CUENTA]])","v":0},{"$f":"SUMIFS(Diario[VALOR],Diario[CENTRO DE COSTOS],Q$2,Diario[CREDITO],PUC_310[[#This Row],[CUENTA]])","v":0},{"$f":"+PUC_310[[#This Row],[CRE55]]-PUC_310[[#This Row],[CRE56]]","v":0},{"$f":"SUMIFS(Diario[VALOR],Diario[CENTRO DE COSTOS],S$2,Diario[DEBITO],PUC_310[[#This Row],[CUENTA]])","v":0},{"$f":"SUMIFS(Diario[VALOR],Diario[CENTRO DE COSTOS],T$2,Diario[CREDITO],PUC_310[[#This Row],[CUENTA]])","v":0},{"$f":"+PUC_310[[#This Row],[CRE7]]-PUC_310[[#This Row],[CRE8]]","v":0},{"$f":"SUMIFS(Diario[VALOR],Diario[CENTRO DE COSTOS],V$2,Diario[DEBITO],PUC_310[[#This Row],[CUENTA]])","v":0},{"$f":"SUMIFS(Diario[VALOR],Diario[CENTRO DE COSTOS],W$2,Diario[CREDITO],PUC_310[[#This Row],[CUENTA]])","v":0},{"$f":"+PUC_310[[#This Row],[CRE10]]-PUC_310[[#This Row],[CRE11]]","v":0},{"$f":"SUMIFS(Diario[VALOR],Diario[CENTRO DE COSTOS],Y$2,Diario[DEBITO],PUC_310[[#This Row],[CUENTA]])","v":0},{"$f":"SUMIFS(Diario[VALOR],Diario[CENTRO DE COSTOS],Z$2,Diario[CREDITO],PUC_310[[#This Row],[CUENTA]])","v":0},{"$f":"+PUC_310[[#This Row],[CRE13]]-PUC_310[[#This Row],[CRE14]]","v":0},{"$f":"SUMIFS(Diario[VALOR],Diario[CENTRO DE COSTOS],AB$2,Diario[DEBITO],PUC_310[[#This Row],[CUENTA]])","v":0},{"$f":"SUMIFS(Diario[VALOR],Diario[CENTRO DE COSTOS],AC$2,Diario[CREDITO],PUC_310[[#This Row],[CUENTA]])","v":0},{"$f":"+PUC_310[[#This Row],[CRE16]]-PUC_310[[#This Row],[CRE17]]","v":0},{"$f":"SUMIFS(Diario[VALOR],Diario[CENTRO DE COSTOS],AE$2,Diario[DEBITO],PUC_310[[#This Row],[CUENTA]])","v":0},{"$f":"SUMIFS(Diario[VALOR],Diario[CENTRO DE COSTOS],AF$2,Diario[CREDITO],PUC_310[[#This Row],[CUENTA]])","v":0},{"$f":"+PUC_310[[#This Row],[CRE19]]-PUC_310[[#This Row],[CRE20]]","v":0},{"$f":"SUMIFS(Diario[VALOR],Diario[CENTRO DE COSTOS],AH$2,Diario[DEBITO],PUC_310[[#This Row],[CUENTA]])","v":0},{"$f":"SUMIFS(Diario[VALOR],Diario[CENTRO DE COSTOS],AI$2,Diario[CREDITO],PUC_310[[#This Row],[CUENTA]])","v":0},{"$f":"+PUC_310[[#This Row],[CRE22]]-PUC_310[[#This Row],[CRE23]]","v":0},{"$f":"SUMIFS(Diario[VALOR],Diario[CENTRO DE COSTOS],AK$2,Diario[DEBITO],PUC_310[[#This Row],[CUENTA]])","v":0},{"$f":"SUMIFS(Diario[VALOR],Diario[CENTRO DE COSTOS],AL$2,Diario[CREDITO],PUC_310[[#This Row],[CUENTA]])","v":0},{"$f":"+PUC_310[[#This Row],[CRE25]]-PUC_310[[#This Row],[CRE26]]","v":0},{"$f":"SUMIFS(Diario[VALOR],Diario[CENTRO DE COSTOS],AN$2,Diario[DEBITO],PUC_310[[#This Row],[CUENTA]])","v":0},{"$f":"SUMIFS(Diario[VALOR],Diario[CENTRO DE COSTOS],AO$2,Diario[CREDITO],PUC_310[[#This Row],[CUENTA]])","v":0},{"$f":"+PUC_310[[#This Row],[CRE28]]-PUC_310[[#This Row],[CRE29]]","v":0},{"$f":"SUMIFS(Diario[VALOR],Diario[CENTRO DE COSTOS],AQ$2,Diario[DEBITO],PUC_310[[#This Row],[CUENTA]])","v":0},{"$f":"SUMIFS(Diario[VALOR],Diario[CENTRO DE COSTOS],AR$2,Diario[CREDITO],PUC_310[[#This Row],[CUENTA]])","v":0},{"$f":"+PUC_310[[#This Row],[CRE31]]-PUC_310[[#This Row],[CRE32]]","v":0},{"$f":"SUMIFS(Diario[VALOR],Diario[CENTRO DE COSTOS],AT$2,Diario[DEBITO],PUC_310[[#This Row],[CUENTA]])","v":0},{"$f":"SUMIFS(Diario[VALOR],Diario[CENTRO DE COSTOS],AU$2,Diario[CREDITO],PUC_310[[#This Row],[CUENTA]])","v":0},{"$f":"+PUC_310[[#This Row],[CRE34]]-PUC_310[[#This Row],[CRE35]]","v":0},{"$f":"SUMIFS(Diario[VALOR],Diario[CENTRO DE COSTOS],AW$2,Diario[DEBITO],PUC_310[[#This Row],[CUENTA]])","v":0},{"$f":"SUMIFS(Diario[VALOR],Diario[CENTRO DE COSTOS],AX$2,Diario[CREDITO],PUC_310[[#This Row],[CUENTA]])","v":0},{"$f":"+PUC_310[[#This Row],[CRE37]]-PUC_310[[#This Row],[CRE38]]","v":0},{"$f":"SUMIFS(Diario[VALOR],Diario[CENTRO DE COSTOS],AZ$2,Diario[DEBITO],PUC_310[[#This Row],[CUENTA]])","v":0},{"$f":"SUMIFS(Diario[VALOR],Diario[CENTRO DE COSTOS],BA$2,Diario[CREDITO],PUC_310[[#This Row],[CUENTA]])","v":0},{"$f":"+PUC_310[[#This Row],[CRE40]]-PUC_310[[#This Row],[CRE41]]","v":0},{"$f":"SUMIFS(Diario[VALOR],Diario[CENTRO DE COSTOS],BC$2,Diario[DEBITO],PUC_310[[#This Row],[CUENTA]])","v":0},{"$f":"SUMIFS(Diario[VALOR],Diario[CENTRO DE COSTOS],BD$2,Diario[CREDITO],PUC_310[[#This Row],[CUENTA]])","v":0},{"$f":"+PUC_310[[#This Row],[CRE43]]-PUC_310[[#This Row],[CRE44]]","v":0},{"$f":"SUMIFS(Diario[VALOR],Diario[CENTRO DE COSTOS],BF$2,Diario[DEBITO],PUC_310[[#This Row],[CUENTA]])","v":0},{"$f":"SUMIFS(Diario[VALOR],Diario[CENTRO DE COSTOS],BG$2,Diario[CREDITO],PUC_310[[#This Row],[CUENTA]])","v":0},{"$f":"+PUC_310[[#This Row],[CRE452]]-PUC_310[[#This Row],[CRE453]]","v":0},{"$f":"SUMIF($B$3:$BH$3,$BI$3,PUC_310[[#This Row],[AUXILIAR]:[CRE4]])","v":0},{"$f":"SUMIF($B$3:$BH$3,$BJ$3,PUC_310[[#This Row],[AUXILIAR]:[CRE4]])","v":0},{"$f":"+PUC_310[[#This Row],[CRE46]]-PUC_310[[#This Row],[CRE47]]","v":0}]
[{"$f":"+'BALANCE DE PRUEBA UNITARIO'!A20","v":514515},{"$f":"+'BALANCE DE PRUEBA UNITARIO'!B20","v":514515},{"$f":"+'BALANCE DE PRUEBA UNITARIO'!C20","v":"MANTENIMIENTO MAQUINARIA Y EQUIPO "},{"$f":"SUMIFS(Diario[VALOR],Diario[CENTRO DE COSTOS],D$2,Diario[DEBITO],PUC_310[[#This Row],[CUENTA]])","v":0},{"$f":"SUMIFS(Diario[VALOR],Diario[CENTRO DE COSTOS],E$2,Diario[CREDITO],PUC_310[[#This Row],[CUENTA]])","v":0},{"$f":"+PUC_310[[#This Row],[DEB]]-PUC_310[[#This Row],[CRE]]","v":0},{"$f":"SUMIFS(Diario[VALOR],Diario[CENTRO DE COSTOS],G$2,Diario[DEBITO],PUC_310[[#This Row],[CUENTA]])","v":0},{"$f":"SUMIFS(Diario[VALOR],Diario[CENTRO DE COSTOS],H$2,Diario[CREDITO],PUC_310[[#This Row],[CUENTA]])","v":0},{"$f":"+PUC_310[[#This Row],[DEB2]]-PUC_310[[#This Row],[CRE2]]","v":0},{"$f":"SUMIFS(Diario[VALOR],Diario[CENTRO DE COSTOS],J$2,Diario[DEBITO],PUC_310[[#This Row],[CUENTA]])","v":0},{"$f":"SUMIFS(Diario[VALOR],Diario[CENTRO DE COSTOS],K$2,Diario[CREDITO],PUC_310[[#This Row],[CUENTA]])","v":0},{"$f":"+PUC_310[[#This Row],[DEB3]]-PUC_310[[#This Row],[CRE4]]","v":0},{"$f":"SUMIFS(Diario[VALOR],Diario[CENTRO DE COSTOS],M$2,Diario[DEBITO],PUC_310[[#This Row],[CUENTA]])","v":0},{"$f":"SUMIFS(Diario[VALOR],Diario[CENTRO DE COSTOS],N$2,Diario[CREDITO],PUC_310[[#This Row],[CUENTA]])","v":0},{"$f":"+PUC_310[[#This Row],[CRE52]]-PUC_310[[#This Row],[CRE53]]","v":0},{"$f":"SUMIFS(Diario[VALOR],Diario[CENTRO DE COSTOS],P$2,Diario[DEBITO],PUC_310[[#This Row],[CUENTA]])","v":0},{"$f":"SUMIFS(Diario[VALOR],Diario[CENTRO DE COSTOS],Q$2,Diario[CREDITO],PUC_310[[#This Row],[CUENTA]])","v":0},{"$f":"+PUC_310[[#This Row],[CRE55]]-PUC_310[[#This Row],[CRE56]]","v":0},{"$f":"SUMIFS(Diario[VALOR],Diario[CENTRO DE COSTOS],S$2,Diario[DEBITO],PUC_310[[#This Row],[CUENTA]])","v":0},{"$f":"SUMIFS(Diario[VALOR],Diario[CENTRO DE COSTOS],T$2,Diario[CREDITO],PUC_310[[#This Row],[CUENTA]])","v":0},{"$f":"+PUC_310[[#This Row],[CRE7]]-PUC_310[[#This Row],[CRE8]]","v":0},{"$f":"SUMIFS(Diario[VALOR],Diario[CENTRO DE COSTOS],V$2,Diario[DEBITO],PUC_310[[#This Row],[CUENTA]])","v":0},{"$f":"SUMIFS(Diario[VALOR],Diario[CENTRO DE COSTOS],W$2,Diario[CREDITO],PUC_310[[#This Row],[CUENTA]])","v":0},{"$f":"+PUC_310[[#This Row],[CRE10]]-PUC_310[[#This Row],[CRE11]]","v":0},{"$f":"SUMIFS(Diario[VALOR],Diario[CENTRO DE COSTOS],Y$2,Diario[DEBITO],PUC_310[[#This Row],[CUENTA]])","v":0},{"$f":"SUMIFS(Diario[VALOR],Diario[CENTRO DE COSTOS],Z$2,Diario[CREDITO],PUC_310[[#This Row],[CUENTA]])","v":0},{"$f":"+PUC_310[[#This Row],[CRE13]]-PUC_310[[#This Row],[CRE14]]","v":0},{"$f":"SUMIFS(Diario[VALOR],Diario[CENTRO DE COSTOS],AB$2,Diario[DEBITO],PUC_310[[#This Row],[CUENTA]])","v":0},{"$f":"SUMIFS(Diario[VALOR],Diario[CENTRO DE COSTOS],AC$2,Diario[CREDITO],PUC_310[[#This Row],[CUENTA]])","v":0},{"$f":"+PUC_310[[#This Row],[CRE16]]-PUC_310[[#This Row],[CRE17]]","v":0},{"$f":"SUMIFS(Diario[VALOR],Diario[CENTRO DE COSTOS],AE$2,Diario[DEBITO],PUC_310[[#This Row],[CUENTA]])","v":0},{"$f":"SUMIFS(Diario[VALOR],Diario[CENTRO DE COSTOS],AF$2,Diario[CREDITO],PUC_310[[#This Row],[CUENTA]])","v":0},{"$f":"+PUC_310[[#This Row],[CRE19]]-PUC_310[[#This Row],[CRE20]]","v":0},{"$f":"SUMIFS(Diario[VALOR],Diario[CENTRO DE COSTOS],AH$2,Diario[DEBITO],PUC_310[[#This Row],[CUENTA]])","v":0},{"$f":"SUMIFS(Diario[VALOR],Diario[CENTRO DE COSTOS],AI$2,Diario[CREDITO],PUC_310[[#This Row],[CUENTA]])","v":0},{"$f":"+PUC_310[[#This Row],[CRE22]]-PUC_310[[#This Row],[CRE23]]","v":0},{"$f":"SUMIFS(Diario[VALOR],Diario[CENTRO DE COSTOS],AK$2,Diario[DEBITO],PUC_310[[#This Row],[CUENTA]])","v":0},{"$f":"SUMIFS(Diario[VALOR],Diario[CENTRO DE COSTOS],AL$2,Diario[CREDITO],PUC_310[[#This Row],[CUENTA]])","v":0},{"$f":"+PUC_310[[#This Row],[CRE25]]-PUC_310[[#This Row],[CRE26]]","v":0},{"$f":"SUMIFS(Diario[VALOR],Diario[CENTRO DE COSTOS],AN$2,Diario[DEBITO],PUC_310[[#This Row],[CUENTA]])","v":0},{"$f":"SUMIFS(Diario[VALOR],Diario[CENTRO DE COSTOS],AO$2,Diario[CREDITO],PUC_310[[#This Row],[CUENTA]])","v":0},{"$f":"+PUC_310[[#This Row],[CRE28]]-PUC_310[[#This Row],[CRE29]]","v":0},{"$f":"SUMIFS(Diario[VALOR],Diario[CENTRO DE COSTOS],AQ$2,Diario[DEBITO],PUC_310[[#This Row],[CUENTA]])","v":0},{"$f":"SUMIFS(Diario[VALOR],Diario[CENTRO DE COSTOS],AR$2,Diario[CREDITO],PUC_310[[#This Row],[CUENTA]])","v":0},{"$f":"+PUC_310[[#This Row],[CRE31]]-PUC_310[[#This Row],[CRE32]]","v":0},{"$f":"SUMIFS(Diario[VALOR],Diario[CENTRO DE COSTOS],AT$2,Diario[DEBITO],PUC_310[[#This Row],[CUENTA]])","v":0},{"$f":"SUMIFS(Diario[VALOR],Diario[CENTRO DE COSTOS],AU$2,Diario[CREDITO],PUC_310[[#This Row],[CUENTA]])","v":0},{"$f":"+PUC_310[[#This Row],[CRE34]]-PUC_310[[#This Row],[CRE35]]","v":0},{"$f":"SUMIFS(Diario[VALOR],Diario[CENTRO DE COSTOS],AW$2,Diario[DEBITO],PUC_310[[#This Row],[CUENTA]])","v":0},{"$f":"SUMIFS(Diario[VALOR],Diario[CENTRO DE COSTOS],AX$2,Diario[CREDITO],PUC_310[[#This Row],[CUENTA]])","v":0},{"$f":"+PUC_310[[#This Row],[CRE37]]-PUC_310[[#This Row],[CRE38]]","v":0},{"$f":"SUMIFS(Diario[VALOR],Diario[CENTRO DE COSTOS],AZ$2,Diario[DEBITO],PUC_310[[#This Row],[CUENTA]])","v":0},{"$f":"SUMIFS(Diario[VALOR],Diario[CENTRO DE COSTOS],BA$2,Diario[CREDITO],PUC_310[[#This Row],[CUENTA]])","v":0},{"$f":"+PUC_310[[#This Row],[CRE40]]-PUC_310[[#This Row],[CRE41]]","v":0},{"$f":"SUMIFS(Diario[VALOR],Diario[CENTRO DE COSTOS],BC$2,Diario[DEBITO],PUC_310[[#This Row],[CUENTA]])","v":0},{"$f":"SUMIFS(Diario[VALOR],Diario[CENTRO DE COSTOS],BD$2,Diario[CREDITO],PUC_310[[#This Row],[CUENTA]])","v":0},{"$f":"+PUC_310[[#This Row],[CRE43]]-PUC_310[[#This Row],[CRE44]]","v":0},{"$f":"SUMIFS(Diario[VALOR],Diario[CENTRO DE COSTOS],BF$2,Diario[DEBITO],PUC_310[[#This Row],[CUENTA]])","v":0},{"$f":"SUMIFS(Diario[VALOR],Diario[CENTRO DE COSTOS],BG$2,Diario[CREDITO],PUC_310[[#This Row],[CUENTA]])","v":0},{"$f":"+PUC_310[[#This Row],[CRE452]]-PUC_310[[#This Row],[CRE453]]","v":0},{"$f":"SUMIF($B$3:$BH$3,$BI$3,PUC_310[[#This Row],[AUXILIAR]:[CRE4]])","v":0},{"$f":"SUMIF($B$3:$BH$3,$BJ$3,PUC_310[[#This Row],[AUXILIAR]:[CRE4]])","v":0},{"$f":"+PUC_310[[#This Row],[CRE46]]-PUC_310[[#This Row],[CRE47]]","v":0}]
[{"$f":"+'BALANCE DE PRUEBA UNITARIO'!A21","v":519005},{"$f":"+'BALANCE DE PRUEBA UNITARIO'!B21","v":519005},{"$f":"+'BALANCE DE PRUEBA UNITARIO'!C21","v":"SERVICIOS DE ASEO Y VIGILANCIA"},{"$f":"SUMIFS(Diario[VALOR],Diario[CENTRO DE COSTOS],D$2,Diario[DEBITO],PUC_310[[#This Row],[CUENTA]])","v":0},{"$f":"SUMIFS(Diario[VALOR],Diario[CENTRO DE COSTOS],E$2,Diario[CREDITO],PUC_310[[#This Row],[CUENTA]])","v":0},{"$f":"+PUC_310[[#This Row],[DEB]]-PUC_310[[#This Row],[CRE]]","v":0},{"$f":"SUMIFS(Diario[VALOR],Diario[CENTRO DE COSTOS],G$2,Diario[DEBITO],PUC_310[[#This Row],[CUENTA]])","v":0},{"$f":"SUMIFS(Diario[VALOR],Diario[CENTRO DE COSTOS],H$2,Diario[CREDITO],PUC_310[[#This Row],[CUENTA]])","v":0},{"$f":"+PUC_310[[#This Row],[DEB2]]-PUC_310[[#This Row],[CRE2]]","v":0},{"$f":"SUMIFS(Diario[VALOR],Diario[CENTRO DE COSTOS],J$2,Diario[DEBITO],PUC_310[[#This Row],[CUENTA]])","v":0},{"$f":"SUMIFS(Diario[VALOR],Diario[CENTRO DE COSTOS],K$2,Diario[CREDITO],PUC_310[[#This Row],[CUENTA]])","v":0},{"$f":"+PUC_310[[#This Row],[DEB3]]-PUC_310[[#This Row],[CRE4]]","v":0},{"$f":"SUMIFS(Diario[VALOR],Diario[CENTRO DE COSTOS],M$2,Diario[DEBITO],PUC_310[[#This Row],[CUENTA]])","v":0},{"$f":"SUMIFS(Diario[VALOR],Diario[CENTRO DE COSTOS],N$2,Diario[CREDITO],PUC_310[[#This Row],[CUENTA]])","v":0},{"$f":"+PUC_310[[#This Row],[CRE52]]-PUC_310[[#This Row],[CRE53]]","v":0},{"$f":"SUMIFS(Diario[VALOR],Diario[CENTRO DE COSTOS],P$2,Diario[DEBITO],PUC_310[[#This Row],[CUENTA]])","v":0},{"$f":"SUMIFS(Diario[VALOR],Diario[CENTRO DE COSTOS],Q$2,Diario[CREDITO],PUC_310[[#This Row],[CUENTA]])","v":0},{"$f":"+PUC_310[[#This Row],[CRE55]]-PUC_310[[#This Row],[CRE56]]","v":0},{"$f":"SUMIFS(Diario[VALOR],Diario[CENTRO DE COSTOS],S$2,Diario[DEBITO],PUC_310[[#This Row],[CUENTA]])","v":0},{"$f":"SUMIFS(Diario[VALOR],Diario[CENTRO DE COSTOS],T$2,Diario[CREDITO],PUC_310[[#This Row],[CUENTA]])","v":0},{"$f":"+PUC_310[[#This Row],[CRE7]]-PUC_310[[#This Row],[CRE8]]","v":0},{"$f":"SUMIFS(Diario[VALOR],Diario[CENTRO DE COSTOS],V$2,Diario[DEBITO],PUC_310[[#This Row],[CUENTA]])","v":0},{"$f":"SUMIFS(Diario[VALOR],Diario[CENTRO DE COSTOS],W$2,Diario[CREDITO],PUC_310[[#This Row],[CUENTA]])","v":0},{"$f":"+PUC_310[[#This Row],[CRE10]]-PUC_310[[#This Row],[CRE11]]","v":0},{"$f":"SUMIFS(Diario[VALOR],Diario[CENTRO DE COSTOS],Y$2,Diario[DEBITO],PUC_310[[#This Row],[CUENTA]])","v":0},{"$f":"SUMIFS(Diario[VALOR],Diario[CENTRO DE COSTOS],Z$2,Diario[CREDITO],PUC_310[[#This Row],[CUENTA]])","v":0},{"$f":"+PUC_310[[#This Row],[CRE13]]-PUC_310[[#This Row],[CRE14]]","v":0},{"$f":"SUMIFS(Diario[VALOR],Diario[CENTRO DE COSTOS],AB$2,Diario[DEBITO],PUC_310[[#This Row],[CUENTA]])","v":0},{"$f":"SUMIFS(Diario[VALOR],Diario[CENTRO DE COSTOS],AC$2,Diario[CREDITO],PUC_310[[#This Row],[CUENTA]])","v":0},{"$f":"+PUC_310[[#This Row],[CRE16]]-PUC_310[[#This Row],[CRE17]]","v":0},{"$f":"SUMIFS(Diario[VALOR],Diario[CENTRO DE COSTOS],AE$2,Diario[DEBITO],PUC_310[[#This Row],[CUENTA]])","v":0},{"$f":"SUMIFS(Diario[VALOR],Diario[CENTRO DE COSTOS],AF$2,Diario[CREDITO],PUC_310[[#This Row],[CUENTA]])","v":0},{"$f":"+PUC_310[[#This Row],[CRE19]]-PUC_310[[#This Row],[CRE20]]","v":0},{"$f":"SUMIFS(Diario[VALOR],Diario[CENTRO DE COSTOS],AH$2,Diario[DEBITO],PUC_310[[#This Row],[CUENTA]])","v":0},{"$f":"SUMIFS(Diario[VALOR],Diario[CENTRO DE COSTOS],AI$2,Diario[CREDITO],PUC_310[[#This Row],[CUENTA]])","v":0},{"$f":"+PUC_310[[#This Row],[CRE22]]-PUC_310[[#This Row],[CRE23]]","v":0},{"$f":"SUMIFS(Diario[VALOR],Diario[CENTRO DE COSTOS],AK$2,Diario[DEBITO],PUC_310[[#This Row],[CUENTA]])","v":0},{"$f":"SUMIFS(Diario[VALOR],Diario[CENTRO DE COSTOS],AL$2,Diario[CREDITO],PUC_310[[#This Row],[CUENTA]])","v":0},{"$f":"+PUC_310[[#This Row],[CRE25]]-PUC_310[[#This Row],[CRE26]]","v":0},{"$f":"SUMIFS(Diario[VALOR],Diario[CENTRO DE COSTOS],AN$2,Diario[DEBITO],PUC_310[[#This Row],[CUENTA]])","v":0},{"$f":"SUMIFS(Diario[VALOR],Diario[CENTRO DE COSTOS],AO$2,Diario[CREDITO],PUC_310[[#This Row],[CUENTA]])","v":0},{"$f":"+PUC_310[[#This Row],[CRE28]]-PUC_310[[#This Row],[CRE29]]","v":0},{"$f":"SUMIFS(Diario[VALOR],Diario[CENTRO DE COSTOS],AQ$2,Diario[DEBITO],PUC_310[[#This Row],[CUENTA]])","v":0},{"$f":"SUMIFS(Diario[VALOR],Diario[CENTRO DE COSTOS],AR$2,Diario[CREDITO],PUC_310[[#This Row],[CUENTA]])","v":0},{"$f":"+PUC_310[[#This Row],[CRE31]]-PUC_310[[#This Row],[CRE32]]","v":0},{"$f":"SUMIFS(Diario[VALOR],Diario[CENTRO DE COSTOS],AT$2,Diario[DEBITO],PUC_310[[#This Row],[CUENTA]])","v":0},{"$f":"SUMIFS(Diario[VALOR],Diario[CENTRO DE COSTOS],AU$2,Diario[CREDITO],PUC_310[[#This Row],[CUENTA]])","v":0},{"$f":"+PUC_310[[#This Row],[CRE34]]-PUC_310[[#This Row],[CRE35]]","v":0},{"$f":"SUMIFS(Diario[VALOR],Diario[CENTRO DE COSTOS],AW$2,Diario[DEBITO],PUC_310[[#This Row],[CUENTA]])","v":0},{"$f":"SUMIFS(Diario[VALOR],Diario[CENTRO DE COSTOS],AX$2,Diario[CREDITO],PUC_310[[#This Row],[CUENTA]])","v":0},{"$f":"+PUC_310[[#This Row],[CRE37]]-PUC_310[[#This Row],[CRE38]]","v":0},{"$f":"SUMIFS(Diario[VALOR],Diario[CENTRO DE COSTOS],AZ$2,Diario[DEBITO],PUC_310[[#This Row],[CUENTA]])","v":0},{"$f":"SUMIFS(Diario[VALOR],Diario[CENTRO DE COSTOS],BA$2,Diario[CREDITO],PUC_310[[#This Row],[CUENTA]])","v":0},{"$f":"+PUC_310[[#This Row],[CRE40]]-PUC_310[[#This Row],[CRE41]]","v":0},{"$f":"SUMIFS(Diario[VALOR],Diario[CENTRO DE COSTOS],BC$2,Diario[DEBITO],PUC_310[[#This Row],[CUENTA]])","v":0},{"$f":"SUMIFS(Diario[VALOR],Diario[CENTRO DE COSTOS],BD$2,Diario[CREDITO],PUC_310[[#This Row],[CUENTA]])","v":0},{"$f":"+PUC_310[[#This Row],[CRE43]]-PUC_310[[#This Row],[CRE44]]","v":0},{"$f":"SUMIFS(Diario[VALOR],Diario[CENTRO DE COSTOS],BF$2,Diario[DEBITO],PUC_310[[#This Row],[CUENTA]])","v":0},{"$f":"SUMIFS(Diario[VALOR],Diario[CENTRO DE COSTOS],BG$2,Diario[CREDITO],PUC_310[[#This Row],[CUENTA]])","v":0},{"$f":"+PUC_310[[#This Row],[CRE452]]-PUC_310[[#This Row],[CRE453]]","v":0},{"$f":"SUMIF($B$3:$BH$3,$BI$3,PUC_310[[#This Row],[AUXILIAR]:[CRE4]])","v":0},{"$f":"SUMIF($B$3:$BH$3,$BJ$3,PUC_310[[#This Row],[AUXILIAR]:[CRE4]])","v":0},{"$f":"+PUC_310[[#This Row],[CRE46]]-PUC_310[[#This Row],[CRE47]]","v":0}]
[{"$f":"+'BALANCE DE PRUEBA UNITARIO'!A22","v":519040},{"$f":"+'BALANCE DE PRUEBA UNITARIO'!B22","v":519040},{"$f":"+'BALANCE DE PRUEBA UNITARIO'!C22","v":"TRANSPORTE"},{"$f":"SUMIFS(Diario[VALOR],Diario[CENTRO DE COSTOS],D$2,Diario[DEBITO],PUC_310[[#This Row],[CUENTA]])","v":0},{"$f":"SUMIFS(Diario[VALOR],Diario[CENTRO DE COSTOS],E$2,Diario[CREDITO],PUC_310[[#This Row],[CUENTA]])","v":0},{"$f":"+PUC_310[[#This Row],[DEB]]-PUC_310[[#This Row],[CRE]]","v":0},{"$f":"SUMIFS(Diario[VALOR],Diario[CENTRO DE COSTOS],G$2,Diario[DEBITO],PUC_310[[#This Row],[CUENTA]])","v":0},{"$f":"SUMIFS(Diario[VALOR],Diario[CENTRO DE COSTOS],H$2,Diario[CREDITO],PUC_310[[#This Row],[CUENTA]])","v":0},{"$f":"+PUC_310[[#This Row],[DEB2]]-PUC_310[[#This Row],[CRE2]]","v":0},{"$f":"SUMIFS(Diario[VALOR],Diario[CENTRO DE COSTOS],J$2,Diario[DEBITO],PUC_310[[#This Row],[CUENTA]])","v":0},{"$f":"SUMIFS(Diario[VALOR],Diario[CENTRO DE COSTOS],K$2,Diario[CREDITO],PUC_310[[#This Row],[CUENTA]])","v":0},{"$f":"+PUC_310[[#This Row],[DEB3]]-PUC_310[[#This Row],[CRE4]]","v":0},{"$f":"SUMIFS(Diario[VALOR],Diario[CENTRO DE COSTOS],M$2,Diario[DEBITO],PUC_310[[#This Row],[CUENTA]])","v":0},{"$f":"SUMIFS(Diario[VALOR],Diario[CENTRO DE COSTOS],N$2,Diario[CREDITO],PUC_310[[#This Row],[CUENTA]])","v":0},{"$f":"+PUC_310[[#This Row],[CRE52]]-PUC_310[[#This Row],[CRE53]]","v":0},{"$f":"SUMIFS(Diario[VALOR],Diario[CENTRO DE COSTOS],P$2,Diario[DEBITO],PUC_310[[#This Row],[CUENTA]])","v":0},{"$f":"SUMIFS(Diario[VALOR],Diario[CENTRO DE COSTOS],Q$2,Diario[CREDITO],PUC_310[[#This Row],[CUENTA]])","v":0},{"$f":"+PUC_310[[#This Row],[CRE55]]-PUC_310[[#This Row],[CRE56]]","v":0},{"$f":"SUMIFS(Diario[VALOR],Diario[CENTRO DE COSTOS],S$2,Diario[DEBITO],PUC_310[[#This Row],[CUENTA]])","v":0},{"$f":"SUMIFS(Diario[VALOR],Diario[CENTRO DE COSTOS],T$2,Diario[CREDITO],PUC_310[[#This Row],[CUENTA]])","v":0},{"$f":"+PUC_310[[#This Row],[CRE7]]-PUC_310[[#This Row],[CRE8]]","v":0},{"$f":"SUMIFS(Diario[VALOR],Diario[CENTRO DE COSTOS],V$2,Diario[DEBITO],PUC_310[[#This Row],[CUENTA]])","v":0},{"$f":"SUMIFS(Diario[VALOR],Diario[CENTRO DE COSTOS],W$2,Diario[CREDITO],PUC_310[[#This Row],[CUENTA]])","v":0},{"$f":"+PUC_310[[#This Row],[CRE10]]-PUC_310[[#This Row],[CRE11]]","v":0},{"$f":"SUMIFS(Diario[VALOR],Diario[CENTRO DE COSTOS],Y$2,Diario[DEBITO],PUC_310[[#This Row],[CUENTA]])","v":0},{"$f":"SUMIFS(Diario[VALOR],Diario[CENTRO DE COSTOS],Z$2,Diario[CREDITO],PUC_310[[#This Row],[CUENTA]])","v":0},{"$f":"+PUC_310[[#This Row],[CRE13]]-PUC_310[[#This Row],[CRE14]]","v":0},{"$f":"SUMIFS(Diario[VALOR],Diario[CENTRO DE COSTOS],AB$2,Diario[DEBITO],PUC_310[[#This Row],[CUENTA]])","v":0},{"$f":"SUMIFS(Diario[VALOR],Diario[CENTRO DE COSTOS],AC$2,Diario[CREDITO],PUC_310[[#This Row],[CUENTA]])","v":0},{"$f":"+PUC_310[[#This Row],[CRE16]]-PUC_310[[#This Row],[CRE17]]","v":0},{"$f":"SUMIFS(Diario[VALOR],Diario[CENTRO DE COSTOS],AE$2,Diario[DEBITO],PUC_310[[#This Row],[CUENTA]])","v":0},{"$f":"SUMIFS(Diario[VALOR],Diario[CENTRO DE COSTOS],AF$2,Diario[CREDITO],PUC_310[[#This Row],[CUENTA]])","v":0},{"$f":"+PUC_310[[#This Row],[CRE19]]-PUC_310[[#This Row],[CRE20]]","v":0},{"$f":"SUMIFS(Diario[VALOR],Diario[CENTRO DE COSTOS],AH$2,Diario[DEBITO],PUC_310[[#This Row],[CUENTA]])","v":0},{"$f":"SUMIFS(Diario[VALOR],Diario[CENTRO DE COSTOS],AI$2,Diario[CREDITO],PUC_310[[#This Row],[CUENTA]])","v":0},{"$f":"+PUC_310[[#This Row],[CRE22]]-PUC_310[[#This Row],[CRE23]]","v":0},{"$f":"SUMIFS(Diario[VALOR],Diario[CENTRO DE COSTOS],AK$2,Diario[DEBITO],PUC_310[[#This Row],[CUENTA]])","v":0},{"$f":"SUMIFS(Diario[VALOR],Diario[CENTRO DE COSTOS],AL$2,Diario[CREDITO],PUC_310[[#This Row],[CUENTA]])","v":0},{"$f":"+PUC_310[[#This Row],[CRE25]]-PUC_310[[#This Row],[CRE26]]","v":0},{"$f":"SUMIFS(Diario[VALOR],Diario[CENTRO DE COSTOS],AN$2,Diario[DEBITO],PUC_310[[#This Row],[CUENTA]])","v":0},{"$f":"SUMIFS(Diario[VALOR],Diario[CENTRO DE COSTOS],AO$2,Diario[CREDITO],PUC_310[[#This Row],[CUENTA]])","v":0},{"$f":"+PUC_310[[#This Row],[CRE28]]-PUC_310[[#This Row],[CRE29]]","v":0},{"$f":"SUMIFS(Diario[VALOR],Diario[CENTRO DE COSTOS],AQ$2,Diario[DEBITO],PUC_310[[#This Row],[CUENTA]])","v":0},{"$f":"SUMIFS(Diario[VALOR],Diario[CENTRO DE COSTOS],AR$2,Diario[CREDITO],PUC_310[[#This Row],[CUENTA]])","v":0},{"$f":"+PUC_310[[#This Row],[CRE31]]-PUC_310[[#This Row],[CRE32]]","v":0},{"$f":"SUMIFS(Diario[VALOR],Diario[CENTRO DE COSTOS],AT$2,Diario[DEBITO],PUC_310[[#This Row],[CUENTA]])","v":0},{"$f":"SUMIFS(Diario[VALOR],Diario[CENTRO DE COSTOS],AU$2,Diario[CREDITO],PUC_310[[#This Row],[CUENTA]])","v":0},{"$f":"+PUC_310[[#This Row],[CRE34]]-PUC_310[[#This Row],[CRE35]]","v":0},{"$f":"SUMIFS(Diario[VALOR],Diario[CENTRO DE COSTOS],AW$2,Diario[DEBITO],PUC_310[[#This Row],[CUENTA]])","v":0},{"$f":"SUMIFS(Diario[VALOR],Diario[CENTRO DE COSTOS],AX$2,Diario[CREDITO],PUC_310[[#This Row],[CUENTA]])","v":0},{"$f":"+PUC_310[[#This Row],[CRE37]]-PUC_310[[#This Row],[CRE38]]","v":0},{"$f":"SUMIFS(Diario[VALOR],Diario[CENTRO DE COSTOS],AZ$2,Diario[DEBITO],PUC_310[[#This Row],[CUENTA]])","v":0},{"$f":"SUMIFS(Diario[VALOR],Diario[CENTRO DE COSTOS],BA$2,Diario[CREDITO],PUC_310[[#This Row],[CUENTA]])","v":0},{"$f":"+PUC_310[[#This Row],[CRE40]]-PUC_310[[#This Row],[CRE41]]","v":0},{"$f":"SUMIFS(Diario[VALOR],Diario[CENTRO DE COSTOS],BC$2,Diario[DEBITO],PUC_310[[#This Row],[CUENTA]])","v":0},{"$f":"SUMIFS(Diario[VALOR],Diario[CENTRO DE COSTOS],BD$2,Diario[CREDITO],PUC_310[[#This Row],[CUENTA]])","v":0},{"$f":"+PUC_310[[#This Row],[CRE43]]-PUC_310[[#This Row],[CRE44]]","v":0},{"$f":"SUMIFS(Diario[VALOR],Diario[CENTRO DE COSTOS],BF$2,Diario[DEBITO],PUC_310[[#This Row],[CUENTA]])","v":0},{"$f":"SUMIFS(Diario[VALOR],Diario[CENTRO DE COSTOS],BG$2,Diario[CREDITO],PUC_310[[#This Row],[CUENTA]])","v":0},{"$f":"+PUC_310[[#This Row],[CRE452]]-PUC_310[[#This Row],[CRE453]]","v":0},{"$f":"SUMIF($B$3:$BH$3,$BI$3,PUC_310[[#This Row],[AUXILIAR]:[CRE4]])","v":0},{"$f":"SUMIF($B$3:$BH$3,$BJ$3,PUC_310[[#This Row],[AUXILIAR]:[CRE4]])","v":0},{"$f":"+PUC_310[[#This Row],[CRE46]]-PUC_310[[#This Row],[CRE47]]","v":0}]
[{"$f":"+'BALANCE DE PRUEBA UNITARIO'!A23","v":519505},{"$f":"+'BALANCE DE PRUEBA UNITARIO'!B23","v":519505},{"$f":"+'BALANCE DE PRUEBA UNITARIO'!C23","v":"COMISIONES "},{"$f":"SUMIFS(Diario[VALOR],Diario[CENTRO DE COSTOS],D$2,Diario[DEBITO],PUC_310[[#This Row],[CUENTA]])","v":0},{"$f":"SUMIFS(Diario[VALOR],Diario[CENTRO DE COSTOS],E$2,Diario[CREDITO],PUC_310[[#This Row],[CUENTA]])","v":0},{"$f":"+PUC_310[[#This Row],[DEB]]-PUC_310[[#This Row],[CRE]]","v":0},{"$f":"SUMIFS(Diario[VALOR],Diario[CENTRO DE COSTOS],G$2,Diario[DEBITO],PUC_310[[#This Row],[CUENTA]])","v":0},{"$f":"SUMIFS(Diario[VALOR],Diario[CENTRO DE COSTOS],H$2,Diario[CREDITO],PUC_310[[#This Row],[CUENTA]])","v":0},{"$f":"+PUC_310[[#This Row],[DEB2]]-PUC_310[[#This Row],[CRE2]]","v":0},{"$f":"SUMIFS(Diario[VALOR],Diario[CENTRO DE COSTOS],J$2,Diario[DEBITO],PUC_310[[#This Row],[CUENTA]])","v":0},{"$f":"SUMIFS(Diario[VALOR],Diario[CENTRO DE COSTOS],K$2,Diario[CREDITO],PUC_310[[#This Row],[CUENTA]])","v":0},{"$f":"+PUC_310[[#This Row],[DEB3]]-PUC_310[[#This Row],[CRE4]]","v":0},{"$f":"SUMIFS(Diario[VALOR],Diario[CENTRO DE COSTOS],M$2,Diario[DEBITO],PUC_310[[#This Row],[CUENTA]])","v":0},{"$f":"SUMIFS(Diario[VALOR],Diario[CENTRO DE COSTOS],N$2,Diario[CREDITO],PUC_310[[#This Row],[CUENTA]])","v":0},{"$f":"+PUC_310[[#This Row],[CRE52]]-PUC_310[[#This Row],[CRE53]]","v":0},{"$f":"SUMIFS(Diario[VALOR],Diario[CENTRO DE COSTOS],P$2,Diario[DEBITO],PUC_310[[#This Row],[CUENTA]])","v":0},{"$f":"SUMIFS(Diario[VALOR],Diario[CENTRO DE COSTOS],Q$2,Diario[CREDITO],PUC_310[[#This Row],[CUENTA]])","v":0},{"$f":"+PUC_310[[#This Row],[CRE55]]-PUC_310[[#This Row],[CRE56]]","v":0},{"$f":"SUMIFS(Diario[VALOR],Diario[CENTRO DE COSTOS],S$2,Diario[DEBITO],PUC_310[[#This Row],[CUENTA]])","v":0},{"$f":"SUMIFS(Diario[VALOR],Diario[CENTRO DE COSTOS],T$2,Diario[CREDITO],PUC_310[[#This Row],[CUENTA]])","v":0},{"$f":"+PUC_310[[#This Row],[CRE7]]-PUC_310[[#This Row],[CRE8]]","v":0},{"$f":"SUMIFS(Diario[VALOR],Diario[CENTRO DE COSTOS],V$2,Diario[DEBITO],PUC_310[[#This Row],[CUENTA]])","v":0},{"$f":"SUMIFS(Diario[VALOR],Diario[CENTRO DE COSTOS],W$2,Diario[CREDITO],PUC_310[[#This Row],[CUENTA]])","v":0},{"$f":"+PUC_310[[#This Row],[CRE10]]-PUC_310[[#This Row],[CRE11]]","v":0},{"$f":"SUMIFS(Diario[VALOR],Diario[CENTRO DE COSTOS],Y$2,Diario[DEBITO],PUC_310[[#This Row],[CUENTA]])","v":0},{"$f":"SUMIFS(Diario[VALOR],Diario[CENTRO DE COSTOS],Z$2,Diario[CREDITO],PUC_310[[#This Row],[CUENTA]])","v":0},{"$f":"+PUC_310[[#This Row],[CRE13]]-PUC_310[[#This Row],[CRE14]]","v":0},{"$f":"SUMIFS(Diario[VALOR],Diario[CENTRO DE COSTOS],AB$2,Diario[DEBITO],PUC_310[[#This Row],[CUENTA]])","v":0},{"$f":"SUMIFS(Diario[VALOR],Diario[CENTRO DE COSTOS],AC$2,Diario[CREDITO],PUC_310[[#This Row],[CUENTA]])","v":0},{"$f":"+PUC_310[[#This Row],[CRE16]]-PUC_310[[#This Row],[CRE17]]","v":0},{"$f":"SUMIFS(Diario[VALOR],Diario[CENTRO DE COSTOS],AE$2,Diario[DEBITO],PUC_310[[#This Row],[CUENTA]])","v":0},{"$f":"SUMIFS(Diario[VALOR],Diario[CENTRO DE COSTOS],AF$2,Diario[CREDITO],PUC_310[[#This Row],[CUENTA]])","v":0},{"$f":"+PUC_310[[#This Row],[CRE19]]-PUC_310[[#This Row],[CRE20]]","v":0},{"$f":"SUMIFS(Diario[VALOR],Diario[CENTRO DE COSTOS],AH$2,Diario[DEBITO],PUC_310[[#This Row],[CUENTA]])","v":0},{"$f":"SUMIFS(Diario[VALOR],Diario[CENTRO DE COSTOS],AI$2,Diario[CREDITO],PUC_310[[#This Row],[CUENTA]])","v":0},{"$f":"+PUC_310[[#This Row],[CRE22]]-PUC_310[[#This Row],[CRE23]]","v":0},{"$f":"SUMIFS(Diario[VALOR],Diario[CENTRO DE COSTOS],AK$2,Diario[DEBITO],PUC_310[[#This Row],[CUENTA]])","v":0},{"$f":"SUMIFS(Diario[VALOR],Diario[CENTRO DE COSTOS],AL$2,Diario[CREDITO],PUC_310[[#This Row],[CUENTA]])","v":0},{"$f":"+PUC_310[[#This Row],[CRE25]]-PUC_310[[#This Row],[CRE26]]","v":0},{"$f":"SUMIFS(Diario[VALOR],Diario[CENTRO DE COSTOS],AN$2,Diario[DEBITO],PUC_310[[#This Row],[CUENTA]])","v":0},{"$f":"SUMIFS(Diario[VALOR],Diario[CENTRO DE COSTOS],AO$2,Diario[CREDITO],PUC_310[[#This Row],[CUENTA]])","v":0},{"$f":"+PUC_310[[#This Row],[CRE28]]-PUC_310[[#This Row],[CRE29]]","v":0},{"$f":"SUMIFS(Diario[VALOR],Diario[CENTRO DE COSTOS],AQ$2,Diario[DEBITO],PUC_310[[#This Row],[CUENTA]])","v":0},{"$f":"SUMIFS(Diario[VALOR],Diario[CENTRO DE COSTOS],AR$2,Diario[CREDITO],PUC_310[[#This Row],[CUENTA]])","v":0},{"$f":"+PUC_310[[#This Row],[CRE31]]-PUC_310[[#This Row],[CRE32]]","v":0},{"$f":"SUMIFS(Diario[VALOR],Diario[CENTRO DE COSTOS],AT$2,Diario[DEBITO],PUC_310[[#This Row],[CUENTA]])","v":0},{"$f":"SUMIFS(Diario[VALOR],Diario[CENTRO DE COSTOS],AU$2,Diario[CREDITO],PUC_310[[#This Row],[CUENTA]])","v":0},{"$f":"+PUC_310[[#This Row],[CRE34]]-PUC_310[[#This Row],[CRE35]]","v":0},{"$f":"SUMIFS(Diario[VALOR],Diario[CENTRO DE COSTOS],AW$2,Diario[DEBITO],PUC_310[[#This Row],[CUENTA]])","v":0},{"$f":"SUMIFS(Diario[VALOR],Diario[CENTRO DE COSTOS],AX$2,Diario[CREDITO],PUC_310[[#This Row],[CUENTA]])","v":0},{"$f":"+PUC_310[[#This Row],[CRE37]]-PUC_310[[#This Row],[CRE38]]","v":0},{"$f":"SUMIFS(Diario[VALOR],Diario[CENTRO DE COSTOS],AZ$2,Diario[DEBITO],PUC_310[[#This Row],[CUENTA]])","v":0},{"$f":"SUMIFS(Diario[VALOR],Diario[CENTRO DE COSTOS],BA$2,Diario[CREDITO],PUC_310[[#This Row],[CUENTA]])","v":0},{"$f":"+PUC_310[[#This Row],[CRE40]]-PUC_310[[#This Row],[CRE41]]","v":0},{"$f":"SUMIFS(Diario[VALOR],Diario[CENTRO DE COSTOS],BC$2,Diario[DEBITO],PUC_310[[#This Row],[CUENTA]])","v":0},{"$f":"SUMIFS(Diario[VALOR],Diario[CENTRO DE COSTOS],BD$2,Diario[CREDITO],PUC_310[[#This Row],[CUENTA]])","v":0},{"$f":"+PUC_310[[#This Row],[CRE43]]-PUC_310[[#This Row],[CRE44]]","v":0},{"$f":"SUMIFS(Diario[VALOR],Diario[CENTRO DE COSTOS],BF$2,Diario[DEBITO],PUC_310[[#This Row],[CUENTA]])","v":0},{"$f":"SUMIFS(Diario[VALOR],Diario[CENTRO DE COSTOS],BG$2,Diario[CREDITO],PUC_310[[#This Row],[CUENTA]])","v":0},{"$f":"+PUC_310[[#This Row],[CRE452]]-PUC_310[[#This Row],[CRE453]]","v":0},{"$f":"SUMIF($B$3:$BH$3,$BI$3,PUC_310[[#This Row],[AUXILIAR]:[CRE4]])","v":0},{"$f":"SUMIF($B$3:$BH$3,$BJ$3,PUC_310[[#This Row],[AUXILIAR]:[CRE4]])","v":0},{"$f":"+PUC_310[[#This Row],[CRE46]]-PUC_310[[#This Row],[CRE47]]","v":0}]
[{"$f":"+'BALANCE DE PRUEBA UNITARIO'!A24","v":519530},{"$f":"+'BALANCE DE PRUEBA UNITARIO'!B24","v":519530},{"$f":"+'BALANCE DE PRUEBA UNITARIO'!C24","v":"UTILES, PAPELERIA Y FOTOCOPIAS "},{"$f":"SUMIFS(Diario[VALOR],Diario[CENTRO DE COSTOS],D$2,Diario[DEBITO],PUC_310[[#This Row],[CUENTA]])","v":0},{"$f":"SUMIFS(Diario[VALOR],Diario[CENTRO DE COSTOS],E$2,Diario[CREDITO],PUC_310[[#This Row],[CUENTA]])","v":0},{"$f":"+PUC_310[[#This Row],[DEB]]-PUC_310[[#This Row],[CRE]]","v":0},{"$f":"SUMIFS(Diario[VALOR],Diario[CENTRO DE COSTOS],G$2,Diario[DEBITO],PUC_310[[#This Row],[CUENTA]])","v":0},{"$f":"SUMIFS(Diario[VALOR],Diario[CENTRO DE COSTOS],H$2,Diario[CREDITO],PUC_310[[#This Row],[CUENTA]])","v":0},{"$f":"+PUC_310[[#This Row],[DEB2]]-PUC_310[[#This Row],[CRE2]]","v":0},{"$f":"SUMIFS(Diario[VALOR],Diario[CENTRO DE COSTOS],J$2,Diario[DEBITO],PUC_310[[#This Row],[CUENTA]])","v":0},{"$f":"SUMIFS(Diario[VALOR],Diario[CENTRO DE COSTOS],K$2,Diario[CREDITO],PUC_310[[#This Row],[CUENTA]])","v":0},{"$f":"+PUC_310[[#This Row],[DEB3]]-PUC_310[[#This Row],[CRE4]]","v":0},{"$f":"SUMIFS(Diario[VALOR],Diario[CENTRO DE COSTOS],M$2,Diario[DEBITO],PUC_310[[#This Row],[CUENTA]])","v":0},{"$f":"SUMIFS(Diario[VALOR],Diario[CENTRO DE COSTOS],N$2,Diario[CREDITO],PUC_310[[#This Row],[CUENTA]])","v":0},{"$f":"+PUC_310[[#This Row],[CRE52]]-PUC_310[[#This Row],[CRE53]]","v":0},{"$f":"SUMIFS(Diario[VALOR],Diario[CENTRO DE COSTOS],P$2,Diario[DEBITO],PUC_310[[#This Row],[CUENTA]])","v":0},{"$f":"SUMIFS(Diario[VALOR],Diario[CENTRO DE COSTOS],Q$2,Diario[CREDITO],PUC_310[[#This Row],[CUENTA]])","v":0},{"$f":"+PUC_310[[#This Row],[CRE55]]-PUC_310[[#This Row],[CRE56]]","v":0},{"$f":"SUMIFS(Diario[VALOR],Diario[CENTRO DE COSTOS],S$2,Diario[DEBITO],PUC_310[[#This Row],[CUENTA]])","v":0},{"$f":"SUMIFS(Diario[VALOR],Diario[CENTRO DE COSTOS],T$2,Diario[CREDITO],PUC_310[[#This Row],[CUENTA]])","v":0},{"$f":"+PUC_310[[#This Row],[CRE7]]-PUC_310[[#This Row],[CRE8]]","v":0},{"$f":"SUMIFS(Diario[VALOR],Diario[CENTRO DE COSTOS],V$2,Diario[DEBITO],PUC_310[[#This Row],[CUENTA]])","v":0},{"$f":"SUMIFS(Diario[VALOR],Diario[CENTRO DE COSTOS],W$2,Diario[CREDITO],PUC_310[[#This Row],[CUENTA]])","v":0},{"$f":"+PUC_310[[#This Row],[CRE10]]-PUC_310[[#This Row],[CRE11]]","v":0},{"$f":"SUMIFS(Diario[VALOR],Diario[CENTRO DE COSTOS],Y$2,Diario[DEBITO],PUC_310[[#This Row],[CUENTA]])","v":0},{"$f":"SUMIFS(Diario[VALOR],Diario[CENTRO DE COSTOS],Z$2,Diario[CREDITO],PUC_310[[#This Row],[CUENTA]])","v":0},{"$f":"+PUC_310[[#This Row],[CRE13]]-PUC_310[[#This Row],[CRE14]]","v":0},{"$f":"SUMIFS(Diario[VALOR],Diario[CENTRO DE COSTOS],AB$2,Diario[DEBITO],PUC_310[[#This Row],[CUENTA]])","v":0},{"$f":"SUMIFS(Diario[VALOR],Diario[CENTRO DE COSTOS],AC$2,Diario[CREDITO],PUC_310[[#This Row],[CUENTA]])","v":0},{"$f":"+PUC_310[[#This Row],[CRE16]]-PUC_310[[#This Row],[CRE17]]","v":0},{"$f":"SUMIFS(Diario[VALOR],Diario[CENTRO DE COSTOS],AE$2,Diario[DEBITO],PUC_310[[#This Row],[CUENTA]])","v":0},{"$f":"SUMIFS(Diario[VALOR],Diario[CENTRO DE COSTOS],AF$2,Diario[CREDITO],PUC_310[[#This Row],[CUENTA]])","v":0},{"$f":"+PUC_310[[#This Row],[CRE19]]-PUC_310[[#This Row],[CRE20]]","v":0},{"$f":"SUMIFS(Diario[VALOR],Diario[CENTRO DE COSTOS],AH$2,Diario[DEBITO],PUC_310[[#This Row],[CUENTA]])","v":0},{"$f":"SUMIFS(Diario[VALOR],Diario[CENTRO DE COSTOS],AI$2,Diario[CREDITO],PUC_310[[#This Row],[CUENTA]])","v":0},{"$f":"+PUC_310[[#This Row],[CRE22]]-PUC_310[[#This Row],[CRE23]]","v":0},{"$f":"SUMIFS(Diario[VALOR],Diario[CENTRO DE COSTOS],AK$2,Diario[DEBITO],PUC_310[[#This Row],[CUENTA]])","v":0},{"$f":"SUMIFS(Diario[VALOR],Diario[CENTRO DE COSTOS],AL$2,Diario[CREDITO],PUC_310[[#This Row],[CUENTA]])","v":0},{"$f":"+PUC_310[[#This Row],[CRE25]]-PUC_310[[#This Row],[CRE26]]","v":0},{"$f":"SUMIFS(Diario[VALOR],Diario[CENTRO DE COSTOS],AN$2,Diario[DEBITO],PUC_310[[#This Row],[CUENTA]])","v":0},{"$f":"SUMIFS(Diario[VALOR],Diario[CENTRO DE COSTOS],AO$2,Diario[CREDITO],PUC_310[[#This Row],[CUENTA]])","v":0},{"$f":"+PUC_310[[#This Row],[CRE28]]-PUC_310[[#This Row],[CRE29]]","v":0},{"$f":"SUMIFS(Diario[VALOR],Diario[CENTRO DE COSTOS],AQ$2,Diario[DEBITO],PUC_310[[#This Row],[CUENTA]])","v":0},{"$f":"SUMIFS(Diario[VALOR],Diario[CENTRO DE COSTOS],AR$2,Diario[CREDITO],PUC_310[[#This Row],[CUENTA]])","v":0},{"$f":"+PUC_310[[#This Row],[CRE31]]-PUC_310[[#This Row],[CRE32]]","v":0},{"$f":"SUMIFS(Diario[VALOR],Diario[CENTRO DE COSTOS],AT$2,Diario[DEBITO],PUC_310[[#This Row],[CUENTA]])","v":0},{"$f":"SUMIFS(Diario[VALOR],Diario[CENTRO DE COSTOS],AU$2,Diario[CREDITO],PUC_310[[#This Row],[CUENTA]])","v":0},{"$f":"+PUC_310[[#This Row],[CRE34]]-PUC_310[[#This Row],[CRE35]]","v":0},{"$f":"SUMIFS(Diario[VALOR],Diario[CENTRO DE COSTOS],AW$2,Diario[DEBITO],PUC_310[[#This Row],[CUENTA]])","v":0},{"$f":"SUMIFS(Diario[VALOR],Diario[CENTRO DE COSTOS],AX$2,Diario[CREDITO],PUC_310[[#This Row],[CUENTA]])","v":0},{"$f":"+PUC_310[[#This Row],[CRE37]]-PUC_310[[#This Row],[CRE38]]","v":0},{"$f":"SUMIFS(Diario[VALOR],Diario[CENTRO DE COSTOS],AZ$2,Diario[DEBITO],PUC_310[[#This Row],[CUENTA]])","v":0},{"$f":"SUMIFS(Diario[VALOR],Diario[CENTRO DE COSTOS],BA$2,Diario[CREDITO],PUC_310[[#This Row],[CUENTA]])","v":0},{"$f":"+PUC_310[[#This Row],[CRE40]]-PUC_310[[#This Row],[CRE41]]","v":0},{"$f":"SUMIFS(Diario[VALOR],Diario[CENTRO DE COSTOS],BC$2,Diario[DEBITO],PUC_310[[#This Row],[CUENTA]])","v":0},{"$f":"SUMIFS(Diario[VALOR],Diario[CENTRO DE COSTOS],BD$2,Diario[CREDITO],PUC_310[[#This Row],[CUENTA]])","v":0},{"$f":"+PUC_310[[#This Row],[CRE43]]-PUC_310[[#This Row],[CRE44]]","v":0},{"$f":"SUMIFS(Diario[VALOR],Diario[CENTRO DE COSTOS],BF$2,Diario[DEBITO],PUC_310[[#This Row],[CUENTA]])","v":0},{"$f":"SUMIFS(Diario[VALOR],Diario[CENTRO DE COSTOS],BG$2,Diario[CREDITO],PUC_310[[#This Row],[CUENTA]])","v":0},{"$f":"+PUC_310[[#This Row],[CRE452]]-PUC_310[[#This Row],[CRE453]]","v":0},{"$f":"SUMIF($B$3:$BH$3,$BI$3,PUC_310[[#This Row],[AUXILIAR]:[CRE4]])","v":0},{"$f":"SUMIF($B$3:$BH$3,$BJ$3,PUC_310[[#This Row],[AUXILIAR]:[CRE4]])","v":0},{"$f":"+PUC_310[[#This Row],[CRE46]]-PUC_310[[#This Row],[CRE47]]","v":0}]
[{"$f":"+'BALANCE DE PRUEBA UNITARIO'!A25","v":519535},{"$f":"+'BALANCE DE PRUEBA UNITARIO'!B25","v":519535},{"$f":"+'BALANCE DE PRUEBA UNITARIO'!C25","v":"COMBUSTIBLES Y LUBRICANTES "},{"$f":"SUMIFS(Diario[VALOR],Diario[CENTRO DE COSTOS],D$2,Diario[DEBITO],PUC_310[[#This Row],[CUENTA]])","v":0},{"$f":"SUMIFS(Diario[VALOR],Diario[CENTRO DE COSTOS],E$2,Diario[CREDITO],PUC_310[[#This Row],[CUENTA]])","v":0},{"$f":"+PUC_310[[#This Row],[DEB]]-PUC_310[[#This Row],[CRE]]","v":0},{"$f":"SUMIFS(Diario[VALOR],Diario[CENTRO DE COSTOS],G$2,Diario[DEBITO],PUC_310[[#This Row],[CUENTA]])","v":0},{"$f":"SUMIFS(Diario[VALOR],Diario[CENTRO DE COSTOS],H$2,Diario[CREDITO],PUC_310[[#This Row],[CUENTA]])","v":0},{"$f":"+PUC_310[[#This Row],[DEB2]]-PUC_310[[#This Row],[CRE2]]","v":0},{"$f":"SUMIFS(Diario[VALOR],Diario[CENTRO DE COSTOS],J$2,Diario[DEBITO],PUC_310[[#This Row],[CUENTA]])","v":0},{"$f":"SUMIFS(Diario[VALOR],Diario[CENTRO DE COSTOS],K$2,Diario[CREDITO],PUC_310[[#This Row],[CUENTA]])","v":0},{"$f":"+PUC_310[[#This Row],[DEB3]]-PUC_310[[#This Row],[CRE4]]","v":0},{"$f":"SUMIFS(Diario[VALOR],Diario[CENTRO DE COSTOS],M$2,Diario[DEBITO],PUC_310[[#This Row],[CUENTA]])","v":0},{"$f":"SUMIFS(Diario[VALOR],Diario[CENTRO DE COSTOS],N$2,Diario[CREDITO],PUC_310[[#This Row],[CUENTA]])","v":0},{"$f":"+PUC_310[[#This Row],[CRE52]]-PUC_310[[#This Row],[CRE53]]","v":0},{"$f":"SUMIFS(Diario[VALOR],Diario[CENTRO DE COSTOS],P$2,Diario[DEBITO],PUC_310[[#This Row],[CUENTA]])","v":0},{"$f":"SUMIFS(Diario[VALOR],Diario[CENTRO DE COSTOS],Q$2,Diario[CREDITO],PUC_310[[#This Row],[CUENTA]])","v":0},{"$f":"+PUC_310[[#This Row],[CRE55]]-PUC_310[[#This Row],[CRE56]]","v":0},{"$f":"SUMIFS(Diario[VALOR],Diario[CENTRO DE COSTOS],S$2,Diario[DEBITO],PUC_310[[#This Row],[CUENTA]])","v":0},{"$f":"SUMIFS(Diario[VALOR],Diario[CENTRO DE COSTOS],T$2,Diario[CREDITO],PUC_310[[#This Row],[CUENTA]])","v":0},{"$f":"+PUC_310[[#This Row],[CRE7]]-PUC_310[[#This Row],[CRE8]]","v":0},{"$f":"SUMIFS(Diario[VALOR],Diario[CENTRO DE COSTOS],V$2,Diario[DEBITO],PUC_310[[#This Row],[CUENTA]])","v":0},{"$f":"SUMIFS(Diario[VALOR],Diario[CENTRO DE COSTOS],W$2,Diario[CREDITO],PUC_310[[#This Row],[CUENTA]])","v":0},{"$f":"+PUC_310[[#This Row],[CRE10]]-PUC_310[[#This Row],[CRE11]]","v":0},{"$f":"SUMIFS(Diario[VALOR],Diario[CENTRO DE COSTOS],Y$2,Diario[DEBITO],PUC_310[[#This Row],[CUENTA]])","v":0},{"$f":"SUMIFS(Diario[VALOR],Diario[CENTRO DE COSTOS],Z$2,Diario[CREDITO],PUC_310[[#This Row],[CUENTA]])","v":0},{"$f":"+PUC_310[[#This Row],[CRE13]]-PUC_310[[#This Row],[CRE14]]","v":0},{"$f":"SUMIFS(Diario[VALOR],Diario[CENTRO DE COSTOS],AB$2,Diario[DEBITO],PUC_310[[#This Row],[CUENTA]])","v":0},{"$f":"SUMIFS(Diario[VALOR],Diario[CENTRO DE COSTOS],AC$2,Diario[CREDITO],PUC_310[[#This Row],[CUENTA]])","v":0},{"$f":"+PUC_310[[#This Row],[CRE16]]-PUC_310[[#This Row],[CRE17]]","v":0},{"$f":"SUMIFS(Diario[VALOR],Diario[CENTRO DE COSTOS],AE$2,Diario[DEBITO],PUC_310[[#This Row],[CUENTA]])","v":0},{"$f":"SUMIFS(Diario[VALOR],Diario[CENTRO DE COSTOS],AF$2,Diario[CREDITO],PUC_310[[#This Row],[CUENTA]])","v":0},{"$f":"+PUC_310[[#This Row],[CRE19]]-PUC_310[[#This Row],[CRE20]]","v":0},{"$f":"SUMIFS(Diario[VALOR],Diario[CENTRO DE COSTOS],AH$2,Diario[DEBITO],PUC_310[[#This Row],[CUENTA]])","v":0},{"$f":"SUMIFS(Diario[VALOR],Diario[CENTRO DE COSTOS],AI$2,Diario[CREDITO],PUC_310[[#This Row],[CUENTA]])","v":0},{"$f":"+PUC_310[[#This Row],[CRE22]]-PUC_310[[#This Row],[CRE23]]","v":0},{"$f":"SUMIFS(Diario[VALOR],Diario[CENTRO DE COSTOS],AK$2,Diario[DEBITO],PUC_310[[#This Row],[CUENTA]])","v":0},{"$f":"SUMIFS(Diario[VALOR],Diario[CENTRO DE COSTOS],AL$2,Diario[CREDITO],PUC_310[[#This Row],[CUENTA]])","v":0},{"$f":"+PUC_310[[#This Row],[CRE25]]-PUC_310[[#This Row],[CRE26]]","v":0},{"$f":"SUMIFS(Diario[VALOR],Diario[CENTRO DE COSTOS],AN$2,Diario[DEBITO],PUC_310[[#This Row],[CUENTA]])","v":0},{"$f":"SUMIFS(Diario[VALOR],Diario[CENTRO DE COSTOS],AO$2,Diario[CREDITO],PUC_310[[#This Row],[CUENTA]])","v":0},{"$f":"+PUC_310[[#This Row],[CRE28]]-PUC_310[[#This Row],[CRE29]]","v":0},{"$f":"SUMIFS(Diario[VALOR],Diario[CENTRO DE COSTOS],AQ$2,Diario[DEBITO],PUC_310[[#This Row],[CUENTA]])","v":0},{"$f":"SUMIFS(Diario[VALOR],Diario[CENTRO DE COSTOS],AR$2,Diario[CREDITO],PUC_310[[#This Row],[CUENTA]])","v":0},{"$f":"+PUC_310[[#This Row],[CRE31]]-PUC_310[[#This Row],[CRE32]]","v":0},{"$f":"SUMIFS(Diario[VALOR],Diario[CENTRO DE COSTOS],AT$2,Diario[DEBITO],PUC_310[[#This Row],[CUENTA]])","v":0},{"$f":"SUMIFS(Diario[VALOR],Diario[CENTRO DE COSTOS],AU$2,Diario[CREDITO],PUC_310[[#This Row],[CUENTA]])","v":0},{"$f":"+PUC_310[[#This Row],[CRE34]]-PUC_310[[#This Row],[CRE35]]","v":0},{"$f":"SUMIFS(Diario[VALOR],Diario[CENTRO DE COSTOS],AW$2,Diario[DEBITO],PUC_310[[#This Row],[CUENTA]])","v":0},{"$f":"SUMIFS(Diario[VALOR],Diario[CENTRO DE COSTOS],AX$2,Diario[CREDITO],PUC_310[[#This Row],[CUENTA]])","v":0},{"$f":"+PUC_310[[#This Row],[CRE37]]-PUC_310[[#This Row],[CRE38]]","v":0},{"$f":"SUMIFS(Diario[VALOR],Diario[CENTRO DE COSTOS],AZ$2,Diario[DEBITO],PUC_310[[#This Row],[CUENTA]])","v":0},{"$f":"SUMIFS(Diario[VALOR],Diario[CENTRO DE COSTOS],BA$2,Diario[CREDITO],PUC_310[[#This Row],[CUENTA]])","v":0},{"$f":"+PUC_310[[#This Row],[CRE40]]-PUC_310[[#This Row],[CRE41]]","v":0},{"$f":"SUMIFS(Diario[VALOR],Diario[CENTRO DE COSTOS],BC$2,Diario[DEBITO],PUC_310[[#This Row],[CUENTA]])","v":0},{"$f":"SUMIFS(Diario[VALOR],Diario[CENTRO DE COSTOS],BD$2,Diario[CREDITO],PUC_310[[#This Row],[CUENTA]])","v":0},{"$f":"+PUC_310[[#This Row],[CRE43]]-PUC_310[[#This Row],[CRE44]]","v":0},{"$f":"SUMIFS(Diario[VALOR],Diario[CENTRO DE COSTOS],BF$2,Diario[DEBITO],PUC_310[[#This Row],[CUENTA]])","v":0},{"$f":"SUMIFS(Diario[VALOR],Diario[CENTRO DE COSTOS],BG$2,Diario[CREDITO],PUC_310[[#This Row],[CUENTA]])","v":0},{"$f":"+PUC_310[[#This Row],[CRE452]]-PUC_310[[#This Row],[CRE453]]","v":0},{"$f":"SUMIF($B$3:$BH$3,$BI$3,PUC_310[[#This Row],[AUXILIAR]:[CRE4]])","v":0},{"$f":"SUMIF($B$3:$BH$3,$BJ$3,PUC_310[[#This Row],[AUXILIAR]:[CRE4]])","v":0},{"$f":"+PUC_310[[#This Row],[CRE46]]-PUC_310[[#This Row],[CRE47]]","v":0}]
[null,null," RESULTADO DEL EJERCICIO ",{"$f":"SUBTOTAL(109,D5:D26)","v":0},{"$f":"SUBTOTAL(109,E5:E26)","v":0},{"$f":"-F10-SUM(F11:F26)","v":0},0,0,0,0,0,0,0,0,0,0,0,0,0,0,0,0,0,0,0,0,0,0,0,0,0,0,0,0,0,0,0,{"$f":"-AL10-SUM(AL11:AL26)","v":0},0,0,0,0,0,0,0,0,0,0,0,0,0,0,0,0,0,0,0,0,0,0,0,0,0]
[null,null,null,null,{"$f":"+PUC_310[[#Totals],[DEB]]-PUC_310[[#Totals],[CRE]]","v":0},null,null,{"$f":"+PUC_310[[#Totals],[DEB]]-PUC_310[[#Totals],[CRE]]","v":0}]

{"sheet":"Control de Cambios","index":9,"n_rows":5,"n_cols":3,"rows_kept":5,"cut":false,"hidden":false,"merged":[[0,0,1,0],[0,1,1,1],[0,2,1,2]]}
["Versión","Fecha de Cambio","Descripción de la modificación"]
[]
[1,"2021-03-31","Creación Matríz para el control a las plantaciones y bienes con actividades  agropecuarias y forestales administrados por el Fondo para la Reparación a las Víctimas con Vocación Reparadora."]
[]
["Nota: Se debe registrar el control de cambios,pero esta hoja no se publica."]

{"sheet":"P Y G PLANTACIONES BAAF","index":10,"n_rows":26,"n_cols":21,"rows_kept":26,"cut":false,"hidden":true,"merged":[[0,18,0,20],[0,3,0,5],[0,6,0,8],[0,9,0,11],[0,12,0,14],[0,15,0,17]]}
[null,null,null,{"$f":"+D2","v":"Caucheros Frutos del Perdón"},null,null,{"$f":"+G2","v":"Maderero Sembremos Pais"},null,null,{"$f":"+J2","v":"Palmar Cosechando Paz"},null,null,{"$f":"+M2","v":"Palmar Renacer de Esperanza"},null,null,{"$f":"+P2","v":"Palmar Semillas de Reconciliación"},null,null,{"$f":"+S2","v":"Rancho Santa Teresa"}]
[null,null,null,"Caucheros Frutos del Perdón","Caucheros Frutos del Perdón","Caucheros Frutos del Perdón","Maderero Sembremos Pais","Maderero Sembremos Pais","Maderero Sembremos Pais","Palmar Cosechando Paz","Palmar Cosechando Paz","Palmar Cosechando Paz","Palmar Renacer de Esperanza","Palmar Renacer de Esperanza","Palmar Renacer de Esperanza","Palmar Semillas de Reconciliación","Palmar Semillas de Reconciliación","Palmar Semillas de Reconciliación","Rancho Santa Teresa","Rancho Santa Teresa","Rancho Santa Teresa"]
[null,"CUENTA CONTABLE","DESCRIPCION","DEBITO","CREDITO","TOTAL","DEBITO","CREDITO","TOTAL","DEBITO","CREDITO","TOTAL","DEBITO","CREDITO","TOTAL","DEBITO","CREDITO","TOTAL","DEBITO","CREDITO","TOTAL"]
["CUENTA","AUXILIAR","DESCRIPCION","DEB2","CRE2","TOTAL2","CRE31","CRE32","CRE33","CRE34","CRE35","CRE36","CRE37","CRE38","CRE39","CRE40","CRE41","CRE42","CRE43","CRE44","CRE45"]
[null,null,"INGRESOS"]
[{"$f":"+PUC_3104[[#This Row],[AUXILIAR]]","v":410545},{"$f":"+'BALANCE DE PRUEBA UNITARIO'!A11","v":410545},{"$f":"+'BALANCE DE PRUEBA UNITARIO'!C11","v":"OTROS CULTIVOS AGRICOLAS "},{"$f":"SUMIFS(Diario[VALOR],Diario[CENTRO DE COSTOS],D$2,Diario[DEBITO],PUC_3104[[#This Row],[CUENTA]])","v":0},{"$f":"SUMIFS(Diario[VALOR],Diario[CENTRO DE COSTOS],E$2,Diario[CREDITO],PUC_3104[[#This Row],[CUENTA]])","v":0},{"$f":"+PUC_3104[[#This Row],[DEB2]]-PUC_3104[[#This Row],[CRE2]]","v":0},{"$f":"SUMIFS(Diario[VALOR],Diario[CENTRO DE COSTOS],G$2,Diario[DEBITO],PUC_3104[[#This Row],[CUENTA]])","v":0},{"$f":"SUMIFS(Diario[VALOR],Diario[CENTRO DE COSTOS],H$2,Diario[CREDITO],PUC_3104[[#This Row],[CUENTA]])","v":0},{"$f":"+PUC_3104[[#This Row],[CRE31]]-PUC_3104[[#This Row],[CRE32]]","v":0},{"$f":"SUMIFS(Diario[VALOR],Diario[CENTRO DE COSTOS],J$2,Diario[DEBITO],PUC_3104[[#This Row],[CUENTA]])","v":0},{"$f":"SUMIFS(Diario[VALOR],Diario[CENTRO DE COSTOS],K$2,Diario[CREDITO],PUC_3104[[#This Row],[CUENTA]])","v":0},{"$f":"+PUC_3104[[#This Row],[CRE34]]-PUC_3104[[#This Row],[CRE35]]","v":0},{"$f":"SUMIFS(Diario[VALOR],Diario[CENTRO DE COSTOS],M$2,Diario[DEBITO],PUC_3104[[#This Row],[CUENTA]])","v":0},{"$f":"SUMIFS(Diario[VALOR],Diario[CENTRO DE COSTOS],N$2,Diario[CREDITO],PUC_3104[[#This Row],[CUENTA]])","v":0},{"$f":"+PUC_3104[[#This Row],[CRE37]]-PUC_3104[[#This Row],[CRE38]]","v":0},{"$f":"SUMIFS(Diario[VALOR],Diario[CENTRO DE COSTOS],P$2,Diario[DEBITO],PUC_3104[[#This Row],[CUENTA]])","v":0},{"$f":"SUMIFS(Diario[VALOR],Diario[CENTRO DE COSTOS],Q$2,Diario[CREDITO],PUC_3104[[#This Row],[CUENTA]])","v":0},{"$f":"+PUC_3104[[#This Row],[CRE40]]-PUC_3104[[#This Row],[CRE41]]","v":0},{"$f":"SUMIFS(Diario[VALOR],Diario[CENTRO DE COSTOS],S$2,Diario[DEBITO],PUC_3104[[#This Row],[CUENTA]])","v":0},{"$f":"SUMIFS(Diario[VALOR],Diario[CENTRO DE COSTOS],T$2,Diario[CREDITO],PUC_3104[[#This Row],[CUENTA]])","v":0},{"$f":"+PUC_3104[[#This Row],[CRE43]]-PUC_3104[[#This Row],[CRE44]]","v":0}]
[{"$f":"+PUC_3104[[#This Row],[AUXILIAR]]","v":0},null,"GASTOS"]
[{"$f":"+PUC_3104[[#This Row],[AUXILIAR]]","v":510506},{"$f":"+'BALANCE DE PRUEBA UNITARIO'!A12","v":510506},{"$f":"+'BALANCE DE PRUEBA UNITARIO'!C12","v":"SUELDOS "},{"$f":"SUMIFS(Diario[VALOR],Diario[CENTRO DE COSTOS],D$2,Diario[DEBITO],PUC_3104[[#This Row],[CUENTA]])","v":0},{"$f":"SUMIFS(Diario[VALOR],Diario[CENTRO DE COSTOS],E$2,Diario[CREDITO],PUC_3104[[#This Row],[CUENTA]])","v":0},{"$f":"+PUC_3104[[#This Row],[DEB2]]-PUC_3104[[#This Row],[CRE2]]","v":0},{"$f":"SUMIFS(Diario[VALOR],Diario[CENTRO DE COSTOS],G$2,Diario[DEBITO],PUC_3104[[#This Row],[CUENTA]])","v":0},{"$f":"SUMIFS(Diario[VALOR],Diario[CENTRO DE COSTOS],H$2,Diario[CREDITO],PUC_3104[[#This Row],[CUENTA]])","v":0},{"$f":"+PUC_3104[[#This Row],[CRE31]]-PUC_3104[[#This Row],[CRE32]]","v":0},{"$f":"SUMIFS(Diario[VALOR],Diario[CENTRO DE COSTOS],J$2,Diario[DEBITO],PUC_3104[[#This Row],[CUENTA]])","v":0},{"$f":"SUMIFS(Diario[VALOR],Diario[CENTRO DE COSTOS],K$2,Diario[CREDITO],PUC_3104[[#This Row],[CUENTA]])","v":0},{"$f":"+PUC_3104[[#This Row],[CRE34]]-PUC_3104[[#This Row],[CRE35]]","v":0},{"$f":"SUMIFS(Diario[VALOR],Diario[CENTRO DE COSTOS],M$2,Diario[DEBITO],PUC_3104[[#This Row],[CUENTA]])","v":0},{"$f":"SUMIFS(Diario[VALOR],Diario[CENTRO DE COSTOS],N$2,Diario[CREDITO],PUC_3104[[#This Row],[CUENTA]])","v":0},{"$f":"+PUC_3104[[#This Row],[CRE37]]-PUC_3104[[#This Row],[CRE38]]","v":0},{"$f":"SUMIFS(Diario[VALOR],Diario[CENTRO DE COSTOS],P$2,Diario[DEBITO],PUC_3104[[#This Row],[CUENTA]])","v":0},{"$f":"SUMIFS(Diario[VALOR],Diario[CENTRO DE COSTOS],Q$2,Diario[CREDITO],PUC_3104[[#This Row],[CUENTA]])","v":0},{"$f":"+PUC_3104[[#This Row],[CRE40]]-PUC_3104[[#This Row],[CRE41]]","v":0},{"$f":"SUMIFS(Diario[VALOR],Diario[CENTRO DE COSTOS],S$2,Diario[DEBITO],PUC_3104[[#This Row],[CUENTA]])","v":0},{"$f":"SUMIFS(Diario[VALOR],Diario[CENTRO DE COSTOS],T$2,Diario[CREDITO],PUC_3104[[#This Row],[CUENTA]])","v":0},{"$f":"+PUC_3104[[#This Row],[CRE43]]-PUC_3104[[#This Row],[CRE44]]","v":0}]
[{"$f":"+PUC_3104[[#This Row],[AUXILIAR]]","v":510551},{"$f":"+'BALANCE DE PRUEBA UNITARIO'!A13","v":510551},{"$f":"+'BALANCE DE PRUEBA UNITARIO'!C13","v":"DOTACION Y SUMINISTRO A TRABAJADORES "},{"$f":"SUMIFS(Diario[VALOR],Diario[CENTRO DE COSTOS],D$2,Diario[DEBITO],PUC_3104[[#This Row],[CUENTA]])","v":0},{"$f":"SUMIFS(Diario[VALOR],Diario[CENTRO DE COSTOS],E$2,Diario[CREDITO],PUC_3104[[#This Row],[CUENTA]])","v":0},{"$f":"+PUC_3104[[#This Row],[DEB2]]-PUC_3104[[#This Row],[CRE2]]","v":0},{"$f":"SUMIFS(Diario[VALOR],Diario[CENTRO DE COSTOS],G$2,Diario[DEBITO],PUC_3104[[#This Row],[CUENTA]])","v":0},{"$f":"SUMIFS(Diario[VALOR],Diario[CENTRO DE COSTOS],H$2,Diario[CREDITO],PUC_3104[[#This Row],[CUENTA]])","v":0},{"$f":"+PUC_3104[[#This Row],[CRE31]]-PUC_3104[[#This Row],[CRE32]]","v":0},{"$f":"SUMIFS(Diario[VALOR],Diario[CENTRO DE COSTOS],J$2,Diario[DEBITO],PUC_3104[[#This Row],[CUENTA]])","v":0},{"$f":"SUMIFS(Diario[VALOR],Diario[CENTRO DE COSTOS],K$2,Diario[CREDITO],PUC_3104[[#This Row],[CUENTA]])","v":0},{"$f":"+PUC_3104[[#This Row],[CRE34]]-PUC_3104[[#This Row],[CRE35]]","v":0},{"$f":"SUMIFS(Diario[VALOR],Diario[CENTRO DE COSTOS],M$2,Diario[DEBITO],PUC_3104[[#This Row],[CUENTA]])","v":0},{"$f":"SUMIFS(Diario[VALOR],Diario[CENTRO DE COSTOS],N$2,Diario[CREDITO],PUC_3104[[#This Row],[CUENTA]])","v":0},{"$f":"+PUC_3104[[#This Row],[CRE37]]-PUC_3104[[#This Row],[CRE38]]","v":0},{"$f":"SUMIFS(Diario[VALOR],Diario[CENTRO DE COSTOS],P$2,Diario[DEBITO],PUC_3104[[#This Row],[CUENTA]])","v":0},{"$f":"SUMIFS(Diario[VALOR],Diario[CENTRO DE COSTOS],Q$2,Diario[CREDITO],PUC_3104[[#This Row],[CUENTA]])","v":0},{"$f":"+PUC_3104[[#This Row],[CRE40]]-PUC_3104[[#This Row],[CRE41]]","v":0},{"$f":"SUMIFS(Diario[VALOR],Diario[CENTRO DE COSTOS],S$2,Diario[DEBITO],PUC_3104[[#This Row],[CUENTA]])","v":0},{"$f":"SUMIFS(Diario[VALOR],Diario[CENTRO DE COSTOS],T$2,Diario[CREDITO],PUC_3104[[#This Row],[CUENTA]])","v":0},{"$f":"+PUC_3104[[#This Row],[CRE43]]-PUC_3104[[#This Row],[CRE44]]","v":0}]
[{"$f":"+PUC_3104[[#This Row],[AUXILIAR]]","v":510554},{"$f":"+'BALANCE DE PRUEBA UNITARIO'!A14","v":510554},{"$f":"+'BALANCE DE PRUEBA UNITARIO'!C14","v":"SEGUROS "},{"$f":"SUMIFS(Diario[VALOR],Diario[CENTRO DE COSTOS],D$2,Diario[DEBITO],PUC_3104[[#This Row],[CUENTA]])","v":0},{"$f":"SUMIFS(Diario[VALOR],Diario[CENTRO DE COSTOS],E$2,Diario[CREDITO],PUC_3104[[#This Row],[CUENTA]])","v":0},{"$f":"+PUC_3104[[#This Row],[DEB2]]-PUC_3104[[#This Row],[CRE2]]","v":0},{"$f":"SUMIFS(Diario[VALOR],Diario[CENTRO DE COSTOS],G$2,Diario[DEBITO],PUC_3104[[#This Row],[CUENTA]])","v":0},{"$f":"SUMIFS(Diario[VALOR],Diario[CENTRO DE COSTOS],H$2,Diario[CREDITO],PUC_3104[[#This Row],[CUENTA]])","v":0},{"$f":"+PUC_3104[[#This Row],[CRE31]]-PUC_3104[[#This Row],[CRE32]]","v":0},{"$f":"SUMIFS(Diario[VALOR],Diario[CENTRO DE COSTOS],J$2,Diario[DEBITO],PUC_3104[[#This Row],[CUENTA]])","v":0},{"$f":"SUMIFS(Diario[VALOR],Diario[CENTRO DE COSTOS],K$2,Diario[CREDITO],PUC_3104[[#This Row],[CUENTA]])","v":0},{"$f":"+PUC_3104[[#This Row],[CRE34]]-PUC_3104[[#This Row],[CRE35]]","v":0},{"$f":"SUMIFS(Diario[VALOR],Diario[CENTRO DE COSTOS],M$2,Diario[DEBITO],PUC_3104[[#This Row],[CUENTA]])","v":0},{"$f":"SUMIFS(Diario[VALOR],Diario[CENTRO DE COSTOS],N$2,Diario[CREDITO],PUC_3104[[#This Row],[CUENTA]])","v":0},{"$f":"+PUC_3104[[#This Row],[CRE37]]-PUC_3104[[#This Row],[CRE38]]","v":0},{"$f":"SUMIFS(Diario[VALOR],Diario[CENTRO DE COSTOS],P$2,Diario[DEBITO],PUC_3104[[#This Row],[CUENTA]])","v":0},{"$f":"SUMIFS(Diario[VALOR],Diario[CENTRO DE COSTOS],Q$2,Diario[CREDITO],PUC_3104[[#This Row],[CUENTA]])","v":0},{"$f":"+PUC_3104[[#This Row],[CRE40]]-PUC_3104[[#This Row],[CRE41]]","v":0},{"$f":"SUMIFS(Diario[VALOR],Diario[CENTRO DE COSTOS],S$2,Diario[DEBITO],PUC_3104[[#This Row],[CUENTA]])","v":0},{"$f":"SUMIFS(Diario[VALOR],Diario[CENTRO DE COSTOS],T$2,Diario[CREDITO],PUC_3104[[#This Row],[CUENTA]])","v":0},{"$f":"+PUC_3104[[#This Row],[CRE43]]-PUC_3104[[#This Row],[CRE44]]","v":0}]
[{"$f":"+PUC_3104[[#This Row],[AUXILIAR]]","v":510584},{"$f":"+'BALANCE DE PRUEBA UNITARIO'!A15","v":510584},{"$f":"+'BALANCE DE PRUEBA UNITARIO'!C15","v":"GASTOS MEDICOS Y DROGAS "},{"$f":"SUMIFS(Diario[VALOR],Diario[CENTRO DE COSTOS],D$2,Diario[DEBITO],PUC_3104[[#This Row],[CUENTA]])","v":0},{"$f":"SUMIFS(Diario[VALOR],Diario[CENTRO DE COSTOS],E$2,Diario[CREDITO],PUC_3104[[#This Row],[CUENTA]])","v":0},{"$f":"+PUC_3104[[#This Row],[DEB2]]-PUC_3104[[#This Row],[CRE2]]","v":0},{"$f":"SUMIFS(Diario[VALOR],Diario[CENTRO DE COSTOS],G$2,Diario[DEBITO],PUC_3104[[#This Row],[CUENTA]])","v":0},{"$f":"SUMIFS(Diario[VALOR],Diario[CENTRO DE COSTOS],H$2,Diario[CREDITO],PUC_3104[[#This Row],[CUENTA]])","v":0},{"$f":"+PUC_3104[[#This Row],[CRE31]]-PUC_3104[[#This Row],[CRE32]]","v":0},{"$f":"SUMIFS(Diario[VALOR],Diario[CENTRO DE COSTOS],J$2,Diario[DEBITO],PUC_3104[[#This Row],[CUENTA]])","v":0},{"$f":"SUMIFS(Diario[VALOR],Diario[CENTRO DE COSTOS],K$2,Diario[CREDITO],PUC_3104[[#This Row],[CUENTA]])","v":0},{"$f":"+PUC_3104[[#This Row],[CRE34]]-PUC_3104[[#This Row],[CRE35]]","v":0},{"$f":"SUMIFS(Diario[VALOR],Diario[CENTRO DE COSTOS],M$2,Diario[DEBITO],PUC_3104[[#This Row],[CUENTA]])","v":0},{"$f":"SUMIFS(Diario[VALOR],Diario[CENTRO DE COSTOS],N$2,Diario[CREDITO],PUC_3104[[#This Row],[CUENTA]])","v":0},{"$f":"+PUC_3104[[#This Row],[CRE37]]-PUC_3104[[#This Row],[CRE38]]","v":0},{"$f":"SUMIFS(Diario[VALOR],Diario[CENTRO DE COSTOS],P$2,Diario[DEBITO],PUC_3104[[#This Row],[CUENTA]])","v":0},{"$f":"SUMIFS(Diario[VALOR],Diario[CENTRO DE COSTOS],Q$2,Diario[CREDITO],PUC_3104[[#This Row],[CUENTA]])","v":0},{"$f":"+PUC_3104[[#This Row],[CRE40]]-PUC_3104[[#This Row],[CRE41]]","v":0},{"$f":"SUMIFS(Diario[VALOR],Diario[CENTRO DE COSTOS],S$2,Diario[DEBITO],PUC_3104[[#This Row],[CUENTA]])","v":0},{"$f":"SUMIFS(Diario[VALOR],Diario[CENTRO DE COSTOS],T$2,Diario[CREDITO],PUC_3104[[#This Row],[CUENTA]])","v":0},{"$f":"+PUC_3104[[#This Row],[CRE43]]-PUC_3104[[#This Row],[CRE44]]","v":0}]
[{"$f":"+PUC_3104[[#This Row],[AUXILIAR]]","v":511035},{"$f":"+'BALANCE DE PRUEBA UNITARIO'!A16","v":511035},{"$f":"+'BALANCE DE PRUEBA UNITARIO'!C16","v":"ASESORIA TECNICA "},{"$f":"SUMIFS(Diario[VALOR],Diario[CENTRO DE COSTOS],D$2,Diario[DEBITO],PUC_3104[[#This Row],[CUENTA]])","v":0},{"$f":"SUMIFS(Diario[VALOR],Diario[CENTRO DE COSTOS],E$2,Diario[CREDITO],PUC_3104[[#This Row],[CUENTA]])","v":0},{"$f":"+PUC_3104[[#This Row],[DEB2]]-PUC_3104[[#This Row],[CRE2]]","v":0},{"$f":"SUMIFS(Diario[VALOR],Diario[CENTRO DE COSTOS],G$2,Diario[DEBITO],PUC_3104[[#This Row],[CUENTA]])","v":0},{"$f":"SUMIFS(Diario[VALOR],Diario[CENTRO DE COSTOS],H$2,Diario[CREDITO],PUC_3104[[#This Row],[CUENTA]])","v":0},{"$f":"+PUC_3104[[#This Row],[CRE31]]-PUC_3104[[#This Row],[CRE32]]","v":0},{"$f":"SUMIFS(Diario[VALOR],Diario[CENTRO DE COSTOS],J$2,Diario[DEBITO],PUC_3104[[#This Row],[CUENTA]])","v":0},{"$f":"SUMIFS(Diario[VALOR],Diario[CENTRO DE COSTOS],K$2,Diario[CREDITO],PUC_3104[[#This Row],[CUENTA]])","v":0},{"$f":"+PUC_3104[[#This Row],[CRE34]]-PUC_3104[[#This Row],[CRE35]]","v":0},{"$f":"SUMIFS(Diario[VALOR],Diario[CENTRO DE COSTOS],M$2,Diario[DEBITO],PUC_3104[[#This Row],[CUENTA]])","v":0},{"$f":"SUMIFS(Diario[VALOR],Diario[CENTRO DE COSTOS],N$2,Diario[CREDITO],PUC_3104[[#This Row],[CUENTA]])","v":0},{"$f":"+PUC_3104[[#This Row],[CRE37]]-PUC_3104[[#This Row],[CRE38]]","v":0},{"$f":"SUMIFS(Diario[VALOR],Diario[CENTRO DE COSTOS],P$2,Diario[DEBITO],PUC_3104[[#This Row],[CUENTA]])","v":0},{"$f":"SUMIFS(Diario[VALOR],Diario[CENTRO DE COSTOS],Q$2,Diario[CREDITO],PUC_3104[[#This Row],[CUENTA]])","v":0},{"$f":"+PUC_3104[[#This Row],[CRE40]]-PUC_3104[[#This Row],[CRE41]]","v":0},{"$f":"SUMIFS(Diario[VALOR],Diario[CENTRO DE COSTOS],S$2,Diario[DEBITO],PUC_3104[[#This Row],[CUENTA]])","v":0},{"$f":"SUMIFS(Diario[VALOR],Diario[CENTRO DE COSTOS],T$2,Diario[CREDITO],PUC_3104[[#This Row],[CUENTA]])","v":0},{"$f":"+PUC_3104[[#This Row],[CRE43]]-PUC_3104[[#This Row],[CRE44]]","v":0}]
[{"$f":"+PUC_3104[[#This Row],[AUXILIAR]]","v":512080},{"$f":"+'BALANCE DE PRUEBA UNITARIO'!A17","v":512080},{"$f":"+'BALANCE DE PRUEBA UNITARIO'!C17","v":"VIATICOS"},{"$f":"SUMIFS(Diario[VALOR],Diario[CENTRO DE COSTOS],D$2,Diario[DEBITO],PUC_3104[[#This Row],[CUENTA]])","v":0},{"$f":"SUMIFS(Diario[VALOR],Diario[CENTRO DE COSTOS],E$2,Diario[CREDITO],PUC_3104[[#This Row],[CUENTA]])","v":0},{"$f":"+PUC_3104[[#This Row],[DEB2]]-PUC_3104[[#This Row],[CRE2]]","v":0},{"$f":"SUMIFS(Diario[VALOR],Diario[CENTRO DE COSTOS],G$2,Diario[DEBITO],PUC_3104[[#This Row],[CUENTA]])","v":0},{"$f":"SUMIFS(Diario[VALOR],Diario[CENTRO DE COSTOS],H$2,Diario[CREDITO],PUC_3104[[#This Row],[CUENTA]])","v":0},{"$f":"+PUC_3104[[#This Row],[CRE31]]-PUC_3104[[#This Row],[CRE32]]","v":0},{"$f":"SUMIFS(Diario[VALOR],Diario[CENTRO DE COSTOS],J$2,Diario[DEBITO],PUC_3104[[#This Row],[CUENTA]])","v":0},{"$f":"SUMIFS(Diario[VALOR],Diario[CENTRO DE COSTOS],K$2,Diario[CREDITO],PUC_3104[[#This Row],[CUENTA]])","v":0},{"$f":"+PUC_3104[[#This Row],[CRE34]]-PUC_3104[[#This Row],[CRE35]]","v":0},{"$f":"SUMIFS(Diario[VALOR],Diario[CENTRO DE COSTOS],M$2,Diario[DEBITO],PUC_3104[[#This Row],[CUENTA]])","v":0},{"$f":"SUMIFS(Diario[VALOR],Diario[CENTRO DE COSTOS],N$2,Diario[CREDITO],PUC_3104[[#This Row],[CUENTA]])","v":0},{"$f":"+PUC_3104[[#This Row],[CRE37]]-PUC_3104[[#This Row],[CRE38]]","v":0},{"$f":"SUMIFS(Diario[VALOR],Diario[CENTRO DE COSTOS],P$2,Diario[DEBITO],PUC_3104[[#This Row],[CUENTA]])","v":0},{"$f":"SUMIFS(Diario[VALOR],Diario[CENTRO DE COSTOS],Q$2,Diario[CREDITO],PUC_3104[[#This Row],[CUENTA]])","v":0},{"$f":"+PUC_3104[[#This Row],[CRE40]]-PUC_3104[[#This Row],[CRE41]]","v":0},{"$f":"SUMIFS(Diario[VALOR],Diario[CENTRO DE COSTOS],S$2,Diario[DEBITO],PUC_3104[[#This Row],[CUENTA]])","v":0},{"$f":"SUMIFS(Diario[VALOR],Diario[CENTRO DE COSTOS],T$2,Diario[CREDITO],PUC_3104[[#This Row],[CUENTA]])","v":0},{"$f":"+PUC_3104[[#This Row],[CRE43]]-PUC_3104[[#This Row],[CRE44]]","v":0}]
[{"$f":"+PUC_3104[[#This Row],[AUXILIAR]]","v":513015},{"$f":"+'BALANCE DE PRUEBA UNITARIO'!A18","v":513015},{"$f":"+'BALANCE DE PRUEBA UNITARIO'!C18","v":"AVALUOS"},{"$f":"SUMIFS(Diario[VALOR],Diario[CENTRO DE COSTOS],D$2,Diario[DEBITO],PUC_3104[[#This Row],[CUENTA]])","v":0},{"$f":"SUMIFS(Diario[VALOR],Diario[CENTRO DE COSTOS],E$2,Diario[CREDITO],PUC_3104[[#This Row],[CUENTA]])","v":0},{"$f":"+PUC_3104[[#This Row],[DEB2]]-PUC_3104[[#This Row],[CRE2]]","v":0},{"$f":"SUMIFS(Diario[VALOR],Diario[CENTRO DE COSTOS],G$2,Diario[DEBITO],PUC_3104[[#This Row],[CUENTA]])","v":0},{"$f":"SUMIFS(Diario[VALOR],Diario[CENTRO DE COSTOS],H$2,Diario[CREDITO],PUC_3104[[#This Row],[CUENTA]])","v":0},{"$f":"+PUC_3104[[#This Row],[CRE31]]-PUC_3104[[#This Row],[CRE32]]","v":0},{"$f":"SUMIFS(Diario[VALOR],Diario[CENTRO DE COSTOS],J$2,Diario[DEBITO],PUC_3104[[#This Row],[CUENTA]])","v":0},{"$f":"SUMIFS(Diario[VALOR],Diario[CENTRO DE COSTOS],K$2,Diario[CREDITO],PUC_3104[[#This Row],[CUENTA]])","v":0},{"$f":"+PUC_3104[[#This Row],[CRE34]]-PUC_3104[[#This Row],[CRE35]]","v":0},{"$f":"SUMIFS(Diario[VALOR],Diario[CENTRO DE COSTOS],M$2,Diario[DEBITO],PUC_3104[[#This Row],[CUENTA]])","v":0},{"$f":"SUMIFS(Diario[VALOR],Diario[CENTRO DE COSTOS],N$2,Diario[CREDITO],PUC_3104[[#This Row],[CUENTA]])","v":0},{"$f":"+PUC_3104[[#This Row],[CRE37]]-PUC_3104[[#This Row],[CRE38]]","v":0},{"$f":"SUMIFS(Diario[VALOR],Diario[CENTRO DE COSTOS],P$2,Diario[DEBITO],PUC_3104[[#This Row],[CUENTA]])","v":0},{"$f":"SUMIFS(Diario[VALOR],Diario[CENTRO DE COSTOS],Q$2,Diario[CREDITO],PUC_3104[[#This Row],[CUENTA]])","v":0},{"$f":"+PUC_3104[[#This Row],[CRE40]]-PUC_3104[[#This Row],[CRE41]]","v":0},{"$f":"SUMIFS(Diario[VALOR],Diario[CENTRO DE COSTOS],S$2,Diario[DEBITO],PUC_3104[[#This Row],[CUENTA]])","v":0},{"$f":"SUMIFS(Diario[VALOR],Diario[CENTRO DE COSTOS],T$2,Diario[CREDITO],PUC_3104[[#This Row],[CUENTA]])","v":0},{"$f":"+PUC_3104[[#This Row],[CRE43]]-PUC_3104[[#This Row],[CRE44]]","v":0}]
[{"$f":"+PUC_3104[[#This Row],[AUXILIAR]]","v":513595},{"$f":"+'BALANCE DE PRUEBA UNITARIO'!A19","v":513595},{"$f":"+'BALANCE DE PRUEBA UNITARIO'!C19","v":"IMPLEMENTACION SSGT"},{"$f":"SUMIFS(Diario[VALOR],Diario[CENTRO DE COSTOS],D$2,Diario[DEBITO],PUC_3104[[#This Row],[CUENTA]])","v":0},{"$f":"SUMIFS(Diario[VALOR],Diario[CENTRO DE COSTOS],E$2,Diario[CREDITO],PUC_3104[[#This Row],[CUENTA]])","v":0},{"$f":"+PUC_3104[[#This Row],[DEB2]]-PUC_3104[[#This Row],[CRE2]]","v":0},{"$f":"SUMIFS(Diario[VALOR],Diario[CENTRO DE COSTOS],G$2,Diario[DEBITO],PUC_3104[[#This Row],[CUENTA]])","v":0},{"$f":"SUMIFS(Diario[VALOR],Diario[CENTRO DE COSTOS],H$2,Diario[CREDITO],PUC_3104[[#This Row],[CUENTA]])","v":0},{"$f":"+PUC_3104[[#This Row],[CRE31]]-PUC_3104[[#This Row],[CRE32]]","v":0},{"$f":"SUMIFS(Diario[VALOR],Diario[CENTRO DE COSTOS],J$2,Diario[DEBITO],PUC_3104[[#This Row],[CUENTA]])","v":0},{"$f":"SUMIFS(Diario[VALOR],Diario[CENTRO DE COSTOS],K$2,Diario[CREDITO],PUC_3104[[#This Row],[CUENTA]])","v":0},{"$f":"+PUC_3104[[#This Row],[CRE34]]-PUC_3104[[#This Row],[CRE35]]","v":0},{"$f":"SUMIFS(Diario[VALOR],Diario[CENTRO DE COSTOS],M$2,Diario[DEBITO],PUC_3104[[#This Row],[CUENTA]])","v":0},{"$f":"SUMIFS(Diario[VALOR],Diario[CENTRO DE COSTOS],N$2,Diario[CREDITO],PUC_3104[[#This Row],[CUENTA]])","v":0},{"$f":"+PUC_3104[[#This Row],[CRE37]]-PUC_3104[[#This Row],[CRE38]]","v":0},{"$f":"SUMIFS(Diario[VALOR],Diario[CENTRO DE COSTOS],P$2,Diario[DEBITO],PUC_3104[[#This Row],[CUENTA]])","v":0},{"$f":"SUMIFS(Diario[VALOR],Diario[CENTRO DE COSTOS],Q$2,Diario[CREDITO],PUC_3104[[#This Row],[CUENTA]])","v":0},{"$f":"+PUC_3104[[#This Row],[CRE40]]-PUC_3104[[#This Row],[CRE41]]","v":0},{"$f":"SUMIFS(Diario[VALOR],Diario[CENTRO DE COSTOS],S$2,Diario[DEBITO],PUC_3104[[#This Row],[CUENTA]])","v":0},{"$f":"SUMIFS(Diario[VALOR],Diario[CENTRO DE COSTOS],T$2,Diario[CREDITO],PUC_3104[[#This Row],[CUENTA]])","v":0},{"$f":"+PUC_3104[[#This Row],[CRE43]]-PUC_3104[[#This Row],[CRE44]]","v":0}]
[{"$f":"+PUC_3104[[#This Row],[AUXILIAR]]","v":514515},{"$f":"+'BALANCE DE PRUEBA UNITARIO'!A20","v":514515},{"$f":"+'BALANCE DE PRUEBA UNITARIO'!C20","v":"MANTENIMIENTO MAQUINARIA Y EQUIPO "},{"$f":"SUMIFS(Diario[VALOR],Diario[CENTRO DE COSTOS],D$2,Diario[DEBITO],PUC_3104[[#This Row],[CUENTA]])","v":0},{"$f":"SUMIFS(Diario[VALOR],Diario[CENTRO DE COSTOS],E$2,Diario[CREDITO],PUC_3104[[#This Row],[CUENTA]])","v":0},{"$f":"+PUC_3104[[#This Row],[DEB2]]-PUC_3104[[#This Row],[CRE2]]","v":0},{"$f":"SUMIFS(Diario[VALOR],Diario[CENTRO DE COSTOS],G$2,Diario[DEBITO],PUC_3104[[#This Row],[CUENTA]])","v":0},{"$f":"SUMIFS(Diario[VALOR],Diario[CENTRO DE COSTOS],H$2,Diario[CREDITO],PUC_3104[[#This Row],[CUENTA]])","v":0},{"$f":"+PUC_3104[[#This Row],[CRE31]]-PUC_3104[[#This Row],[CRE32]]","v":0},{"$f":"SUMIFS(Diario[VALOR],Diario[CENTRO DE COSTOS],J$2,Diario[DEBITO],PUC_3104[[#This Row],[CUENTA]])","v":0},{"$f":"SUMIFS(Diario[VALOR],Diario[CENTRO DE COSTOS],K$2,Diario[CREDITO],PUC_3104[[#This Row],[CUENTA]])","v":0},{"$f":"+PUC_3104[[#This Row],[CRE34]]-PUC_3104[[#This Row],[CRE35]]","v":0},{"$f":"SUMIFS(Diario[VALOR],Diario[CENTRO DE COSTOS],M$2,Diario[DEBITO],PUC_3104[[#This Row],[CUENTA]])","v":0},{"$f":"SUMIFS(Diario[VALOR],Diario[CENTRO DE COSTOS],N$2,Diario[CREDITO],PUC_3104[[#This Row],[CUENTA]])","v":0},{"$f":"+PUC_3104[[#This Row],[CRE37]]-PUC_3104[[#This Row],[CRE38]]","v":0},{"$f":"SUMIFS(Diario[VALOR],Diario[CENTRO DE COSTOS],P$2,Diario[DEBITO],PUC_3104[[#This Row],[CUENTA]])","v":0},{"$f":"SUMIFS(Diario[VALOR],Diario[CENTRO DE COSTOS],Q$2,Diario[CREDITO],PUC_3104[[#This Row],[CUENTA]])","v":0},{"$f":"+PUC_3104[[#This Row],[CRE40]]-PUC_3104[[#This Row],[CRE41]]","v":0},{"$f":"SUMIFS(Diario[VALOR],Diario[CENTRO DE COSTOS],S$2,Diario[DEBITO],PUC_3104[[#This Row],[CUENTA]])","v":0},{"$f":"SUMIFS(Diario[VALOR],Diario[CENTRO DE COSTOS],T$2,Diario[CREDITO],PUC_3104[[#This Row],[CUENTA]])","v":0},{"$f":"+PUC_3104[[#This Row],[CRE43]]-PUC_3104[[#This Row],[CRE44]]","v":0}]
[{"$f":"+PUC_3104[[#This Row],[AUXILIAR]]","v":519005},{"$f":"+'BALANCE DE PRUEBA UNITARIO'!A21","v":519005},{"$f":"+'BALANCE DE PRUEBA UNITARIO'!C21","v":"SERVICIOS DE ASEO Y VIGILANCIA"},{"$f":"SUMIFS(Diario[VALOR],Diario[CENTRO DE COSTOS],D$2,Diario[DEBITO],PUC_3104[[#This Row],[CUENTA]])","v":0},{"$f":"SUMIFS(Diario[VALOR],Diario[CENTRO DE COSTOS],E$2,Diario[CREDITO],PUC_3104[[#This Row],[CUENTA]])","v":0},{"$f":"+PUC_3104[[#This Row],[DEB2]]-PUC_3104[[#This Row],[CRE2]]","v":0},{"$f":"SUMIFS(Diario[VALOR],Diario[CENTRO DE COSTOS],G$2,Diario[DEBITO],PUC_3104[[#This Row],[CUENTA]])","v":0},{"$f":"SUMIFS(Diario[VALOR],Diario[CENTRO DE COSTOS],H$2,Diario[CREDITO],PUC_3104[[#This Row],[CUENTA]])","v":0},{"$f":"+PUC_3104[[#This Row],[CRE31]]-PUC_3104[[#This Row],[CRE32]]","v":0},{"$f":"SUMIFS(Diario[VALOR],Diario[CENTRO DE COSTOS],J$2,Diario[DEBITO],PUC_3104[[#This Row],[CUENTA]])","v":0},{"$f":"SUMIFS(Diario[VALOR],Diario[CENTRO DE COSTOS],K$2,Diario[CREDITO],PUC_3104[[#This Row],[CUENTA]])","v":0},{"$f":"+PUC_3104[[#This Row],[CRE34]]-PUC_3104[[#This Row],[CRE35]]","v":0},{"$f":"SUMIFS(Diario[VALOR],Diario[CENTRO DE COSTOS],M$2,Diario[DEBITO],PUC_3104[[#This Row],[CUENTA]])","v":0},{"$f":"SUMIFS(Diario[VALOR],Diario[CENTRO DE COSTOS],N$2,Diario[CREDITO],PUC_3104[[#This Row],[CUENTA]])","v":0},{"$f":"+PUC_3104[[#This Row],[CRE37]]-PUC_3104[[#This Row],[CRE38]]","v":0},{"$f":"SUMIFS(Diario[VALOR],Diario[CENTRO DE COSTOS],P$2,Diario[DEBITO],PUC_3104[[#This Row],[CUENTA]])","v":0},{"$f":"SUMIFS(Diario[VALOR],Diario[CENTRO DE COSTOS],Q$2,Diario[CREDITO],PUC_3104[[#This Row],[CUENTA]])","v":0},{"$f":"+PUC_3104[[#This Row],[CRE40]]-PUC_3104[[#This Row],[CRE41]]","v":0},{"$f":"SUMIFS(Diario[VALOR],Diario[CENTRO DE COSTOS],S$2,Diario[DEBITO],PUC_3104[[#This Row],[CUENTA]])","v":0},{"$f":"SUMIFS(Diario[VALOR],Diario[CENTRO DE COSTOS],T$2,Diario[CREDITO],PUC_3104[[#This Row],[CUENTA]])","v":0},{"$f":"+PUC_3104[[#This Row],[CRE43]]-PUC_3104[[#This Row],[CRE44]]","v":0}]
[{"$f":"+PUC_3104[[#This Row],[AUXILIAR]]","v":519040},{"$f":"+'BALANCE DE PRUEBA UNITARIO'!A22","v":519040},{"$f":"+'BALANCE DE PRUEBA UNITARIO'!C22","v":"TRANSPORTE"},{"$f":"SUMIFS(Diario[VALOR],Diario[CENTRO DE COSTOS],D$2,Diario[DEBITO],PUC_3104[[#This Row],[CUENTA]])","v":0},{"$f":"SUMIFS(Diario[VALOR],Diario[CENTRO DE COSTOS],E$2,Diario[CREDITO],PUC_3104[[#This Row],[CUENTA]])","v":0},{"$f":"+PUC_3104[[#This Row],[DEB2]]-PUC_3104[[#This Row],[CRE2]]","v":0},{"$f":"SUMIFS(Diario[VALOR],Diario[CENTRO DE COSTOS],G$2,Diario[DEBITO],PUC_3104[[#This Row],[CUENTA]])","v":0},{"$f":"SUMIFS(Diario[VALOR],Diario[CENTRO DE COSTOS],H$2,Diario[CREDITO],PUC_3104[[#This Row],[CUENTA]])","v":0},{"$f":"+PUC_3104[[#This Row],[CRE31]]-PUC_3104[[#This Row],[CRE32]]","v":0},{"$f":"SUMIFS(Diario[VALOR],Diario[CENTRO DE COSTOS],J$2,Diario[DEBITO],PUC_3104[[#This Row],[CUENTA]])","v":0},{"$f":"SUMIFS(Diario[VALOR],Diario[CENTRO DE COSTOS],K$2,Diario[CREDITO],PUC_3104[[#This Row],[CUENTA]])","v":0},{"$f":"+PUC_3104[[#This Row],[CRE34]]-PUC_3104[[#This Row],[CRE35]]","v":0},{"$f":"SUMIFS(Diario[VALOR],Diario[CENTRO DE COSTOS],M$2,Diario[DEBITO],PUC_3104[[#This Row],[CUENTA]])","v":0},{"$f":"SUMIFS(Diario[VALOR],Diario[CENTRO DE COSTOS],N$2,Diario[CREDITO],PUC_3104[[#This Row],[CUENTA]])","v":0},{"$f":"+PUC_3104[[#This Row],[CRE37]]-PUC_3104[[#This Row],[CRE38]]","v":0},{"$f":"SUMIFS(Diario[VALOR],Diario[CENTRO DE COSTOS],P$2,Diario[DEBITO],PUC_3104[[#This Row],[CUENTA]])","v":0},{"$f":"SUMIFS(Diario[VALOR],Diario[CENTRO DE COSTOS],Q$2,Diario[CREDITO],PUC_3104[[#This Row],[CUENTA]])","v":0},{"$f":"+PUC_3104[[#This Row],[CRE40]]-PUC_3104[[#This Row],[CRE41]]","v":0},{"$f":"SUMIFS(Diario[VALOR],Diario[CENTRO DE COSTOS],S$2,Diario[DEBITO],PUC_3104[[#This Row],[CUENTA]])","v":0},{"$f":"SUMIFS(Diario[VALOR],Diario[CENTRO DE COSTOS],T$2,Diario[CREDITO],PUC_3104[[#This Row],[CUENTA]])","v":0},{"$f":"+PUC_3104[[#This Row],[CRE43]]-PUC_3104[[#This Row],[CRE44]]","v":0}]
[{"$f":"+PUC_3104[[#This Row],[AUXILIAR]]","v":519505},{"$f":"+'BALANCE DE PRUEBA UNITARIO'!A23","v":519505},{"$f":"+'BALANCE DE PRUEBA UNITARIO'!C23","v":"COMISIONES "},{"$f":"SUMIFS(Diario[VALOR],Diario[CENTRO DE COSTOS],D$2,Diario[DEBITO],PUC_3104[[#This Row],[CUENTA]])","v":0},{"$f":"SUMIFS(Diario[VALOR],Diario[CENTRO DE COSTOS],E$2,Diario[CREDITO],PUC_3104[[#This Row],[CUENTA]])","v":0},{"$f":"+PUC_3104[[#This Row],[DEB2]]-PUC_3104[[#This Row],[CRE2]]","v":0},{"$f":"SUMIFS(Diario[VALOR],Diario[CENTRO DE COSTOS],G$2,Diario[DEBITO],PUC_3104[[#This Row],[CUENTA]])","v":0},{"$f":"SUMIFS(Diario[VALOR],Diario[CENTRO DE COSTOS],H$2,Diario[CREDITO],PUC_3104[[#This Row],[CUENTA]])","v":0},{"$f":"+PUC_3104[[#This Row],[CRE31]]-PUC_3104[[#This Row],[CRE32]]","v":0},{"$f":"SUMIFS(Diario[VALOR],Diario[CENTRO DE COSTOS],J$2,Diario[DEBITO],PUC_3104[[#This Row],[CUENTA]])","v":0},{"$f":"SUMIFS(Diario[VALOR],Diario[CENTRO DE COSTOS],K$2,Diario[CREDITO],PUC_3104[[#This Row],[CUENTA]])","v":0},{"$f":"+PUC_3104[[#This Row],[CRE34]]-PUC_3104[[#This Row],[CRE35]]","v":0},{"$f":"SUMIFS(Diario[VALOR],Diario[CENTRO DE COSTOS],M$2,Diario[DEBITO],PUC_3104[[#This Row],[CUENTA]])","v":0},{"$f":"SUMIFS(Diario[VALOR],Diario[CENTRO DE COSTOS],N$2,Diario[CREDITO],PUC_3104[[#This Row],[CUENTA]])","v":0},{"$f":"+PUC_3104[[#This Row],[CRE37]]-PUC_3104[[#This Row],[CRE38]]","v":0},{"$f":"SUMIFS(Diario[VALOR],Diario[CENTRO DE COSTOS],P$2,Diario[DEBITO],PUC_3104[[#This Row],[CUENTA]])","v":0},{"$f":"SUMIFS(Diario[VALOR],Diario[CENTRO DE COSTOS],Q$2,Diario[CREDITO],PUC_3104[[#This Row],[CUENTA]])","v":0},{"$f":"+PUC_3104[[#This Row],[CRE40]]-PUC_3104[[#This Row],[CRE41]]","v":0},{"$f":"SUMIFS(Diario[VALOR],Diario[CENTRO DE COSTOS],S$2,Diario[DEBITO],PUC_3104[[#This Row],[CUENTA]])","v":0},{"$f":"SUMIFS(Diario[VALOR],Diario[CENTRO DE COSTOS],T$2,Diario[CREDITO],PUC_3104[[#This Row],[CUENTA]])","v":0},{"$f":"+PUC_3104[[#This Row],[CRE43]]-PUC_3104[[#This Row],[CRE44]]","v":0}]
[{"$f":"+PUC_3104[[#This Row],[AUXILIAR]]","v":519530},{"$f":"+'BALANCE DE PRUEBA UNITARIO'!A24","v":519530},{"$f":"+'BALANCE DE PRUEBA UNITARIO'!C24","v":"UTILES, PAPELERIA Y FOTOCOPIAS "},{"$f":"SUMIFS(Diario[VALOR],Diario[CENTRO DE COSTOS],D$2,Diario[DEBITO],PUC_3104[[#This Row],[CUENTA]])","v":0},{"$f":"SUMIFS(Diario[VALOR],Diario[CENTRO DE COSTOS],E$2,Diario[CREDITO],PUC_3104[[#This Row],[CUENTA]])","v":0},{"$f":"+PUC_3104[[#This Row],[DEB2]]-PUC_3104[[#This Row],[CRE2]]","v":0},{"$f":"SUMIFS(Diario[VALOR],Diario[CENTRO DE COSTOS],G$2,Diario[DEBITO],PUC_3104[[#This Row],[CUENTA]])","v":0},{"$f":"SUMIFS(Diario[VALOR],Diario[CENTRO DE COSTOS],H$2,Diario[CREDITO],PUC_3104[[#This Row],[CUENTA]])","v":0},{"$f":"+PUC_3104[[#This Row],[CRE31]]-PUC_3104[[#This Row],[CRE32]]","v":0},{"$f":"SUMIFS(Diario[VALOR],Diario[CENTRO DE COSTOS],J$2,Diario[DEBITO],PUC_3104[[#This Row],[CUENTA]])","v":0},{"$f":"SUMIFS(Diario[VALOR],Diario[CENTRO DE COSTOS],K$2,Diario[CREDITO],PUC_3104[[#This Row],[CUENTA]])","v":0},{"$f":"+PUC_3104[[#This Row],[CRE34]]-PUC_3104[[#This Row],[CRE35]]","v":0},{"$f":"SUMIFS(Diario[VALOR],Diario[CENTRO DE COSTOS],M$2,Diario[DEBITO],PUC_3104[[#This Row],[CUENTA]])","v":0},{"$f":"SUMIFS(Diario[VALOR],Diario[CENTRO DE COSTOS],N$2,Diario[CREDITO],PUC_3104[[#This Row],[CUENTA]])","v":0},{"$f":"+PUC_3104[[#This Row],[CRE37]]-PUC_3104[[#This Row],[CRE38]]","v":0},{"$f":"SUMIFS(Diario[VALOR],Diario[CENTRO DE COSTOS],P$2,Diario[DEBITO],PUC_3104[[#This Row],[CUENTA]])","v":0},{"$f":"SUMIFS(Diario[VALOR],Diario[CENTRO DE COSTOS],Q$2,Diario[CREDITO],PUC_3104[[#This Row],[CUENTA]])","v":0},{"$f":"+PUC_3104[[#This Row],[CRE40]]-PUC_3104[[#This Row],[CRE41]]","v":0},{"$f":"SUMIFS(Diario[VALOR],Diario[CENTRO DE COSTOS],S$2,Diario[DEBITO],PUC_3104[[#This Row],[CUENTA]])","v":0},{"$f":"SUMIFS(Diario[VALOR],Diario[CENTRO DE COSTOS],T$2,Diario[CREDITO],PUC_3104[[#This Row],[CUENTA]])","v":0},{"$f":"+PUC_3104[[#This Row],[CRE43]]-PUC_3104[[#This Row],[CRE44]]","v":0}]
[{"$f":"+PUC_3104[[#This Row],[AUXILIAR]]","v":519535},{"$f":"+'BALANCE DE PRUEBA UNITARIO'!A25","v":519535},{"$f":"+'BALANCE DE PRUEBA UNITARIO'!C25","v":"COMBUSTIBLES Y LUBRICANTES "},{"$f":"SUMIFS(Diario[VALOR],Diario[CENTRO DE COSTOS],D$2,Diario[DEBITO],PUC_3104[[#This Row],[CUENTA]])","v":0},{"$f":"SUMIFS(Diario[VALOR],Diario[CENTRO DE COSTOS],E$2,Diario[CREDITO],PUC_3104[[#This Row],[CUENTA]])","v":0},{"$f":"+PUC_3104[[#This Row],[DEB2]]-PUC_3104[[#This Row],[CRE2]]","v":0},{"$f":"SUMIFS(Diario[VALOR],Diario[CENTRO DE COSTOS],G$2,Diario[DEBITO],PUC_3104[[#This Row],[CUENTA]])","v":0},{"$f":"SUMIFS(Diario[VALOR],Diario[CENTRO DE COSTOS],H$2,Diario[CREDITO],PUC_3104[[#This Row],[CUENTA]])","v":0},{"$f":"+PUC_3104[[#This Row],[CRE31]]-PUC_3104[[#This Row],[CRE32]]","v":0},{"$f":"SUMIFS(Diario[VALOR],Diario[CENTRO DE COSTOS],J$2,Diario[DEBITO],PUC_3104[[#This Row],[CUENTA]])","v":0},{"$f":"SUMIFS(Diario[VALOR],Diario[CENTRO DE COSTOS],K$2,Diario[CREDITO],PUC_3104[[#This Row],[CUENTA]])","v":0},{"$f":"+PUC_3104[[#This Row],[CRE34]]-PUC_3104[[#This Row],[CRE35]]","v":0},{"$f":"SUMIFS(Diario[VALOR],Diario[CENTRO DE COSTOS],M$2,Diario[DEBITO],PUC_3104[[#This Row],[CUENTA]])","v":0},{"$f":"SUMIFS(Diario[VALOR],Diario[CENTRO DE COSTOS],N$2,Diario[CREDITO],PUC_3104[[#This Row],[CUENTA]])","v":0},{"$f":"+PUC_3104[[#This Row],[CRE37]]-PUC_3104[[#This Row],[CRE38]]","v":0},{"$f":"SUMIFS(Diario[VALOR],Diario[CENTRO DE COSTOS],P$2,Diario[DEBITO],PUC_3104[[#This Row],[CUENTA]])","v":0},{"$f":"SUMIFS(Diario[VALOR],Diario[CENTRO DE COSTOS],Q$2,Diario[CREDITO],PUC_3104[[#This Row],[CUENTA]])","v":0},{"$f":"+PUC_3104[[#This Row],[CRE40]]-PUC_3104[[#This Row],[CRE41]]","v":0},{"$f":"SUMIFS(Diario[VALOR],Diario[CENTRO DE COSTOS],S$2,Diario[DEBITO],PUC_3104[[#This Row],[CUENTA]])","v":0},{"$f":"SUMIFS(Diario[VALOR],Diario[CENTRO DE COSTOS],T$2,Diario[CREDITO],PUC_3104[[#This Row],[CUENTA]])","v":0},{"$f":"+PUC_3104[[#This Row],[CRE43]]-PUC_3104[[#This Row],[CRE44]]","v":0}]
[{"$f":"+PUC_3104[[#This Row],[AUXILIAR]]","v":523595},{"$f":"+'BALANCE DE PRUEBA UNITARIO'!A26","v":523595},{"$f":"+'BALANCE DE PRUEBA UNITARIO'!C26","v":"SERVICIOS DE COMERCIALIZACION"},{"$f":"SUMIFS(Diario[VALOR],Diario[CENTRO DE COSTOS],D$2,Diario[DEBITO],PUC_3104[[#This Row],[CUENTA]])","v":0},{"$f":"SUMIFS(Diario[VALOR],Diario[CENTRO DE COSTOS],E$2,Diario[CREDITO],PUC_3104[[#This Row],[CUENTA]])","v":0},{"$f":"+PUC_3104[[#This Row],[DEB2]]-PUC_3104[[#This Row],[CRE2]]","v":0},{"$f":"SUMIFS(Diario[VALOR],Diario[CENTRO DE COSTOS],G$2,Diario[DEBITO],PUC_3104[[#This Row],[CUENTA]])","v":0},{"$f":"SUMIFS(Diario[VALOR],Diario[CENTRO DE COSTOS],H$2,Diario[CREDITO],PUC_3104[[#This Row],[CUENTA]])","v":0},{"$f":"+PUC_3104[[#This Row],[CRE31]]-PUC_3104[[#This Row],[CRE32]]","v":0},{"$f":"SUMIFS(Diario[VALOR],Diario[CENTRO DE COSTOS],J$2,Diario[DEBITO],PUC_3104[[#This Row],[CUENTA]])","v":0},{"$f":"SUMIFS(Diario[VALOR],Diario[CENTRO DE COSTOS],K$2,Diario[CREDITO],PUC_3104[[#This Row],[CUENTA]])","v":0},{"$f":"+PUC_3104[[#This Row],[CRE34]]-PUC_3104[[#This Row],[CRE35]]","v":0},{"$f":"SUMIFS(Diario[VALOR],Diario[CENTRO DE COSTOS],M$2,Diario[DEBITO],PUC_3104[[#This Row],[CUENTA]])","v":0},{"$f":"SUMIFS(Diario[VALOR],Diario[CENTRO DE COSTOS],N$2,Diario[CREDITO],PUC_3104[[#This Row],[CUENTA]])","v":0},{"$f":"+PUC_3104[[#This Row],[CRE37]]-PUC_3104[[#This Row],[CRE38]]","v":0},{"$f":"SUMIFS(Diario[VALOR],Diario[CENTRO DE COSTOS],P$2,Diario[DEBITO],PUC_3104[[#This Row],[CUENTA]])","v":0},{"$f":"SUMIFS(Diario[VALOR],Diario[CENTRO DE COSTOS],Q$2,Diario[CREDITO],PUC_3104[[#This Row],[CUENTA]])","v":0},{"$f":"+PUC_3104[[#This Row],[CRE40]]-PUC_3104[[#This Row],[CRE41]]","v":0},{"$f":"SUMIFS(Diario[VALOR],Diario[CENTRO DE COSTOS],S$2,Diario[DEBITO],PUC_3104[[#This Row],[CUENTA]])","v":0},{"$f":"SUMIFS(Diario[VALOR],Diario[CENTRO DE COSTOS],T$2,Diario[CREDITO],PUC_3104[[#This Row],[CUENTA]])","v":0},{"$f":"+PUC_3104[[#This Row],[CRE43]]-PUC_3104[[#This Row],[CRE44]]","v":0}]
[{"$f":"+PUC_3104[[#This Row],[AUXILIAR]]","v":0},null,"COSTOS"]
[{"$f":"+PUC_3104[[#This Row],[AUXILIAR]]","v":610570},{"$f":"+'BALANCE DE PRUEBA UNITARIO'!A27","v":610570},{"$f":"+'BALANCE DE PRUEBA UNITARIO'!C27","v":"SERVICIOS AGRICOLAS Y GANADEROS "},{"$f":"SUMIFS(Diario[VALOR],Diario[CENTRO DE COSTOS],D$2,Diario[DEBITO],PUC_3104[[#This Row],[CUENTA]])","v":0},{"$f":"SUMIFS(Diario[VALOR],Diario[CENTRO DE COSTOS],E$2,Diario[CREDITO],PUC_3104[[#This Row],[CUENTA]])","v":0},{"$f":"+PUC_3104[[#This Row],[DEB2]]-PUC_3104[[#This Row],[CRE2]]","v":0},{"$f":"SUMIFS(Diario[VALOR],Diario[CENTRO DE COSTOS],G$2,Diario[DEBITO],PUC_3104[[#This Row],[CUENTA]])","v":0},{"$f":"SUMIFS(Diario[VALOR],Diario[CENTRO DE COSTOS],H$2,Diario[CREDITO],PUC_3104[[#This Row],[CUENTA]])","v":0},{"$f":"+PUC_3104[[#This Row],[CRE31]]-PUC_3104[[#This Row],[CRE32]]","v":0},{"$f":"SUMIFS(Diario[VALOR],Diario[CENTRO DE COSTOS],J$2,Diario[DEBITO],PUC_3104[[#This Row],[CUENTA]])","v":0},{"$f":"SUMIFS(Diario[VALOR],Diario[CENTRO DE COSTOS],K$2,Diario[CREDITO],PUC_3104[[#This Row],[CUENTA]])","v":0},{"$f":"+PUC_3104[[#This Row],[CRE34]]-PUC_3104[[#This Row],[CRE35]]","v":0},{"$f":"SUMIFS(Diario[VALOR],Diario[CENTRO DE COSTOS],M$2,Diario[DEBITO],PUC_3104[[#This Row],[CUENTA]])","v":0},{"$f":"SUMIFS(Diario[VALOR],Diario[CENTRO DE COSTOS],N$2,Diario[CREDITO],PUC_3104[[#This Row],[CUENTA]])","v":0},{"$f":"+PUC_3104[[#This Row],[CRE37]]-PUC_3104[[#This Row],[CRE38]]","v":0},{"$f":"SUMIFS(Diario[VALOR],Diario[CENTRO DE COSTOS],P$2,Diario[DEBITO],PUC_3104[[#This Row],[CUENTA]])","v":0},{"$f":"SUMIFS(Diario[VALOR],Diario[CENTRO DE COSTOS],Q$2,Diario[CREDITO],PUC_3104[[#This Row],[CUENTA]])","v":0},{"$f":"+PUC_3104[[#This Row],[CRE40]]-PUC_3104[[#This Row],[CRE41]]","v":0},{"$f":"SUMIFS(Diario[VALOR],Diario[CENTRO DE COSTOS],S$2,Diario[DEBITO],PUC_3104[[#This Row],[CUENTA]])","v":0},{"$f":"SUMIFS(Diario[VALOR],Diario[CENTRO DE COSTOS],T$2,Diario[CREDITO],PUC_3104[[#This Row],[CUENTA]])","v":0},{"$f":"+PUC_3104[[#This Row],[CRE43]]-PUC_3104[[#This Row],[CRE44]]","v":0}]
[{"$f":"+PUC_3104[[#This Row],[AUXILIAR]]","v":0},null,"TOTAL COSTOS Y GASTOS",null,null,{"$f":"SUM(F8:F24)","v":0},{"$f":"SUM(G8:G24)","v":0},0,0,0,0,0,0,0,0,0,0,0,0,0,0]
[null,null," RESULTADO DEL EJERCICIO ",{"$f":"-D6-SUM(D8:D24)","v":0},{"$f":"-E6-SUM(E8:E24)","v":0},{"$f":"-(F25+F6)","v":0},{"$f":"-(G25+G6)","v":0},0,0,0,0,0,0,0,0,0,0,0,0,0,0]

{"sheet":"PYG (2)","index":11,"n_rows":17,"n_cols":9,"rows_kept":17,"cut":false,"hidden":true,"merged":[]}
[]
["CUENTA","CONCEPTO","PALMAR COSECHANDO PAZ","PALMAR RANCHO SANTA TERESA","PALMAR RENACER ESPERANZA","PALMAR SEMILLAS DE RECONCILIACIÓN"," CAUCHEROS FRUTOS DEL PERDÓN","MADERERO SEMBRAMOS PAÍS","CONSOLIDADO"]
[]
[null,"INGRESOS",{"$f":"+C6","v":{"$error":"#REF!"}},{"$f":"+D6","v":{"$error":"#REF!"}},{"$error":"#REF!"},{"$error":"#REF!"},{"$error":"#REF!"},{"$error":"#REF!"},{"$error":"#REF!"}]
[]
[4105,{"$f":"VLOOKUP('PYG (2)'!$A6,PUC[[AUXILIAR]:[CUENTA]],2,0)","v":"AGRICULTURA, GANADERIA, CAZA Y SILVICULTURA "},{"$f":"SUMIF(#REF!,'BALANCE DE PRUEBA UNITARIO'!$C$1&'PYG (2)'!$A6,Diario[CONCEPTO])","v":{"$error":"#REF!"}},{"$f":"SUMIF(#REF!,'BALANCE DE PRUEBA UNITARIO'!$C$1&'PYG (2)'!$A6,#REF!)","v":{"$error":"#REF!"}},{"$f":"SUMIF(#REF!,'BALANCE DE PRUEBA UNITARIO'!$C$1&'PYG (2)'!$A6,#REF!)","v":{"$error":"#REF!"}},{"$f":"SUMIF(#REF!,'BALANCE DE PRUEBA UNITARIO'!$C$1&'PYG (2)'!$A6,#REF!)","v":{"$error":"#REF!"}},{"$f":"SUMIF(#REF!,'BALANCE DE PRUEBA UNITARIO'!$C$1&'PYG (2)'!$A6,#REF!)","v":{"$error":"#REF!"}},{"$f":"SUMIF(#REF!,'BALANCE DE PRUEBA UNITARIO'!$C$1&'PYG (2)'!$A6,#REF!)","v":{"$error":"#REF!"}},{"$f":"SUMIF(#REF!,'BALANCE DE PRUEBA UNITARIO'!$C$1&'PYG (2)'!$A6,Diario[VALOR])","v":{"$error":"#REF!"}}]
[]
[null,"GASTOS",{"$f":"SUM(C10:C15)","v":{"$error":"#REF!"}},{"$f":"SUM(D10:D15)","v":{"$error":"#REF!"}},{"$error":"#REF!"},{"$error":"#REF!"},{"$error":"#REF!"},{"$error":"#REF!"},{"$error":"#REF!"}]
[]
[510506,{"$f":"VLOOKUP('PYG (2)'!$A10,PUC[[AUXILIAR]:[CUENTA]],2,0)","v":"SUELDOS "},{"$f":"SUMIF(#REF!,'BALANCE DE PRUEBA UNITARIO'!$C$1&'PYG (2)'!$A10,Diario[CONCEPTO])","v":{"$error":"#REF!"}},{"$f":"SUMIF(#REF!,'BALANCE DE PRUEBA UNITARIO'!$C$1&'PYG (2)'!$A10,#REF!)","v":{"$error":"#REF!"}},{"$f":"SUMIF(#REF!,'BALANCE DE PRUEBA UNITARIO'!$C$1&'PYG (2)'!$A10,#REF!)","v":{"$error":"#REF!"}},{"$f":"SUMIF(#REF!,'BALANCE DE PRUEBA UNITARIO'!$C$1&'PYG (2)'!$A10,#REF!)","v":{"$error":"#REF!"}},{"$f":"SUMIF(#REF!,'BALANCE DE PRUEBA UNITARIO'!$C$1&'PYG (2)'!$A10,#REF!)","v":{"$error":"#REF!"}},{"$f":"SUMIF(#REF!,'BALANCE DE PRUEBA UNITARIO'!$C$1&'PYG (2)'!$A10,#REF!)","v":{"$error":"#REF!"}},{"$f":"SUMIF(#REF!,'BALANCE DE PRUEBA UNITARIO'!$C$1&'PYG (2)'!$A10,Diario[VALOR])","v":{"$error":"#REF!"}}]
[513010,{"$f":"VLOOKUP('PYG (2)'!$A11,PUC[[AUXILIAR]:[CUENTA]],2,0)","v":"CUMPLIMIENTO "},{"$f":"SUMIF(#REF!,'BALANCE DE PRUEBA UNITARIO'!$C$1&'PYG (2)'!$A11,Diario[CONCEPTO])","v":{"$error":"#REF!"}},{"$f":"SUMIF(#REF!,'BALANCE DE PRUEBA UNITARIO'!$C$1&'PYG (2)'!$A11,#REF!)","v":{"$error":"#REF!"}},{"$f":"SUMIF(#REF!,'BALANCE DE PRUEBA UNITARIO'!$C$1&'PYG (2)'!$A11,#REF!)","v":{"$error":"#REF!"}},{"$f":"SUMIF(#REF!,'BALANCE DE PRUEBA UNITARIO'!$C$1&'PYG (2)'!$A11,#REF!)","v":{"$error":"#REF!"}},{"$f":"SUMIF(#REF!,'BALANCE DE PRUEBA UNITARIO'!$C$1&'PYG (2)'!$A11,#REF!)","v":{"$error":"#REF!"}},{"$f":"SUMIF(#REF!,'BALANCE DE PRUEBA UNITARIO'!$C$1&'PYG (2)'!$A11,#REF!)","v":{"$error":"#REF!"}},{"$f":"SUMIF(#REF!,'BALANCE DE PRUEBA UNITARIO'!$C$1&'PYG (2)'!$A11,Diario[VALOR])","v":{"$error":"#REF!"}}]
[513515,{"$f":"VLOOKUP('PYG (2)'!$A12,PUC[[AUXILIAR]:[CUENTA]],2,0)","v":"ASISTENCIA TECNICA "},{"$f":"SUMIF(#REF!,'BALANCE DE PRUEBA UNITARIO'!$C$1&'PYG (2)'!$A12,Diario[CONCEPTO])","v":{"$error":"#REF!"}},{"$f":"SUMIF(#REF!,'BALANCE DE PRUEBA UNITARIO'!$C$1&'PYG (2)'!$A12,#REF!)","v":{"$error":"#REF!"}},{"$f":"SUMIF(#REF!,'BALANCE DE PRUEBA UNITARIO'!$C$1&'PYG (2)'!$A12,#REF!)","v":{"$error":"#REF!"}},{"$f":"SUMIF(#REF!,'BALANCE DE PRUEBA UNITARIO'!$C$1&'PYG (2)'!$A12,#REF!)","v":{"$error":"#REF!"}},{"$f":"SUMIF(#REF!,'BALANCE DE PRUEBA UNITARIO'!$C$1&'PYG (2)'!$A12,#REF!)","v":{"$error":"#REF!"}},{"$f":"SUMIF(#REF!,'BALANCE DE PRUEBA UNITARIO'!$C$1&'PYG (2)'!$A12,#REF!)","v":{"$error":"#REF!"}},{"$f":"SUMIF(#REF!,'BALANCE DE PRUEBA UNITARIO'!$C$1&'PYG (2)'!$A12,Diario[VALOR])","v":{"$error":"#REF!"}}]
[516000,{"$f":"VLOOKUP('PYG (2)'!$A13,PUC[[AUXILIAR]:[CUENTA]],2,0)","v":"MANTENIMIENTO Y REPARACIONES"},{"$f":"SUMIF(#REF!,'BALANCE DE PRUEBA UNITARIO'!$C$1&'PYG (2)'!$A13,Diario[CONCEPTO])","v":{"$error":"#REF!"}},{"$f":"SUMIF(#REF!,'BALANCE DE PRUEBA UNITARIO'!$C$1&'PYG (2)'!$A13,#REF!)","v":{"$error":"#REF!"}},{"$f":"SUMIF(#REF!,'BALANCE DE PRUEBA UNITARIO'!$C$1&'PYG (2)'!$A13,#REF!)","v":{"$error":"#REF!"}},{"$f":"SUMIF(#REF!,'BALANCE DE PRUEBA UNITARIO'!$C$1&'PYG (2)'!$A13,#REF!)","v":{"$error":"#REF!"}},{"$f":"SUMIF(#REF!,'BALANCE DE PRUEBA UNITARIO'!$C$1&'PYG (2)'!$A13,#REF!)","v":{"$error":"#REF!"}},{"$f":"SUMIF(#REF!,'BALANCE DE PRUEBA UNITARIO'!$C$1&'PYG (2)'!$A13,#REF!)","v":{"$error":"#REF!"}},{"$f":"SUMIF(#REF!,'BALANCE DE PRUEBA UNITARIO'!$C$1&'PYG (2)'!$A13,Diario[VALOR])","v":{"$error":"#REF!"}}]
[519005,{"$f":"VLOOKUP('PYG (2)'!$A14,PUC[[AUXILIAR]:[CUENTA]],2,0)","v":"SERVICIOS DE ASEO Y VIGILANCIA"},{"$f":"SUMIF(#REF!,'BALANCE DE PRUEBA UNITARIO'!$C$1&'PYG (2)'!$A14,Diario[CONCEPTO])","v":{"$error":"#REF!"}},{"$f":"SUMIF(#REF!,'BALANCE DE PRUEBA UNITARIO'!$C$1&'PYG (2)'!$A14,#REF!)","v":{"$error":"#REF!"}},{"$f":"SUMIF(#REF!,'BALANCE DE PRUEBA UNITARIO'!$C$1&'PYG (2)'!$A14,#REF!)","v":{"$error":"#REF!"}},{"$f":"SUMIF(#REF!,'BALANCE DE PRUEBA UNITARIO'!$C$1&'PYG (2)'!$A14,#REF!)","v":{"$error":"#REF!"}},{"$f":"SUMIF(#REF!,'BALANCE DE PRUEBA UNITARIO'!$C$1&'PYG (2)'!$A14,#REF!)","v":{"$error":"#REF!"}},{"$f":"SUMIF(#REF!,'BALANCE DE PRUEBA UNITARIO'!$C$1&'PYG (2)'!$A14,#REF!)","v":{"$error":"#REF!"}},{"$f":"SUMIF(#REF!,'BALANCE DE PRUEBA UNITARIO'!$C$1&'PYG (2)'!$A14,Diario[VALOR])","v":{"$error":"#REF!"}}]
[523595,{"$f":"VLOOKUP('PYG (2)'!$A15,PUC[[AUXILIAR]:[CUENTA]],2,0)","v":"SERVICIOS DE COMERCIALIZACION"},{"$f":"SUMIF(#REF!,'BALANCE DE PRUEBA UNITARIO'!$C$1&'PYG (2)'!$A15,Diario[CONCEPTO])","v":{"$error":"#REF!"}},{"$f":"SUMIF(#REF!,'BALANCE DE PRUEBA UNITARIO'!$C$1&'PYG (2)'!$A15,#REF!)","v":{"$error":"#REF!"}},{"$f":"SUMIF(#REF!,'BALANCE DE PRUEBA UNITARIO'!$C$1&'PYG (2)'!$A15,#REF!)","v":{"$error":"#REF!"}},{"$f":"SUMIF(#REF!,'BALANCE DE PRUEBA UNITARIO'!$C$1&'PYG (2)'!$A15,#REF!)","v":{"$error":"#REF!"}},{"$f":"SUMIF(#REF!,'BALANCE DE PRUEBA UNITARIO'!$C$1&'PYG (2)'!$A15,#REF!)","v":{"$error":"#REF!"}},{"$f":"SUMIF(#REF!,'BALANCE DE PRUEBA UNITARIO'!$C$1&'PYG (2)'!$A15,#REF!)","v":{"$error":"#REF!"}},{"$f":"SUMIF(#REF!,'BALANCE DE PRUEBA UNITARIO'!$C$1&'PYG (2)'!$A15,Diario[VALOR])","v":{"$error":"#REF!"}}]
[]
[null,"RESULTADOS DEL EJERCICIO",{"$f":"+C4-C8","v":{"$error":"#REF!"}},{"$f":"+D4-D8","v":{"$error":"#REF!"}},{"$error":"#REF!"},{"$error":"#REF!"},{"$error":"#REF!"},{"$error":"#REF!"},{"$error":"#REF!"}]

{"sheet":"REPORTES","index":12,"n_rows":19,"n_cols":1,"rows_kept":19,"cut":false,"hidden":true,"merged":[[6,0,9,2],[12,0,15,2],[18,0,21,2]]}
[]
[]
[]
[]
[]
[]
["POR CENTRO DE COSTOS"]
[]
[]
[]
[]
[]
["ACUMULADO"]
[]
[]
[]
[]
[]
["POR UNIDAD DE NEGOCIO"]